hadoop-yarn-dev mailing list archives

Site index · List index
Message view « Date » · « Thread »
Top « Date » · « Thread »
From Apache Jenkins Server <jenk...@builds.apache.org>
Subject Hadoop-Yarn-trunk - Build # 1373 - Failure
Date Sat, 07 Nov 2015 16:24:01 GMT
See https://builds.apache.org/job/Hadoop-Yarn-trunk/1373/

###################################################################################
########################## LAST 60 LINES OF THE CONSOLE ###########################
[...truncated 9391 lines...]
Tests run: 3, Failures: 0, Errors: 0, Skipped: 0, Time elapsed: 6.737 sec - in org.apache.hadoop.yarn.server.resourcemanager.metrics.TestSystemMetricsPublisher
Running org.apache.hadoop.yarn.server.resourcemanager.TestKillApplicationWithRMHA
Tests run: 4, Failures: 0, Errors: 0, Skipped: 0, Time elapsed: 26.431 sec - in org.apache.hadoop.yarn.server.resourcemanager.TestKillApplicationWithRMHA

Results :

Tests in error: 
  TestRMAuditLogger.testRMAuditLoggerWithIP:233 ยป NoClassDefFound org/apache/had...

Tests run: 1253, Failures: 0, Errors: 1, Skipped: 1

[INFO] ------------------------------------------------------------------------
[INFO] Reactor Summary:
[INFO] 
[INFO] Apache Hadoop YARN ................................ SUCCESS [  3.911 s]
[INFO] Apache Hadoop YARN API ............................ SUCCESS [04:30 min]
[INFO] Apache Hadoop YARN Common ......................... SUCCESS [03:14 min]
[INFO] Apache Hadoop YARN Server ......................... SUCCESS [  0.115 s]
[INFO] Apache Hadoop YARN Server Common .................. SUCCESS [ 52.573 s]
[INFO] Apache Hadoop YARN NodeManager .................... SUCCESS [10:08 min]
[INFO] Apache Hadoop YARN Web Proxy ...................... SUCCESS [ 35.278 s]
[INFO] Apache Hadoop YARN ApplicationHistoryService ...... SUCCESS [03:59 min]
[INFO] Apache Hadoop YARN ResourceManager ................ FAILURE [  01:01 h]
[INFO] Apache Hadoop YARN Server Tests ................... SKIPPED
[INFO] Apache Hadoop YARN Client ......................... SKIPPED
[INFO] Apache Hadoop YARN SharedCacheManager ............. SKIPPED
[INFO] Apache Hadoop YARN Applications ................... SKIPPED
[INFO] Apache Hadoop YARN DistributedShell ............... SKIPPED
[INFO] Apache Hadoop YARN Unmanaged Am Launcher .......... SKIPPED
[INFO] Apache Hadoop YARN Site ........................... SKIPPED
[INFO] Apache Hadoop YARN Registry ....................... SKIPPED
[INFO] Apache Hadoop YARN Project ........................ SKIPPED
[INFO] ------------------------------------------------------------------------
[INFO] BUILD FAILURE
[INFO] ------------------------------------------------------------------------
[INFO] Total time: 01:25 h
[INFO] Finished at: 2015-11-07T16:24:06+00:00
[INFO] Final Memory: 61M/508M
[INFO] ------------------------------------------------------------------------
[ERROR] Failed to execute goal org.apache.maven.plugins:maven-surefire-plugin:2.17:test (default-test)
on project hadoop-yarn-server-resourcemanager: There are test failures.
[ERROR] 
[ERROR] Please refer to /home/jenkins/jenkins-slave/workspace/Hadoop-Yarn-trunk/hadoop-yarn-project/hadoop-yarn/hadoop-yarn-server/hadoop-yarn-server-resourcemanager/target/surefire-reports
for the individual test results.
[ERROR] -> [Help 1]
[ERROR] 
[ERROR] To see the full stack trace of the errors, re-run Maven with the -e switch.
[ERROR] Re-run Maven using the -X switch to enable full debug logging.
[ERROR] 
[ERROR] For more information about the errors and possible solutions, please read the following
articles:
[ERROR] [Help 1] http://cwiki.apache.org/confluence/display/MAVEN/MojoFailureException
[ERROR] 
[ERROR] After correcting the problems, you can resume the build with the command
[ERROR]   mvn <goals> -rf :hadoop-yarn-server-resourcemanager
Build step 'Execute shell' marked build as failure
Archiving artifacts
Recording test results
Updating HDFS-9398
Sending e-mails to: yarn-dev@hadoop.apache.org
Email was triggered for: Failure - Any
Sending email for trigger: Failure - Any



###################################################################################
############################## FAILED TESTS (if any) ##############################
1 tests failed.
FAILED:  org.apache.hadoop.yarn.server.resourcemanager.TestRMAuditLogger.testRMAuditLoggerWithIP

Error Message:
org/apache/hadoop/ipc/ProtocolSignature

Stack Trace:
java.lang.NoClassDefFoundError: org/apache/hadoop/ipc/ProtocolSignature
	at java.net.URLClassLoader$1.run(URLClassLoader.java:366)
	at java.net.URLClassLoader$1.run(URLClassLoader.java:355)
	at java.security.AccessController.doPrivileged(Native Method)
	at java.net.URLClassLoader.findClass(URLClassLoader.java:354)
	at java.lang.ClassLoader.loadClass(ClassLoader.java:425)
	at sun.misc.Launcher$AppClassLoader.loadClass(Launcher.java:308)
	at java.lang.ClassLoader.loadClass(ClassLoader.java:358)
	at java.lang.Class.getDeclaredMethods0(Native Method)
	at java.lang.Class.privateGetDeclaredMethods(Class.java:2531)
	at java.lang.Class.privateGetPublicMethods(Class.java:2651)
	at java.lang.Class.privateGetPublicMethods(Class.java:2661)
	at java.lang.Class.getMethods(Class.java:1467)
	at sun.misc.ProxyGenerator.generateClassFile(ProxyGenerator.java:426)
	at sun.misc.ProxyGenerator.generateProxyClass(ProxyGenerator.java:323)
	at java.lang.reflect.Proxy.getProxyClass0(Proxy.java:636)
	at java.lang.reflect.Proxy.newProxyInstance(Proxy.java:722)
	at org.apache.hadoop.ipc.WritableRpcEngine.getProxy(WritableRpcEngine.java:312)
	at org.apache.hadoop.ipc.RPC.getProtocolProxy(RPC.java:581)
	at org.apache.hadoop.ipc.RPC.getProtocolProxy(RPC.java:547)
	at org.apache.hadoop.ipc.RPC.getProtocolProxy(RPC.java:494)
	at org.apache.hadoop.ipc.RPC.getProtocolProxy(RPC.java:459)
	at org.apache.hadoop.ipc.RPC.getProtocolProxy(RPC.java:645)
	at org.apache.hadoop.ipc.RPC.getProxy(RPC.java:602)
	at org.apache.hadoop.yarn.server.resourcemanager.TestRMAuditLogger.testRMAuditLoggerWithIP(TestRMAuditLogger.java:233)



Mime
  • Unnamed multipart/mixed (inline, None, 0 bytes)
View raw message