hadoop-yarn-dev mailing list archives

Site index · List index
Message view « Date » · « Thread »
Top « Date » · « Thread »
From Apache Jenkins Server <jenk...@builds.apache.org>
Subject Hadoop-Yarn-trunk-Java8 - Build # 628 - Still Failing
Date Mon, 02 Nov 2015 20:28:45 GMT
See https://builds.apache.org/job/Hadoop-Yarn-trunk-Java8/628/

###################################################################################
########################## LAST 60 LINES OF THE CONSOLE ###########################
[...truncated 5367 lines...]

Failed tests: 
  TestFairScheduler.testContinuousScheduling:4558 expected:<2> but was:<1>
  TestRMAppTransitions.testAppKilledKilled:927->assertTimesAtFinish:321 application finish
time is not greater then 0

Tests run: 1253, Failures: 2, Errors: 0, Skipped: 1

[INFO] ------------------------------------------------------------------------
[INFO] Reactor Summary:
[INFO] 
[INFO] Apache Hadoop YARN ................................ SUCCESS [  7.973 s]
[INFO] Apache Hadoop YARN API ............................ SUCCESS [02:12 min]
[INFO] Apache Hadoop YARN Common ......................... SUCCESS [03:34 min]
[INFO] Apache Hadoop YARN Server ......................... SUCCESS [  0.109 s]
[INFO] Apache Hadoop YARN Server Common .................. SUCCESS [ 59.125 s]
[INFO] Apache Hadoop YARN NodeManager .................... SUCCESS [11:59 min]
[INFO] Apache Hadoop YARN Web Proxy ...................... SUCCESS [ 31.869 s]
[INFO] Apache Hadoop YARN ApplicationHistoryService ...... SUCCESS [05:17 min]
[INFO] Apache Hadoop YARN ResourceManager ................ FAILURE [  01:13 h]
[INFO] Apache Hadoop YARN Server Tests ................... SKIPPED
[INFO] Apache Hadoop YARN Client ......................... SKIPPED
[INFO] Apache Hadoop YARN SharedCacheManager ............. SKIPPED
[INFO] Apache Hadoop YARN Applications ................... SKIPPED
[INFO] Apache Hadoop YARN DistributedShell ............... SKIPPED
[INFO] Apache Hadoop YARN Unmanaged Am Launcher .......... SKIPPED
[INFO] Apache Hadoop YARN Site ........................... SKIPPED
[INFO] Apache Hadoop YARN Registry ....................... SKIPPED
[INFO] Apache Hadoop YARN Project ........................ SKIPPED
[INFO] ------------------------------------------------------------------------
[INFO] BUILD FAILURE
[INFO] ------------------------------------------------------------------------
[INFO] Total time: 01:37 h
[INFO] Finished at: 2015-11-02T20:28:40+00:00
[INFO] Final Memory: 62M/891M
[INFO] ------------------------------------------------------------------------
[ERROR] Failed to execute goal org.apache.maven.plugins:maven-surefire-plugin:2.17:test (default-test)
on project hadoop-yarn-server-resourcemanager: There are test failures.
[ERROR] 
[ERROR] Please refer to /home/jenkins/jenkins-slave/workspace/Hadoop-Yarn-trunk-Java8/hadoop-yarn-project/hadoop-yarn/hadoop-yarn-server/hadoop-yarn-server-resourcemanager/target/surefire-reports
for the individual test results.
[ERROR] -> [Help 1]
[ERROR] 
[ERROR] To see the full stack trace of the errors, re-run Maven with the -e switch.
[ERROR] Re-run Maven using the -X switch to enable full debug logging.
[ERROR] 
[ERROR] For more information about the errors and possible solutions, please read the following
articles:
[ERROR] [Help 1] http://cwiki.apache.org/confluence/display/MAVEN/MojoFailureException
[ERROR] 
[ERROR] After correcting the problems, you can resume the build with the command
[ERROR]   mvn <goals> -rf :hadoop-yarn-server-resourcemanager
Build step 'Execute shell' marked build as failure
Archiving artifacts
Recording test results
Updating HDFS-9329
Updating HADOOP-12508
Updating HADOOP-12533
Updating MAPREDUCE-6525
Updating HDFS-8777
Sending e-mails to: yarn-dev@hadoop.apache.org
Email was triggered for: Failure - Any
Sending email for trigger: Failure - Any



###################################################################################
############################## FAILED TESTS (if any) ##############################
2 tests failed.
FAILED:  org.apache.hadoop.yarn.server.resourcemanager.rmapp.TestRMAppTransitions.testAppKilledKilled[0]

Error Message:
application finish time is not greater then 0

Stack Trace:
java.lang.AssertionError: application finish time is not greater then 0
	at org.junit.Assert.fail(Assert.java:88)
	at org.junit.Assert.assertTrue(Assert.java:41)
	at org.apache.hadoop.yarn.server.resourcemanager.rmapp.TestRMAppTransitions.assertTimesAtFinish(TestRMAppTransitions.java:321)
	at org.apache.hadoop.yarn.server.resourcemanager.rmapp.TestRMAppTransitions.testAppKilledKilled(TestRMAppTransitions.java:927)


FAILED:  org.apache.hadoop.yarn.server.resourcemanager.scheduler.fair.TestFairScheduler.testContinuousScheduling

Error Message:
expected:<2> but was:<1>

Stack Trace:
java.lang.AssertionError: expected:<2> but was:<1>
	at org.junit.Assert.fail(Assert.java:88)
	at org.junit.Assert.failNotEquals(Assert.java:743)
	at org.junit.Assert.assertEquals(Assert.java:118)
	at org.junit.Assert.assertEquals(Assert.java:555)
	at org.junit.Assert.assertEquals(Assert.java:542)
	at org.apache.hadoop.yarn.server.resourcemanager.scheduler.fair.TestFairScheduler.testContinuousScheduling(TestFairScheduler.java:4558)



Mime
  • Unnamed multipart/mixed (inline, None, 0 bytes)
View raw message