hadoop-yarn-dev mailing list archives

Site index · List index
Message view « Date » · « Thread »
Top « Date » · « Thread »
From Apache Jenkins Server <jenk...@builds.apache.org>
Subject Hadoop-Yarn-trunk-Java8 - Build # 637 - Still Failing
Date Wed, 04 Nov 2015 12:12:57 GMT
See https://builds.apache.org/job/Hadoop-Yarn-trunk-Java8/637/

###################################################################################
########################## LAST 60 LINES OF THE CONSOLE ###########################
[...truncated 5794 lines...]
Java HotSpot(TM) 64-Bit Server VM warning: ignoring option MaxPermSize=768m; support was removed
in 8.0
Running org.apache.hadoop.yarn.applications.distributedshell.TestDistributedShellWithNodeLabels
Tests run: 1, Failures: 0, Errors: 0, Skipped: 0, Time elapsed: 36.086 sec - in org.apache.hadoop.yarn.applications.distributedshell.TestDistributedShellWithNodeLabels

Results :

Tests in error: 
  TestDistributedShell.testDebugFlag:840 ยป  test timed out after 90000 milliseco...

Tests run: 14, Failures: 0, Errors: 1, Skipped: 0

[INFO] ------------------------------------------------------------------------
[INFO] Reactor Summary:
[INFO] 
[INFO] Apache Hadoop YARN ................................ SUCCESS [  3.387 s]
[INFO] Apache Hadoop YARN API ............................ SUCCESS [01:25 min]
[INFO] Apache Hadoop YARN Common ......................... SUCCESS [02:22 min]
[INFO] Apache Hadoop YARN Server ......................... SUCCESS [  0.069 s]
[INFO] Apache Hadoop YARN Server Common .................. SUCCESS [ 37.615 s]
[INFO] Apache Hadoop YARN NodeManager .................... SUCCESS [09:26 min]
[INFO] Apache Hadoop YARN Web Proxy ...................... SUCCESS [ 18.074 s]
[INFO] Apache Hadoop YARN ApplicationHistoryService ...... SUCCESS [03:17 min]
[INFO] Apache Hadoop YARN ResourceManager ................ SUCCESS [  01:00 h]
[INFO] Apache Hadoop YARN Server Tests ................... SUCCESS [01:38 min]
[INFO] Apache Hadoop YARN Client ......................... SUCCESS [07:28 min]
[INFO] Apache Hadoop YARN SharedCacheManager ............. SUCCESS [ 17.656 s]
[INFO] Apache Hadoop YARN Applications ................... SUCCESS [  0.034 s]
[INFO] Apache Hadoop YARN DistributedShell ............... FAILURE [07:51 min]
[INFO] Apache Hadoop YARN Unmanaged Am Launcher .......... SKIPPED
[INFO] Apache Hadoop YARN Site ........................... SKIPPED
[INFO] Apache Hadoop YARN Registry ....................... SKIPPED
[INFO] Apache Hadoop YARN Project ........................ SKIPPED
[INFO] ------------------------------------------------------------------------
[INFO] BUILD FAILURE
[INFO] ------------------------------------------------------------------------
[INFO] Total time: 01:35 h
[INFO] Finished at: 2015-11-04T12:12:57+00:00
[INFO] Final Memory: 88M/921M
[INFO] ------------------------------------------------------------------------
[ERROR] Failed to execute goal org.apache.maven.plugins:maven-surefire-plugin:2.17:test (default-test)
on project hadoop-yarn-applications-distributedshell: There are test failures.
[ERROR] 
[ERROR] Please refer to /home/jenkins/jenkins-slave/workspace/Hadoop-Yarn-trunk-Java8/hadoop-yarn-project/hadoop-yarn/hadoop-yarn-applications/hadoop-yarn-applications-distributedshell/target/surefire-reports
for the individual test results.
[ERROR] -> [Help 1]
[ERROR] 
[ERROR] To see the full stack trace of the errors, re-run Maven with the -e switch.
[ERROR] Re-run Maven using the -X switch to enable full debug logging.
[ERROR] 
[ERROR] For more information about the errors and possible solutions, please read the following
articles:
[ERROR] [Help 1] http://cwiki.apache.org/confluence/display/MAVEN/MojoFailureException
[ERROR] 
[ERROR] After correcting the problems, you can resume the build with the command
[ERROR]   mvn <goals> -rf :hadoop-yarn-applications-distributedshell
Build step 'Execute shell' marked build as failure
Archiving artifacts
Recording test results
Updating HADOOP-10787
Sending e-mails to: yarn-dev@hadoop.apache.org
Email was triggered for: Failure - Any
Sending email for trigger: Failure - Any



###################################################################################
############################## FAILED TESTS (if any) ##############################
1 tests failed.
FAILED:  org.apache.hadoop.yarn.applications.distributedshell.TestDistributedShell.testDebugFlag

Error Message:
test timed out after 90000 milliseconds

Stack Trace:
java.lang.Exception: test timed out after 90000 milliseconds
	at java.lang.Thread.sleep(Native Method)
	at org.apache.hadoop.yarn.applications.distributedshell.Client.monitorApplication(Client.java:734)
	at org.apache.hadoop.yarn.applications.distributedshell.Client.run(Client.java:715)
	at org.apache.hadoop.yarn.applications.distributedshell.TestDistributedShell.testDebugFlag(TestDistributedShell.java:840)



Mime
  • Unnamed multipart/mixed (inline, None, 0 bytes)
View raw message