hadoop-yarn-dev mailing list archives

Site index · List index
Message view « Date » · « Thread »
Top « Date » · « Thread »
From Apache Jenkins Server <jenk...@builds.apache.org>
Subject Build failed in Jenkins: Hadoop-Yarn-trunk-Java8 #1047
Date Fri, 12 Feb 2016 03:03:27 GMT
See <https://builds.apache.org/job/Hadoop-Yarn-trunk-Java8/1047/changes>

Changes:

[cnauroth] HADOOP-12795. KMS does not log detailed stack trace for unexpected

[wang] HADOOP-12699. TestKMS#testKMSProvider intermittently fails during 'test

------------------------------------------
[...truncated 5115 lines...]
Running org.apache.hadoop.yarn.server.resourcemanager.scheduler.capacity.TestCapacitySchedulerDynamicBehavior
Tests run: 4, Failures: 0, Errors: 0, Skipped: 0, Time elapsed: 5.765 sec - in org.apache.hadoop.yarn.server.resourcemanager.scheduler.capacity.TestCapacitySchedulerDynamicBehavior
Java HotSpot(TM) 64-Bit Server VM warning: ignoring option MaxPermSize=768m; support was removed
in 8.0
Running org.apache.hadoop.yarn.server.resourcemanager.scheduler.capacity.TestIncreaseAllocationExpirer
Tests run: 4, Failures: 0, Errors: 0, Skipped: 0, Time elapsed: 72.163 sec - in org.apache.hadoop.yarn.server.resourcemanager.scheduler.capacity.TestIncreaseAllocationExpirer
Java HotSpot(TM) 64-Bit Server VM warning: ignoring option MaxPermSize=768m; support was removed
in 8.0
Running org.apache.hadoop.yarn.server.resourcemanager.scheduler.capacity.TestLeafQueue
Tests run: 30, Failures: 0, Errors: 0, Skipped: 0, Time elapsed: 25.307 sec - in org.apache.hadoop.yarn.server.resourcemanager.scheduler.capacity.TestLeafQueue
Java HotSpot(TM) 64-Bit Server VM warning: ignoring option MaxPermSize=768m; support was removed
in 8.0
Running org.apache.hadoop.yarn.server.resourcemanager.scheduler.capacity.TestQueueMappings
Tests run: 3, Failures: 0, Errors: 0, Skipped: 0, Time elapsed: 1.871 sec - in org.apache.hadoop.yarn.server.resourcemanager.scheduler.capacity.TestQueueMappings
Java HotSpot(TM) 64-Bit Server VM warning: ignoring option MaxPermSize=768m; support was removed
in 8.0
Running org.apache.hadoop.yarn.server.resourcemanager.scheduler.capacity.TestContainerResizing
Tests run: 11, Failures: 0, Errors: 0, Skipped: 0, Time elapsed: 76.211 sec - in org.apache.hadoop.yarn.server.resourcemanager.scheduler.capacity.TestContainerResizing
Java HotSpot(TM) 64-Bit Server VM warning: ignoring option MaxPermSize=768m; support was removed
in 8.0
Running org.apache.hadoop.yarn.server.resourcemanager.scheduler.capacity.TestCapacityScheduler
Tests run: 46, Failures: 0, Errors: 0, Skipped: 0, Time elapsed: 128.054 sec - in org.apache.hadoop.yarn.server.resourcemanager.scheduler.capacity.TestCapacityScheduler
Java HotSpot(TM) 64-Bit Server VM warning: ignoring option MaxPermSize=768m; support was removed
in 8.0
Running org.apache.hadoop.yarn.server.resourcemanager.scheduler.capacity.TestQueueCapacities
Tests run: 7, Failures: 0, Errors: 0, Skipped: 0, Time elapsed: 0.185 sec - in org.apache.hadoop.yarn.server.resourcemanager.scheduler.capacity.TestQueueCapacities
Java HotSpot(TM) 64-Bit Server VM warning: ignoring option MaxPermSize=768m; support was removed
in 8.0
Running org.apache.hadoop.yarn.server.resourcemanager.scheduler.capacity.TestChildQueueOrder
Tests run: 1, Failures: 0, Errors: 0, Skipped: 0, Time elapsed: 2.267 sec - in org.apache.hadoop.yarn.server.resourcemanager.scheduler.capacity.TestChildQueueOrder
Java HotSpot(TM) 64-Bit Server VM warning: ignoring option MaxPermSize=768m; support was removed
in 8.0
Running org.apache.hadoop.yarn.server.resourcemanager.scheduler.capacity.TestQueueParsing
Tests run: 17, Failures: 0, Errors: 0, Skipped: 0, Time elapsed: 3.16 sec - in org.apache.hadoop.yarn.server.resourcemanager.scheduler.capacity.TestQueueParsing
Java HotSpot(TM) 64-Bit Server VM warning: ignoring option MaxPermSize=768m; support was removed
in 8.0
Running org.apache.hadoop.yarn.server.resourcemanager.scheduler.TestSchedulerApplicationAttempt
Tests run: 4, Failures: 0, Errors: 0, Skipped: 0, Time elapsed: 1.009 sec - in org.apache.hadoop.yarn.server.resourcemanager.scheduler.TestSchedulerApplicationAttempt
Java HotSpot(TM) 64-Bit Server VM warning: ignoring option MaxPermSize=768m; support was removed
in 8.0
Running org.apache.hadoop.yarn.server.resourcemanager.scheduler.TestSchedulerHealth
Tests run: 5, Failures: 0, Errors: 0, Skipped: 0, Time elapsed: 2.203 sec - in org.apache.hadoop.yarn.server.resourcemanager.scheduler.TestSchedulerHealth
Java HotSpot(TM) 64-Bit Server VM warning: ignoring option MaxPermSize=768m; support was removed
in 8.0
Running org.apache.hadoop.yarn.server.resourcemanager.TestRMDispatcher
Tests run: 1, Failures: 0, Errors: 0, Skipped: 0, Time elapsed: 1.749 sec - in org.apache.hadoop.yarn.server.resourcemanager.TestRMDispatcher
Java HotSpot(TM) 64-Bit Server VM warning: ignoring option MaxPermSize=768m; support was removed
in 8.0
Running org.apache.hadoop.yarn.server.resourcemanager.TestLeaderElectorService
Tests run: 6, Failures: 0, Errors: 0, Skipped: 0, Time elapsed: 37.455 sec - in org.apache.hadoop.yarn.server.resourcemanager.TestLeaderElectorService
Java HotSpot(TM) 64-Bit Server VM warning: ignoring option MaxPermSize=768m; support was removed
in 8.0
Running org.apache.hadoop.yarn.server.resourcemanager.resource.TestResources
Tests run: 2, Failures: 0, Errors: 0, Skipped: 0, Time elapsed: 0.447 sec - in org.apache.hadoop.yarn.server.resourcemanager.resource.TestResources
Java HotSpot(TM) 64-Bit Server VM warning: ignoring option MaxPermSize=768m; support was removed
in 8.0
Running org.apache.hadoop.yarn.server.resourcemanager.resource.TestResourceWeights
Tests run: 1, Failures: 0, Errors: 0, Skipped: 0, Time elapsed: 0.075 sec - in org.apache.hadoop.yarn.server.resourcemanager.resource.TestResourceWeights
Java HotSpot(TM) 64-Bit Server VM warning: ignoring option MaxPermSize=768m; support was removed
in 8.0
Running org.apache.hadoop.yarn.server.resourcemanager.TestTokenClientRMService
Tests run: 6, Failures: 0, Errors: 0, Skipped: 0, Time elapsed: 1.239 sec - in org.apache.hadoop.yarn.server.resourcemanager.TestTokenClientRMService
Java HotSpot(TM) 64-Bit Server VM warning: ignoring option MaxPermSize=768m; support was removed
in 8.0
Running org.apache.hadoop.yarn.server.resourcemanager.ahs.TestRMApplicationHistoryWriter
Tests run: 7, Failures: 0, Errors: 0, Skipped: 0, Time elapsed: 184.421 sec - in org.apache.hadoop.yarn.server.resourcemanager.ahs.TestRMApplicationHistoryWriter
Java HotSpot(TM) 64-Bit Server VM warning: ignoring option MaxPermSize=768m; support was removed
in 8.0
Running org.apache.hadoop.yarn.server.resourcemanager.webapp.TestAppPage
Tests run: 1, Failures: 0, Errors: 0, Skipped: 0, Time elapsed: 2.02 sec - in org.apache.hadoop.yarn.server.resourcemanager.webapp.TestAppPage
Java HotSpot(TM) 64-Bit Server VM warning: ignoring option MaxPermSize=768m; support was removed
in 8.0
Running org.apache.hadoop.yarn.server.resourcemanager.webapp.TestRMWebApp
Tests run: 3, Failures: 0, Errors: 0, Skipped: 0, Time elapsed: 11.425 sec - in org.apache.hadoop.yarn.server.resourcemanager.webapp.TestRMWebApp
Java HotSpot(TM) 64-Bit Server VM warning: ignoring option MaxPermSize=768m; support was removed
in 8.0
Running org.apache.hadoop.yarn.server.resourcemanager.webapp.TestRMWebServicesCapacitySched
Tests run: 7, Failures: 0, Errors: 0, Skipped: 0, Time elapsed: 13.109 sec - in org.apache.hadoop.yarn.server.resourcemanager.webapp.TestRMWebServicesCapacitySched
Java HotSpot(TM) 64-Bit Server VM warning: ignoring option MaxPermSize=768m; support was removed
in 8.0
Running org.apache.hadoop.yarn.server.resourcemanager.webapp.TestRMWebServicesNodes
Tests run: 23, Failures: 0, Errors: 0, Skipped: 0, Time elapsed: 13.367 sec - in org.apache.hadoop.yarn.server.resourcemanager.webapp.TestRMWebServicesNodes
Java HotSpot(TM) 64-Bit Server VM warning: ignoring option MaxPermSize=768m; support was removed
in 8.0
Running org.apache.hadoop.yarn.server.resourcemanager.webapp.TestRMWebServicesReservation
Tests run: 72, Failures: 0, Errors: 0, Skipped: 0, Time elapsed: 235.799 sec - in org.apache.hadoop.yarn.server.resourcemanager.webapp.TestRMWebServicesReservation
Java HotSpot(TM) 64-Bit Server VM warning: ignoring option MaxPermSize=768m; support was removed
in 8.0
Running org.apache.hadoop.yarn.server.resourcemanager.webapp.TestRMWebServices
Tests run: 20, Failures: 0, Errors: 0, Skipped: 0, Time elapsed: 12.666 sec - in org.apache.hadoop.yarn.server.resourcemanager.webapp.TestRMWebServices
Java HotSpot(TM) 64-Bit Server VM warning: ignoring option MaxPermSize=768m; support was removed
in 8.0
Running org.apache.hadoop.yarn.server.resourcemanager.webapp.TestRMWebServicesForCSWithPartitions
Tests run: 4, Failures: 0, Errors: 0, Skipped: 0, Time elapsed: 5.571 sec - in org.apache.hadoop.yarn.server.resourcemanager.webapp.TestRMWebServicesForCSWithPartitions
Java HotSpot(TM) 64-Bit Server VM warning: ignoring option MaxPermSize=768m; support was removed
in 8.0
Running org.apache.hadoop.yarn.server.resourcemanager.webapp.TestRMWebServicesApps
Tests run: 40, Failures: 0, Errors: 3, Skipped: 0, Time elapsed: 133.349 sec <<<
FAILURE! - in org.apache.hadoop.yarn.server.resourcemanager.webapp.TestRMWebServicesApps
testAppsQueryStartEnd(org.apache.hadoop.yarn.server.resourcemanager.webapp.TestRMWebServicesApps)
 Time elapsed: 0.02 sec  <<< ERROR!
com.sun.jersey.test.framework.spi.container.TestContainerException: java.net.BindException:
Address already in use
	at sun.nio.ch.Net.bind0(Native Method)
	at sun.nio.ch.Net.bind(Net.java:414)
	at sun.nio.ch.Net.bind(Net.java:406)
	at sun.nio.ch.ServerSocketChannelImpl.bind(ServerSocketChannelImpl.java:214)
	at sun.nio.ch.ServerSocketAdaptor.bind(ServerSocketAdaptor.java:74)
	at org.glassfish.grizzly.nio.transport.TCPNIOTransport.bind(TCPNIOTransport.java:413)
	at org.glassfish.grizzly.nio.transport.TCPNIOTransport.bind(TCPNIOTransport.java:384)
	at org.glassfish.grizzly.nio.transport.TCPNIOTransport.bind(TCPNIOTransport.java:375)
	at org.glassfish.grizzly.http.server.NetworkListener.start(NetworkListener.java:549)
	at org.glassfish.grizzly.http.server.HttpServer.start(HttpServer.java:255)
	at com.sun.jersey.api.container.grizzly2.GrizzlyServerFactory.createHttpServer(GrizzlyServerFactory.java:326)
	at com.sun.jersey.api.container.grizzly2.GrizzlyServerFactory.createHttpServer(GrizzlyServerFactory.java:343)
	at com.sun.jersey.test.framework.spi.container.grizzly2.web.GrizzlyWebTestContainerFactory$GrizzlyWebTestContainer.instantiateGrizzlyWebServer(GrizzlyWebTestContainerFactory.java:219)
	at com.sun.jersey.test.framework.spi.container.grizzly2.web.GrizzlyWebTestContainerFactory$GrizzlyWebTestContainer.<init>(GrizzlyWebTestContainerFactory.java:129)
	at com.sun.jersey.test.framework.spi.container.grizzly2.web.GrizzlyWebTestContainerFactory$GrizzlyWebTestContainer.<init>(GrizzlyWebTestContainerFactory.java:86)
	at com.sun.jersey.test.framework.spi.container.grizzly2.web.GrizzlyWebTestContainerFactory.create(GrizzlyWebTestContainerFactory.java:79)
	at com.sun.jersey.test.framework.JerseyTest.getContainer(JerseyTest.java:342)
	at com.sun.jersey.test.framework.JerseyTest.<init>(JerseyTest.java:217)
	at org.apache.hadoop.yarn.webapp.JerseyTestBase.<init>(JerseyTestBase.java:30)
	at org.apache.hadoop.yarn.server.resourcemanager.webapp.TestRMWebServicesApps.<init>(TestRMWebServicesApps.java:111)

testAppsDefault(org.apache.hadoop.yarn.server.resourcemanager.webapp.TestRMWebServicesApps)
 Time elapsed: 0.001 sec  <<< ERROR!
com.sun.jersey.test.framework.spi.container.TestContainerException: java.net.BindException:
Address already in use
	at sun.nio.ch.Net.bind0(Native Method)
	at sun.nio.ch.Net.bind(Net.java:414)
	at sun.nio.ch.Net.bind(Net.java:406)
	at sun.nio.ch.ServerSocketChannelImpl.bind(ServerSocketChannelImpl.java:214)
	at sun.nio.ch.ServerSocketAdaptor.bind(ServerSocketAdaptor.java:74)
	at org.glassfish.grizzly.nio.transport.TCPNIOTransport.bind(TCPNIOTransport.java:413)
	at org.glassfish.grizzly.nio.transport.TCPNIOTransport.bind(TCPNIOTransport.java:384)
	at org.glassfish.grizzly.nio.transport.TCPNIOTransport.bind(TCPNIOTransport.java:375)
	at org.glassfish.grizzly.http.server.NetworkListener.start(NetworkListener.java:549)
	at org.glassfish.grizzly.http.server.HttpServer.start(HttpServer.java:255)
	at com.sun.jersey.api.container.grizzly2.GrizzlyServerFactory.createHttpServer(GrizzlyServerFactory.java:326)
	at com.sun.jersey.api.container.grizzly2.GrizzlyServerFactory.createHttpServer(GrizzlyServerFactory.java:343)
	at com.sun.jersey.test.framework.spi.container.grizzly2.web.GrizzlyWebTestContainerFactory$GrizzlyWebTestContainer.instantiateGrizzlyWebServer(GrizzlyWebTestContainerFactory.java:219)
	at com.sun.jersey.test.framework.spi.container.grizzly2.web.GrizzlyWebTestContainerFactory$GrizzlyWebTestContainer.<init>(GrizzlyWebTestContainerFactory.java:129)
	at com.sun.jersey.test.framework.spi.container.grizzly2.web.GrizzlyWebTestContainerFactory$GrizzlyWebTestContainer.<init>(GrizzlyWebTestContainerFactory.java:86)
	at com.sun.jersey.test.framework.spi.container.grizzly2.web.GrizzlyWebTestContainerFactory.create(GrizzlyWebTestContainerFactory.java:79)
	at com.sun.jersey.test.framework.JerseyTest.getContainer(JerseyTest.java:342)
	at com.sun.jersey.test.framework.JerseyTest.<init>(JerseyTest.java:217)
	at org.apache.hadoop.yarn.webapp.JerseyTestBase.<init>(JerseyTestBase.java:30)
	at org.apache.hadoop.yarn.server.resourcemanager.webapp.TestRMWebServicesApps.<init>(TestRMWebServicesApps.java:111)

testAppsQueryFinishBeginEnd(org.apache.hadoop.yarn.server.resourcemanager.webapp.TestRMWebServicesApps)
 Time elapsed: 0 sec  <<< ERROR!
com.sun.jersey.test.framework.spi.container.TestContainerException: java.net.BindException:
Address already in use
	at sun.nio.ch.Net.bind0(Native Method)
	at sun.nio.ch.Net.bind(Net.java:414)
	at sun.nio.ch.Net.bind(Net.java:406)
	at sun.nio.ch.ServerSocketChannelImpl.bind(ServerSocketChannelImpl.java:214)
	at sun.nio.ch.ServerSocketAdaptor.bind(ServerSocketAdaptor.java:74)
	at org.glassfish.grizzly.nio.transport.TCPNIOTransport.bind(TCPNIOTransport.java:413)
	at org.glassfish.grizzly.nio.transport.TCPNIOTransport.bind(TCPNIOTransport.java:384)
	at org.glassfish.grizzly.nio.transport.TCPNIOTransport.bind(TCPNIOTransport.java:375)
	at org.glassfish.grizzly.http.server.NetworkListener.start(NetworkListener.java:549)
	at org.glassfish.grizzly.http.server.HttpServer.start(HttpServer.java:255)
	at com.sun.jersey.api.container.grizzly2.GrizzlyServerFactory.createHttpServer(GrizzlyServerFactory.java:326)
	at com.sun.jersey.api.container.grizzly2.GrizzlyServerFactory.createHttpServer(GrizzlyServerFactory.java:343)
	at com.sun.jersey.test.framework.spi.container.grizzly2.web.GrizzlyWebTestContainerFactory$GrizzlyWebTestContainer.instantiateGrizzlyWebServer(GrizzlyWebTestContainerFactory.java:219)
	at com.sun.jersey.test.framework.spi.container.grizzly2.web.GrizzlyWebTestContainerFactory$GrizzlyWebTestContainer.<init>(GrizzlyWebTestContainerFactory.java:129)
	at com.sun.jersey.test.framework.spi.container.grizzly2.web.GrizzlyWebTestContainerFactory$GrizzlyWebTestContainer.<init>(GrizzlyWebTestContainerFactory.java:86)
	at com.sun.jersey.test.framework.spi.container.grizzly2.web.GrizzlyWebTestContainerFactory.create(GrizzlyWebTestContainerFactory.java:79)
	at com.sun.jersey.test.framework.JerseyTest.getContainer(JerseyTest.java:342)
	at com.sun.jersey.test.framework.JerseyTest.<init>(JerseyTest.java:217)
	at org.apache.hadoop.yarn.webapp.JerseyTestBase.<init>(JerseyTestBase.java:30)
	at org.apache.hadoop.yarn.server.resourcemanager.webapp.TestRMWebServicesApps.<init>(TestRMWebServicesApps.java:111)

Java HotSpot(TM) 64-Bit Server VM warning: ignoring option MaxPermSize=768m; support was removed
in 8.0
Running org.apache.hadoop.yarn.server.resourcemanager.webapp.TestRMWebServicesHttpStaticUserPermissions
Tests run: 1, Failures: 0, Errors: 0, Skipped: 0, Time elapsed: 7.38 sec - in org.apache.hadoop.yarn.server.resourcemanager.webapp.TestRMWebServicesHttpStaticUserPermissions
Java HotSpot(TM) 64-Bit Server VM warning: ignoring option MaxPermSize=768m; support was removed
in 8.0
Running org.apache.hadoop.yarn.server.resourcemanager.webapp.TestRMWebServicesAppsModification
Tests run: 44, Failures: 0, Errors: 0, Skipped: 0, Time elapsed: 191.926 sec - in org.apache.hadoop.yarn.server.resourcemanager.webapp.TestRMWebServicesAppsModification
Java HotSpot(TM) 64-Bit Server VM warning: ignoring option MaxPermSize=768m; support was removed
in 8.0
Running org.apache.hadoop.yarn.server.resourcemanager.webapp.TestRMWebServicesDelegationTokenAuthentication
Tests run: 8, Failures: 0, Errors: 0, Skipped: 0, Time elapsed: 9.135 sec - in org.apache.hadoop.yarn.server.resourcemanager.webapp.TestRMWebServicesDelegationTokenAuthentication
Java HotSpot(TM) 64-Bit Server VM warning: ignoring option MaxPermSize=768m; support was removed
in 8.0
Running org.apache.hadoop.yarn.server.resourcemanager.webapp.TestRMWebServicesNodeLabels
Tests run: 1, Failures: 0, Errors: 0, Skipped: 0, Time elapsed: 4.213 sec - in org.apache.hadoop.yarn.server.resourcemanager.webapp.TestRMWebServicesNodeLabels
Java HotSpot(TM) 64-Bit Server VM warning: ignoring option MaxPermSize=768m; support was removed
in 8.0
Running org.apache.hadoop.yarn.server.resourcemanager.webapp.TestRMWebappAuthentication
Tests run: 2, Failures: 0, Errors: 0, Skipped: 0, Time elapsed: 9.242 sec - in org.apache.hadoop.yarn.server.resourcemanager.webapp.TestRMWebappAuthentication
Java HotSpot(TM) 64-Bit Server VM warning: ignoring option MaxPermSize=768m; support was removed
in 8.0
Running org.apache.hadoop.yarn.server.resourcemanager.webapp.dao.TestFairSchedulerQueueInfo
Tests run: 1, Failures: 0, Errors: 0, Skipped: 0, Time elapsed: 0.883 sec - in org.apache.hadoop.yarn.server.resourcemanager.webapp.dao.TestFairSchedulerQueueInfo
Java HotSpot(TM) 64-Bit Server VM warning: ignoring option MaxPermSize=768m; support was removed
in 8.0
Running org.apache.hadoop.yarn.server.resourcemanager.webapp.TestNodesPage
Tests run: 5, Failures: 0, Errors: 0, Skipped: 0, Time elapsed: 6.958 sec - in org.apache.hadoop.yarn.server.resourcemanager.webapp.TestNodesPage
Java HotSpot(TM) 64-Bit Server VM warning: ignoring option MaxPermSize=768m; support was removed
in 8.0
Running org.apache.hadoop.yarn.server.resourcemanager.webapp.TestRMWebAppFairScheduler
Tests run: 2, Failures: 0, Errors: 0, Skipped: 0, Time elapsed: 5.532 sec - in org.apache.hadoop.yarn.server.resourcemanager.webapp.TestRMWebAppFairScheduler
Java HotSpot(TM) 64-Bit Server VM warning: ignoring option MaxPermSize=768m; support was removed
in 8.0
Running org.apache.hadoop.yarn.server.resourcemanager.webapp.TestRMWebServicesFairScheduler
Tests run: 3, Failures: 0, Errors: 0, Skipped: 0, Time elapsed: 4.728 sec - in org.apache.hadoop.yarn.server.resourcemanager.webapp.TestRMWebServicesFairScheduler
Java HotSpot(TM) 64-Bit Server VM warning: ignoring option MaxPermSize=768m; support was removed
in 8.0
Running org.apache.hadoop.yarn.server.resourcemanager.webapp.TestRMWebServicesDelegationTokens
Tests run: 6, Failures: 0, Errors: 0, Skipped: 0, Time elapsed: 44.986 sec - in org.apache.hadoop.yarn.server.resourcemanager.webapp.TestRMWebServicesDelegationTokens
Java HotSpot(TM) 64-Bit Server VM warning: ignoring option MaxPermSize=768m; support was removed
in 8.0
Running org.apache.hadoop.yarn.server.resourcemanager.TestClientRMTokens
Tests run: 6, Failures: 0, Errors: 0, Skipped: 0, Time elapsed: 17.469 sec - in org.apache.hadoop.yarn.server.resourcemanager.TestClientRMTokens
Java HotSpot(TM) 64-Bit Server VM warning: ignoring option MaxPermSize=768m; support was removed
in 8.0
Running org.apache.hadoop.yarn.server.resourcemanager.TestAppManager
Tests run: 15, Failures: 0, Errors: 0, Skipped: 0, Time elapsed: 6.053 sec - in org.apache.hadoop.yarn.server.resourcemanager.TestAppManager
Java HotSpot(TM) 64-Bit Server VM warning: ignoring option MaxPermSize=768m; support was removed
in 8.0
Running org.apache.hadoop.yarn.server.resourcemanager.TestResourceTrackerService
Tests run: 26, Failures: 0, Errors: 0, Skipped: 0, Time elapsed: 8.615 sec - in org.apache.hadoop.yarn.server.resourcemanager.TestResourceTrackerService
Java HotSpot(TM) 64-Bit Server VM warning: ignoring option MaxPermSize=768m; support was removed
in 8.0
Running org.apache.hadoop.yarn.server.resourcemanager.placement.TestUserGroupMappingPlacementRule
Tests run: 1, Failures: 0, Errors: 0, Skipped: 0, Time elapsed: 0.684 sec - in org.apache.hadoop.yarn.server.resourcemanager.placement.TestUserGroupMappingPlacementRule
Java HotSpot(TM) 64-Bit Server VM warning: ignoring option MaxPermSize=768m; support was removed
in 8.0
Running org.apache.hadoop.yarn.server.resourcemanager.rmcontainer.TestRMContainerImpl
Tests run: 5, Failures: 0, Errors: 0, Skipped: 0, Time elapsed: 21.137 sec - in org.apache.hadoop.yarn.server.resourcemanager.rmcontainer.TestRMContainerImpl
Java HotSpot(TM) 64-Bit Server VM warning: ignoring option MaxPermSize=768m; support was removed
in 8.0
Running org.apache.hadoop.yarn.server.resourcemanager.TestApplicationMasterService
Tests run: 8, Failures: 0, Errors: 0, Skipped: 0, Time elapsed: 50.026 sec - in org.apache.hadoop.yarn.server.resourcemanager.TestApplicationMasterService
Java HotSpot(TM) 64-Bit Server VM warning: ignoring option MaxPermSize=768m; support was removed
in 8.0
Running org.apache.hadoop.yarn.server.resourcemanager.TestRMRestart
Tests run: 56, Failures: 0, Errors: 0, Skipped: 0, Time elapsed: 451.58 sec - in org.apache.hadoop.yarn.server.resourcemanager.TestRMRestart

Results :

Tests in error: 
  TestRMWebServicesApps.<init>:111->JerseyTestBase.<init>:30->JerseyTest.<init>:217->JerseyTest.getContainer:342
» TestContainer
  TestRMWebServicesApps.<init>:111->JerseyTestBase.<init>:30->JerseyTest.<init>:217->JerseyTest.getContainer:342
» TestContainer
  TestRMWebServicesApps.<init>:111->JerseyTestBase.<init>:30->JerseyTest.<init>:217->JerseyTest.getContainer:342
» TestContainer

Tests run: 1412, Failures: 0, Errors: 3, Skipped: 2

[INFO] ------------------------------------------------------------------------
[INFO] Reactor Summary:
[INFO] 
[INFO] Apache Hadoop YARN ................................ SUCCESS [  3.107 s]
[INFO] Apache Hadoop YARN API ............................ SUCCESS [01:30 min]
[INFO] Apache Hadoop YARN Common ......................... SUCCESS [02:33 min]
[INFO] Apache Hadoop YARN Server ......................... SUCCESS [  0.047 s]
[INFO] Apache Hadoop YARN Server Common .................. SUCCESS [ 36.878 s]
[INFO] Apache Hadoop YARN NodeManager .................... SUCCESS [09:46 min]
[INFO] Apache Hadoop YARN Web Proxy ...................... SUCCESS [ 16.264 s]
[INFO] Apache Hadoop YARN ApplicationHistoryService ...... SUCCESS [03:13 min]
[INFO] Apache Hadoop YARN ResourceManager ................ FAILURE [  01:07 h]
[INFO] Apache Hadoop YARN Server Tests ................... SKIPPED
[INFO] Apache Hadoop YARN Client ......................... SKIPPED
[INFO] Apache Hadoop YARN SharedCacheManager ............. SKIPPED
[INFO] Apache Hadoop YARN Timeline Plugin Storage ........ SKIPPED
[INFO] Apache Hadoop YARN Applications ................... SKIPPED
[INFO] Apache Hadoop YARN DistributedShell ............... SKIPPED
[INFO] Apache Hadoop YARN Unmanaged Am Launcher .......... SKIPPED
[INFO] Apache Hadoop YARN Site ........................... SKIPPED
[INFO] Apache Hadoop YARN Registry ....................... SKIPPED
[INFO] Apache Hadoop YARN Project ........................ SKIPPED
[INFO] ------------------------------------------------------------------------
[INFO] BUILD FAILURE
[INFO] ------------------------------------------------------------------------
[INFO] Total time: 01:25 h
[INFO] Finished at: 2016-02-12T03:03:26+00:00
[INFO] Final Memory: 61M/984M
[INFO] ------------------------------------------------------------------------
[ERROR] Failed to execute goal org.apache.maven.plugins:maven-surefire-plugin:2.17:test (default-test)
on project hadoop-yarn-server-resourcemanager: There are test failures.
[ERROR] 
[ERROR] Please refer to <https://builds.apache.org/job/Hadoop-Yarn-trunk-Java8/ws/hadoop-yarn-project/hadoop-yarn/hadoop-yarn-server/hadoop-yarn-server-resourcemanager/target/surefire-reports>
for the individual test results.
[ERROR] -> [Help 1]
[ERROR] 
[ERROR] To see the full stack trace of the errors, re-run Maven with the -e switch.
[ERROR] Re-run Maven using the -X switch to enable full debug logging.
[ERROR] 
[ERROR] For more information about the errors and possible solutions, please read the following
articles:
[ERROR] [Help 1] http://cwiki.apache.org/confluence/display/MAVEN/MojoFailureException
[ERROR] 
[ERROR] After correcting the problems, you can resume the build with the command
[ERROR]   mvn <goals> -rf :hadoop-yarn-server-resourcemanager
Build step 'Execute shell' marked build as failure
Archiving artifacts
Recording test results

Mime
View raw message