hadoop-yarn-dev mailing list archives

Site index · List index
Message view « Date » · « Thread »
Top « Date » · « Thread »
From Apache Jenkins Server <jenk...@builds.apache.org>
Subject Hadoop-Yarn-trunk - Build # 1737 - Failure
Date Mon, 08 Feb 2016 16:42:57 GMT
See https://builds.apache.org/job/Hadoop-Yarn-trunk/1737/

###################################################################################
########################## LAST 60 LINES OF THE CONSOLE ###########################
[...truncated 10719 lines...]
Tests run: 17, Failures: 0, Errors: 0, Skipped: 0, Time elapsed: 120.572 sec - in org.apache.hadoop.yarn.client.TestApplicationClientProtocolOnHA
Running org.apache.hadoop.yarn.client.TestResourceTrackerOnHA
Tests run: 1, Failures: 0, Errors: 0, Skipped: 0, Time elapsed: 8.412 sec - in org.apache.hadoop.yarn.client.TestResourceTrackerOnHA

Results :

Tests in error: 
  TestApplicationMasterServiceProtocolOnHA.initialize:55->ProtocolHATestBase.startHACluster:282
ยป ServiceFailed

Tests run: 178, Failures: 0, Errors: 1, Skipped: 0

[INFO] ------------------------------------------------------------------------
[INFO] Reactor Summary:
[INFO] 
[INFO] Apache Hadoop YARN ................................ SUCCESS [  3.340 s]
[INFO] Apache Hadoop YARN API ............................ SUCCESS [04:34 min]
[INFO] Apache Hadoop YARN Common ......................... SUCCESS [03:02 min]
[INFO] Apache Hadoop YARN Server ......................... SUCCESS [  0.095 s]
[INFO] Apache Hadoop YARN Server Common .................. SUCCESS [ 46.106 s]
[INFO] Apache Hadoop YARN NodeManager .................... SUCCESS [09:50 min]
[INFO] Apache Hadoop YARN Web Proxy ...................... SUCCESS [ 27.463 s]
[INFO] Apache Hadoop YARN ApplicationHistoryService ...... SUCCESS [04:09 min]
[INFO] Apache Hadoop YARN ResourceManager ................ SUCCESS [  01:10 h]
[INFO] Apache Hadoop YARN Server Tests ................... SUCCESS [03:07 min]
[INFO] Apache Hadoop YARN Client ......................... FAILURE [07:40 min]
[INFO] Apache Hadoop YARN SharedCacheManager ............. SKIPPED
[INFO] Apache Hadoop YARN Timeline Plugin Storage ........ SKIPPED
[INFO] Apache Hadoop YARN Applications ................... SKIPPED
[INFO] Apache Hadoop YARN DistributedShell ............... SKIPPED
[INFO] Apache Hadoop YARN Unmanaged Am Launcher .......... SKIPPED
[INFO] Apache Hadoop YARN Site ........................... SKIPPED
[INFO] Apache Hadoop YARN Registry ....................... SKIPPED
[INFO] Apache Hadoop YARN Project ........................ SKIPPED
[INFO] ------------------------------------------------------------------------
[INFO] BUILD FAILURE
[INFO] ------------------------------------------------------------------------
[INFO] Total time: 01:44 h
[INFO] Finished at: 2016-02-08T16:42:52+00:00
[INFO] Final Memory: 72M/684M
[INFO] ------------------------------------------------------------------------
[ERROR] Failed to execute goal org.apache.maven.plugins:maven-surefire-plugin:2.17:test (default-test)
on project hadoop-yarn-client: There are test failures.
[ERROR] 
[ERROR] Please refer to /home/jenkins/jenkins-slave/workspace/Hadoop-Yarn-trunk/hadoop-yarn-project/hadoop-yarn/hadoop-yarn-client/target/surefire-reports
for the individual test results.
[ERROR] -> [Help 1]
[ERROR] 
[ERROR] To see the full stack trace of the errors, re-run Maven with the -e switch.
[ERROR] Re-run Maven using the -X switch to enable full debug logging.
[ERROR] 
[ERROR] For more information about the errors and possible solutions, please read the following
articles:
[ERROR] [Help 1] http://cwiki.apache.org/confluence/display/MAVEN/MojoFailureException
[ERROR] 
[ERROR] After correcting the problems, you can resume the build with the command
[ERROR]   mvn <goals> -rf :hadoop-yarn-client
Build step 'Execute shell' marked build as failure
Archiving artifacts
Recording test results
Sending e-mails to: yarn-dev@hadoop.apache.org
Email was triggered for: Failure - Any
Sending email for trigger: Failure - Any



###################################################################################
############################## FAILED TESTS (if any) ##############################
1 tests failed.
FAILED:  org.apache.hadoop.yarn.client.TestApplicationMasterServiceProtocolOnHA.testFinishApplicationMasterOnHA

Error Message:
Error when transitioning to Active mode

Stack Trace:
org.apache.hadoop.ha.ServiceFailedException: Error when transitioning to Active mode
	at sun.nio.ch.Net.bind0(Native Method)
	at sun.nio.ch.Net.bind(Net.java:444)
	at sun.nio.ch.Net.bind(Net.java:436)
	at sun.nio.ch.ServerSocketChannelImpl.bind(ServerSocketChannelImpl.java:214)
	at sun.nio.ch.ServerSocketAdaptor.bind(ServerSocketAdaptor.java:74)
	at org.apache.hadoop.ipc.Server.bind(Server.java:469)
	at org.apache.hadoop.ipc.Server$Listener.<init>(Server.java:695)
	at org.apache.hadoop.ipc.Server.<init>(Server.java:2464)
	at org.apache.hadoop.ipc.RPC$Server.<init>(RPC.java:958)
	at org.apache.hadoop.ipc.ProtobufRpcEngine$Server.<init>(ProtobufRpcEngine.java:535)
	at org.apache.hadoop.ipc.ProtobufRpcEngine.getServer(ProtobufRpcEngine.java:510)
	at org.apache.hadoop.ipc.RPC$Builder.build(RPC.java:800)
	at org.apache.hadoop.yarn.factories.impl.pb.RpcServerFactoryPBImpl.createServer(RpcServerFactoryPBImpl.java:169)
	at org.apache.hadoop.yarn.factories.impl.pb.RpcServerFactoryPBImpl.getServer(RpcServerFactoryPBImpl.java:132)
	at org.apache.hadoop.yarn.ipc.HadoopYarnProtoRPC.getServer(HadoopYarnProtoRPC.java:65)
	at org.apache.hadoop.yarn.ipc.YarnRPC.getServer(YarnRPC.java:54)
	at org.apache.hadoop.yarn.server.resourcemanager.ResourceTrackerService.serviceStart(ResourceTrackerService.java:169)
	at org.apache.hadoop.service.AbstractService.start(AbstractService.java:193)
	at org.apache.hadoop.service.CompositeService.serviceStart(CompositeService.java:120)
	at org.apache.hadoop.yarn.server.resourcemanager.ResourceManager$RMActiveServices.serviceStart(ResourceManager.java:675)
	at org.apache.hadoop.service.AbstractService.start(AbstractService.java:193)
	at org.apache.hadoop.yarn.server.resourcemanager.ResourceManager.startActiveServices(ResourceManager.java:1093)
	at org.apache.hadoop.yarn.server.resourcemanager.ResourceManager$1.run(ResourceManager.java:1133)
	at org.apache.hadoop.yarn.server.resourcemanager.ResourceManager$1.run(ResourceManager.java:1129)
	at java.security.AccessController.doPrivileged(Native Method)
	at javax.security.auth.Subject.doAs(Subject.java:415)
	at org.apache.hadoop.security.UserGroupInformation.doAs(UserGroupInformation.java:1729)
	at org.apache.hadoop.yarn.server.resourcemanager.ResourceManager.transitionToActive(ResourceManager.java:1129)
	at org.apache.hadoop.yarn.server.resourcemanager.AdminService.transitionToActive(AdminService.java:323)
	at org.apache.hadoop.yarn.client.ProtocolHATestBase.startHACluster(ProtocolHATestBase.java:282)
	at org.apache.hadoop.yarn.client.TestApplicationMasterServiceProtocolOnHA.initialize(TestApplicationMasterServiceProtocolOnHA.java:55)



Mime
  • Unnamed multipart/mixed (inline, None, 0 bytes)
View raw message