hadoop-yarn-dev mailing list archives

Site index · List index
Message view « Date » · « Thread »
Top « Date » · « Thread »
From Apache Jenkins Server <jenk...@builds.apache.org>
Subject Build failed in Jenkins: Hadoop-Yarn-trunk #1745
Date Tue, 09 Feb 2016 23:38:05 GMT
See <https://builds.apache.org/job/Hadoop-Yarn-trunk/1745/changes>

Changes:

[aw] HDFS-9760. WebHDFS AuthFilter cannot be configured with custom

[zhz] HDFS-9775. Erasure Coding : Rename BlockRecoveryWork to

------------------------------------------
[...truncated 8762 lines...]
testAbout[0](org.apache.hadoop.yarn.server.applicationhistoryservice.webapp.TestAHSWebServices)
 Time elapsed: 0.001 sec  <<< ERROR!
com.sun.jersey.test.framework.spi.container.TestContainerException: java.net.BindException:
Address already in use
	at sun.nio.ch.Net.bind0(Native Method)
	at sun.nio.ch.Net.bind(Net.java:444)
	at sun.nio.ch.Net.bind(Net.java:436)
	at sun.nio.ch.ServerSocketChannelImpl.bind(ServerSocketChannelImpl.java:214)
	at sun.nio.ch.ServerSocketAdaptor.bind(ServerSocketAdaptor.java:74)
	at org.glassfish.grizzly.nio.transport.TCPNIOTransport.bind(TCPNIOTransport.java:413)
	at org.glassfish.grizzly.nio.transport.TCPNIOTransport.bind(TCPNIOTransport.java:384)
	at org.glassfish.grizzly.nio.transport.TCPNIOTransport.bind(TCPNIOTransport.java:375)
	at org.glassfish.grizzly.http.server.NetworkListener.start(NetworkListener.java:549)
	at org.glassfish.grizzly.http.server.HttpServer.start(HttpServer.java:255)
	at com.sun.jersey.api.container.grizzly2.GrizzlyServerFactory.createHttpServer(GrizzlyServerFactory.java:326)
	at com.sun.jersey.api.container.grizzly2.GrizzlyServerFactory.createHttpServer(GrizzlyServerFactory.java:343)
	at com.sun.jersey.test.framework.spi.container.grizzly2.web.GrizzlyWebTestContainerFactory$GrizzlyWebTestContainer.instantiateGrizzlyWebServer(GrizzlyWebTestContainerFactory.java:219)
	at com.sun.jersey.test.framework.spi.container.grizzly2.web.GrizzlyWebTestContainerFactory$GrizzlyWebTestContainer.<init>(GrizzlyWebTestContainerFactory.java:129)
	at com.sun.jersey.test.framework.spi.container.grizzly2.web.GrizzlyWebTestContainerFactory$GrizzlyWebTestContainer.<init>(GrizzlyWebTestContainerFactory.java:86)
	at com.sun.jersey.test.framework.spi.container.grizzly2.web.GrizzlyWebTestContainerFactory.create(GrizzlyWebTestContainerFactory.java:79)
	at com.sun.jersey.test.framework.JerseyTest.getContainer(JerseyTest.java:342)
	at com.sun.jersey.test.framework.JerseyTest.<init>(JerseyTest.java:217)
	at org.apache.hadoop.yarn.webapp.JerseyTestBase.<init>(JerseyTestBase.java:30)
	at org.apache.hadoop.yarn.server.applicationhistoryservice.webapp.TestAHSWebServices.<init>(TestAHSWebServices.java:162)

testSingleAttempt[0](org.apache.hadoop.yarn.server.applicationhistoryservice.webapp.TestAHSWebServices)
 Time elapsed: 0.001 sec  <<< ERROR!
com.sun.jersey.test.framework.spi.container.TestContainerException: java.net.BindException:
Address already in use
	at sun.nio.ch.Net.bind0(Native Method)
	at sun.nio.ch.Net.bind(Net.java:444)
	at sun.nio.ch.Net.bind(Net.java:436)
	at sun.nio.ch.ServerSocketChannelImpl.bind(ServerSocketChannelImpl.java:214)
	at sun.nio.ch.ServerSocketAdaptor.bind(ServerSocketAdaptor.java:74)
	at org.glassfish.grizzly.nio.transport.TCPNIOTransport.bind(TCPNIOTransport.java:413)
	at org.glassfish.grizzly.nio.transport.TCPNIOTransport.bind(TCPNIOTransport.java:384)
	at org.glassfish.grizzly.nio.transport.TCPNIOTransport.bind(TCPNIOTransport.java:375)
	at org.glassfish.grizzly.http.server.NetworkListener.start(NetworkListener.java:549)
	at org.glassfish.grizzly.http.server.HttpServer.start(HttpServer.java:255)
	at com.sun.jersey.api.container.grizzly2.GrizzlyServerFactory.createHttpServer(GrizzlyServerFactory.java:326)
	at com.sun.jersey.api.container.grizzly2.GrizzlyServerFactory.createHttpServer(GrizzlyServerFactory.java:343)
	at com.sun.jersey.test.framework.spi.container.grizzly2.web.GrizzlyWebTestContainerFactory$GrizzlyWebTestContainer.instantiateGrizzlyWebServer(GrizzlyWebTestContainerFactory.java:219)
	at com.sun.jersey.test.framework.spi.container.grizzly2.web.GrizzlyWebTestContainerFactory$GrizzlyWebTestContainer.<init>(GrizzlyWebTestContainerFactory.java:129)
	at com.sun.jersey.test.framework.spi.container.grizzly2.web.GrizzlyWebTestContainerFactory$GrizzlyWebTestContainer.<init>(GrizzlyWebTestContainerFactory.java:86)
	at com.sun.jersey.test.framework.spi.container.grizzly2.web.GrizzlyWebTestContainerFactory.create(GrizzlyWebTestContainerFactory.java:79)
	at com.sun.jersey.test.framework.JerseyTest.getContainer(JerseyTest.java:342)
	at com.sun.jersey.test.framework.JerseyTest.<init>(JerseyTest.java:217)
	at org.apache.hadoop.yarn.webapp.JerseyTestBase.<init>(JerseyTestBase.java:30)
	at org.apache.hadoop.yarn.server.applicationhistoryservice.webapp.TestAHSWebServices.<init>(TestAHSWebServices.java:162)

testSingleApp[0](org.apache.hadoop.yarn.server.applicationhistoryservice.webapp.TestAHSWebServices)
 Time elapsed: 0.001 sec  <<< ERROR!
com.sun.jersey.test.framework.spi.container.TestContainerException: java.net.BindException:
Address already in use
	at sun.nio.ch.Net.bind0(Native Method)
	at sun.nio.ch.Net.bind(Net.java:444)
	at sun.nio.ch.Net.bind(Net.java:436)
	at sun.nio.ch.ServerSocketChannelImpl.bind(ServerSocketChannelImpl.java:214)
	at sun.nio.ch.ServerSocketAdaptor.bind(ServerSocketAdaptor.java:74)
	at org.glassfish.grizzly.nio.transport.TCPNIOTransport.bind(TCPNIOTransport.java:413)
	at org.glassfish.grizzly.nio.transport.TCPNIOTransport.bind(TCPNIOTransport.java:384)
	at org.glassfish.grizzly.nio.transport.TCPNIOTransport.bind(TCPNIOTransport.java:375)
	at org.glassfish.grizzly.http.server.NetworkListener.start(NetworkListener.java:549)
	at org.glassfish.grizzly.http.server.HttpServer.start(HttpServer.java:255)
	at com.sun.jersey.api.container.grizzly2.GrizzlyServerFactory.createHttpServer(GrizzlyServerFactory.java:326)
	at com.sun.jersey.api.container.grizzly2.GrizzlyServerFactory.createHttpServer(GrizzlyServerFactory.java:343)
	at com.sun.jersey.test.framework.spi.container.grizzly2.web.GrizzlyWebTestContainerFactory$GrizzlyWebTestContainer.instantiateGrizzlyWebServer(GrizzlyWebTestContainerFactory.java:219)
	at com.sun.jersey.test.framework.spi.container.grizzly2.web.GrizzlyWebTestContainerFactory$GrizzlyWebTestContainer.<init>(GrizzlyWebTestContainerFactory.java:129)
	at com.sun.jersey.test.framework.spi.container.grizzly2.web.GrizzlyWebTestContainerFactory$GrizzlyWebTestContainer.<init>(GrizzlyWebTestContainerFactory.java:86)
	at com.sun.jersey.test.framework.spi.container.grizzly2.web.GrizzlyWebTestContainerFactory.create(GrizzlyWebTestContainerFactory.java:79)
	at com.sun.jersey.test.framework.JerseyTest.getContainer(JerseyTest.java:342)
	at com.sun.jersey.test.framework.JerseyTest.<init>(JerseyTest.java:217)
	at org.apache.hadoop.yarn.webapp.JerseyTestBase.<init>(JerseyTestBase.java:30)
	at org.apache.hadoop.yarn.server.applicationhistoryservice.webapp.TestAHSWebServices.<init>(TestAHSWebServices.java:162)

testInvalidAccept[0](org.apache.hadoop.yarn.server.applicationhistoryservice.webapp.TestAHSWebServices)
 Time elapsed: 0.001 sec  <<< ERROR!
com.sun.jersey.test.framework.spi.container.TestContainerException: java.net.BindException:
Address already in use
	at sun.nio.ch.Net.bind0(Native Method)
	at sun.nio.ch.Net.bind(Net.java:444)
	at sun.nio.ch.Net.bind(Net.java:436)
	at sun.nio.ch.ServerSocketChannelImpl.bind(ServerSocketChannelImpl.java:214)
	at sun.nio.ch.ServerSocketAdaptor.bind(ServerSocketAdaptor.java:74)
	at org.glassfish.grizzly.nio.transport.TCPNIOTransport.bind(TCPNIOTransport.java:413)
	at org.glassfish.grizzly.nio.transport.TCPNIOTransport.bind(TCPNIOTransport.java:384)
	at org.glassfish.grizzly.nio.transport.TCPNIOTransport.bind(TCPNIOTransport.java:375)
	at org.glassfish.grizzly.http.server.NetworkListener.start(NetworkListener.java:549)
	at org.glassfish.grizzly.http.server.HttpServer.start(HttpServer.java:255)
	at com.sun.jersey.api.container.grizzly2.GrizzlyServerFactory.createHttpServer(GrizzlyServerFactory.java:326)
	at com.sun.jersey.api.container.grizzly2.GrizzlyServerFactory.createHttpServer(GrizzlyServerFactory.java:343)
	at com.sun.jersey.test.framework.spi.container.grizzly2.web.GrizzlyWebTestContainerFactory$GrizzlyWebTestContainer.instantiateGrizzlyWebServer(GrizzlyWebTestContainerFactory.java:219)
	at com.sun.jersey.test.framework.spi.container.grizzly2.web.GrizzlyWebTestContainerFactory$GrizzlyWebTestContainer.<init>(GrizzlyWebTestContainerFactory.java:129)
	at com.sun.jersey.test.framework.spi.container.grizzly2.web.GrizzlyWebTestContainerFactory$GrizzlyWebTestContainer.<init>(GrizzlyWebTestContainerFactory.java:86)
	at com.sun.jersey.test.framework.spi.container.grizzly2.web.GrizzlyWebTestContainerFactory.create(GrizzlyWebTestContainerFactory.java:79)
	at com.sun.jersey.test.framework.JerseyTest.getContainer(JerseyTest.java:342)
	at com.sun.jersey.test.framework.JerseyTest.<init>(JerseyTest.java:217)
	at org.apache.hadoop.yarn.webapp.JerseyTestBase.<init>(JerseyTestBase.java:30)
	at org.apache.hadoop.yarn.server.applicationhistoryservice.webapp.TestAHSWebServices.<init>(TestAHSWebServices.java:162)

testSingleContainer[0](org.apache.hadoop.yarn.server.applicationhistoryservice.webapp.TestAHSWebServices)
 Time elapsed: 0.001 sec  <<< ERROR!
com.sun.jersey.test.framework.spi.container.TestContainerException: java.net.BindException:
Address already in use
	at sun.nio.ch.Net.bind0(Native Method)
	at sun.nio.ch.Net.bind(Net.java:444)
	at sun.nio.ch.Net.bind(Net.java:436)
	at sun.nio.ch.ServerSocketChannelImpl.bind(ServerSocketChannelImpl.java:214)
	at sun.nio.ch.ServerSocketAdaptor.bind(ServerSocketAdaptor.java:74)
	at org.glassfish.grizzly.nio.transport.TCPNIOTransport.bind(TCPNIOTransport.java:413)
	at org.glassfish.grizzly.nio.transport.TCPNIOTransport.bind(TCPNIOTransport.java:384)
	at org.glassfish.grizzly.nio.transport.TCPNIOTransport.bind(TCPNIOTransport.java:375)
	at org.glassfish.grizzly.http.server.NetworkListener.start(NetworkListener.java:549)
	at org.glassfish.grizzly.http.server.HttpServer.start(HttpServer.java:255)
	at com.sun.jersey.api.container.grizzly2.GrizzlyServerFactory.createHttpServer(GrizzlyServerFactory.java:326)
	at com.sun.jersey.api.container.grizzly2.GrizzlyServerFactory.createHttpServer(GrizzlyServerFactory.java:343)
	at com.sun.jersey.test.framework.spi.container.grizzly2.web.GrizzlyWebTestContainerFactory$GrizzlyWebTestContainer.instantiateGrizzlyWebServer(GrizzlyWebTestContainerFactory.java:219)
	at com.sun.jersey.test.framework.spi.container.grizzly2.web.GrizzlyWebTestContainerFactory$GrizzlyWebTestContainer.<init>(GrizzlyWebTestContainerFactory.java:129)
	at com.sun.jersey.test.framework.spi.container.grizzly2.web.GrizzlyWebTestContainerFactory$GrizzlyWebTestContainer.<init>(GrizzlyWebTestContainerFactory.java:86)
	at com.sun.jersey.test.framework.spi.container.grizzly2.web.GrizzlyWebTestContainerFactory.create(GrizzlyWebTestContainerFactory.java:79)
	at com.sun.jersey.test.framework.JerseyTest.getContainer(JerseyTest.java:342)
	at com.sun.jersey.test.framework.JerseyTest.<init>(JerseyTest.java:217)
	at org.apache.hadoop.yarn.webapp.JerseyTestBase.<init>(JerseyTestBase.java:30)
	at org.apache.hadoop.yarn.server.applicationhistoryservice.webapp.TestAHSWebServices.<init>(TestAHSWebServices.java:162)

testMultipleAttempts[0](org.apache.hadoop.yarn.server.applicationhistoryservice.webapp.TestAHSWebServices)
 Time elapsed: 0.002 sec  <<< ERROR!
com.sun.jersey.test.framework.spi.container.TestContainerException: java.net.BindException:
Address already in use
	at sun.nio.ch.Net.bind0(Native Method)
	at sun.nio.ch.Net.bind(Net.java:444)
	at sun.nio.ch.Net.bind(Net.java:436)
	at sun.nio.ch.ServerSocketChannelImpl.bind(ServerSocketChannelImpl.java:214)
	at sun.nio.ch.ServerSocketAdaptor.bind(ServerSocketAdaptor.java:74)
	at org.glassfish.grizzly.nio.transport.TCPNIOTransport.bind(TCPNIOTransport.java:413)
	at org.glassfish.grizzly.nio.transport.TCPNIOTransport.bind(TCPNIOTransport.java:384)
	at org.glassfish.grizzly.nio.transport.TCPNIOTransport.bind(TCPNIOTransport.java:375)
	at org.glassfish.grizzly.http.server.NetworkListener.start(NetworkListener.java:549)
	at org.glassfish.grizzly.http.server.HttpServer.start(HttpServer.java:255)
	at com.sun.jersey.api.container.grizzly2.GrizzlyServerFactory.createHttpServer(GrizzlyServerFactory.java:326)
	at com.sun.jersey.api.container.grizzly2.GrizzlyServerFactory.createHttpServer(GrizzlyServerFactory.java:343)
	at com.sun.jersey.test.framework.spi.container.grizzly2.web.GrizzlyWebTestContainerFactory$GrizzlyWebTestContainer.instantiateGrizzlyWebServer(GrizzlyWebTestContainerFactory.java:219)
	at com.sun.jersey.test.framework.spi.container.grizzly2.web.GrizzlyWebTestContainerFactory$GrizzlyWebTestContainer.<init>(GrizzlyWebTestContainerFactory.java:129)
	at com.sun.jersey.test.framework.spi.container.grizzly2.web.GrizzlyWebTestContainerFactory$GrizzlyWebTestContainer.<init>(GrizzlyWebTestContainerFactory.java:86)
	at com.sun.jersey.test.framework.spi.container.grizzly2.web.GrizzlyWebTestContainerFactory.create(GrizzlyWebTestContainerFactory.java:79)
	at com.sun.jersey.test.framework.JerseyTest.getContainer(JerseyTest.java:342)
	at com.sun.jersey.test.framework.JerseyTest.<init>(JerseyTest.java:217)
	at org.apache.hadoop.yarn.webapp.JerseyTestBase.<init>(JerseyTestBase.java:30)
	at org.apache.hadoop.yarn.server.applicationhistoryservice.webapp.TestAHSWebServices.<init>(TestAHSWebServices.java:162)

testInvalidApp[0](org.apache.hadoop.yarn.server.applicationhistoryservice.webapp.TestAHSWebServices)
 Time elapsed: 0.002 sec  <<< ERROR!
com.sun.jersey.test.framework.spi.container.TestContainerException: java.net.BindException:
Address already in use
	at sun.nio.ch.Net.bind0(Native Method)
	at sun.nio.ch.Net.bind(Net.java:444)
	at sun.nio.ch.Net.bind(Net.java:436)
	at sun.nio.ch.ServerSocketChannelImpl.bind(ServerSocketChannelImpl.java:214)
	at sun.nio.ch.ServerSocketAdaptor.bind(ServerSocketAdaptor.java:74)
	at org.glassfish.grizzly.nio.transport.TCPNIOTransport.bind(TCPNIOTransport.java:413)
	at org.glassfish.grizzly.nio.transport.TCPNIOTransport.bind(TCPNIOTransport.java:384)
	at org.glassfish.grizzly.nio.transport.TCPNIOTransport.bind(TCPNIOTransport.java:375)
	at org.glassfish.grizzly.http.server.NetworkListener.start(NetworkListener.java:549)
	at org.glassfish.grizzly.http.server.HttpServer.start(HttpServer.java:255)
	at com.sun.jersey.api.container.grizzly2.GrizzlyServerFactory.createHttpServer(GrizzlyServerFactory.java:326)
	at com.sun.jersey.api.container.grizzly2.GrizzlyServerFactory.createHttpServer(GrizzlyServerFactory.java:343)
	at com.sun.jersey.test.framework.spi.container.grizzly2.web.GrizzlyWebTestContainerFactory$GrizzlyWebTestContainer.instantiateGrizzlyWebServer(GrizzlyWebTestContainerFactory.java:219)
	at com.sun.jersey.test.framework.spi.container.grizzly2.web.GrizzlyWebTestContainerFactory$GrizzlyWebTestContainer.<init>(GrizzlyWebTestContainerFactory.java:129)
	at com.sun.jersey.test.framework.spi.container.grizzly2.web.GrizzlyWebTestContainerFactory$GrizzlyWebTestContainer.<init>(GrizzlyWebTestContainerFactory.java:86)
	at com.sun.jersey.test.framework.spi.container.grizzly2.web.GrizzlyWebTestContainerFactory.create(GrizzlyWebTestContainerFactory.java:79)
	at com.sun.jersey.test.framework.JerseyTest.getContainer(JerseyTest.java:342)
	at com.sun.jersey.test.framework.JerseyTest.<init>(JerseyTest.java:217)
	at org.apache.hadoop.yarn.webapp.JerseyTestBase.<init>(JerseyTestBase.java:30)
	at org.apache.hadoop.yarn.server.applicationhistoryservice.webapp.TestAHSWebServices.<init>(TestAHSWebServices.java:162)

Running org.apache.hadoop.yarn.server.applicationhistoryservice.webapp.TestAHSWebApp
Tests run: 9, Failures: 0, Errors: 0, Skipped: 0, Time elapsed: 6.35 sec - in org.apache.hadoop.yarn.server.applicationhistoryservice.webapp.TestAHSWebApp
Running org.apache.hadoop.yarn.server.timeline.TestGenericObjectMapper
Tests run: 2, Failures: 0, Errors: 0, Skipped: 0, Time elapsed: 0.497 sec - in org.apache.hadoop.yarn.server.timeline.TestGenericObjectMapper
Running org.apache.hadoop.yarn.server.timeline.TestMemoryTimelineStore
Tests run: 9, Failures: 0, Errors: 0, Skipped: 0, Time elapsed: 9.302 sec - in org.apache.hadoop.yarn.server.timeline.TestMemoryTimelineStore
Running org.apache.hadoop.yarn.server.timeline.security.TestTimelineAuthenticationFilterInitializer
Tests run: 1, Failures: 0, Errors: 0, Skipped: 0, Time elapsed: 0.847 sec - in org.apache.hadoop.yarn.server.timeline.security.TestTimelineAuthenticationFilterInitializer
Running org.apache.hadoop.yarn.server.timeline.security.TestTimelineACLsManager
Tests run: 6, Failures: 0, Errors: 0, Skipped: 0, Time elapsed: 1.152 sec - in org.apache.hadoop.yarn.server.timeline.security.TestTimelineACLsManager
Running org.apache.hadoop.yarn.server.timeline.security.TestTimelineAuthenticationFilter
Tests run: 6, Failures: 0, Errors: 0, Skipped: 0, Time elapsed: 11.096 sec - in org.apache.hadoop.yarn.server.timeline.security.TestTimelineAuthenticationFilter
Running org.apache.hadoop.yarn.server.timeline.TestRollingLevelDBTimelineStore
Tests run: 16, Failures: 0, Errors: 0, Skipped: 0, Time elapsed: 19.203 sec - in org.apache.hadoop.yarn.server.timeline.TestRollingLevelDBTimelineStore
Running org.apache.hadoop.yarn.server.timeline.TestLeveldbTimelineStore
Tests run: 19, Failures: 0, Errors: 0, Skipped: 0, Time elapsed: 21.847 sec - in org.apache.hadoop.yarn.server.timeline.TestLeveldbTimelineStore
Running org.apache.hadoop.yarn.server.timeline.recovery.TestLeveldbTimelineStateStore
Tests run: 2, Failures: 0, Errors: 0, Skipped: 0, Time elapsed: 1.264 sec - in org.apache.hadoop.yarn.server.timeline.recovery.TestLeveldbTimelineStateStore
Running org.apache.hadoop.yarn.server.timeline.webapp.TestTimelineWebServicesWithSSL
Tests run: 1, Failures: 0, Errors: 0, Skipped: 0, Time elapsed: 4.607 sec - in org.apache.hadoop.yarn.server.timeline.webapp.TestTimelineWebServicesWithSSL
Running org.apache.hadoop.yarn.server.timeline.webapp.TestTimelineWebServices
Tests run: 28, Failures: 0, Errors: 0, Skipped: 0, Time elapsed: 39.786 sec - in org.apache.hadoop.yarn.server.timeline.webapp.TestTimelineWebServices
Running org.apache.hadoop.yarn.server.timeline.TestTimelineDataManager
Tests run: 4, Failures: 0, Errors: 0, Skipped: 0, Time elapsed: 5.802 sec - in org.apache.hadoop.yarn.server.timeline.TestTimelineDataManager
Running org.apache.hadoop.yarn.server.timeline.TestRollingLevelDB
Tests run: 2, Failures: 0, Errors: 0, Skipped: 0, Time elapsed: 1.351 sec - in org.apache.hadoop.yarn.server.timeline.TestRollingLevelDB

Results :

Tests in error: 
  TestAHSWebServices.<init>:162->JerseyTestBase.<init>:30->JerseyTest.<init>:217->JerseyTest.getContainer:342
» TestContainer
  TestAHSWebServices.<init>:162->JerseyTestBase.<init>:30->JerseyTest.<init>:217->JerseyTest.getContainer:342
» TestContainer
  TestAHSWebServices.<init>:162->JerseyTestBase.<init>:30->JerseyTest.<init>:217->JerseyTest.getContainer:342
» TestContainer
  TestAHSWebServices.<init>:162->JerseyTestBase.<init>:30->JerseyTest.<init>:217->JerseyTest.getContainer:342
» TestContainer
  TestAHSWebServices.<init>:162->JerseyTestBase.<init>:30->JerseyTest.<init>:217->JerseyTest.getContainer:342
» TestContainer
  TestAHSWebServices.<init>:162->JerseyTestBase.<init>:30->JerseyTest.<init>:217->JerseyTest.getContainer:342
» TestContainer
  TestAHSWebServices.<init>:162->JerseyTestBase.<init>:30->JerseyTest.<init>:217->JerseyTest.getContainer:342
» TestContainer
  TestAHSWebServices.<init>:162->JerseyTestBase.<init>:30->JerseyTest.<init>:217->JerseyTest.getContainer:342
» TestContainer
  TestAHSWebServices.<init>:162->JerseyTestBase.<init>:30->JerseyTest.<init>:217->JerseyTest.getContainer:342
» TestContainer
  TestAHSWebServices.<init>:162->JerseyTestBase.<init>:30->JerseyTest.<init>:217->JerseyTest.getContainer:342
» TestContainer

Tests run: 197, Failures: 0, Errors: 10, Skipped: 0

[INFO] ------------------------------------------------------------------------
[INFO] Reactor Summary:
[INFO] 
[INFO] Apache Hadoop YARN ................................ SUCCESS [  3.537 s]
[INFO] Apache Hadoop YARN API ............................ SUCCESS [04:21 min]
[INFO] Apache Hadoop YARN Common ......................... SUCCESS [03:01 min]
[INFO] Apache Hadoop YARN Server ......................... SUCCESS [  0.090 s]
[INFO] Apache Hadoop YARN Server Common .................. SUCCESS [ 47.281 s]
[INFO] Apache Hadoop YARN NodeManager .................... SUCCESS [09:41 min]
[INFO] Apache Hadoop YARN Web Proxy ...................... SUCCESS [ 26.245 s]
[INFO] Apache Hadoop YARN ApplicationHistoryService ...... FAILURE [02:51 min]
[INFO] Apache Hadoop YARN ResourceManager ................ SKIPPED
[INFO] Apache Hadoop YARN Server Tests ................... SKIPPED
[INFO] Apache Hadoop YARN Client ......................... SKIPPED
[INFO] Apache Hadoop YARN SharedCacheManager ............. SKIPPED
[INFO] Apache Hadoop YARN Timeline Plugin Storage ........ SKIPPED
[INFO] Apache Hadoop YARN Applications ................... SKIPPED
[INFO] Apache Hadoop YARN DistributedShell ............... SKIPPED
[INFO] Apache Hadoop YARN Unmanaged Am Launcher .......... SKIPPED
[INFO] Apache Hadoop YARN Site ........................... SKIPPED
[INFO] Apache Hadoop YARN Registry ....................... SKIPPED
[INFO] Apache Hadoop YARN Project ........................ SKIPPED
[INFO] ------------------------------------------------------------------------
[INFO] BUILD FAILURE
[INFO] ------------------------------------------------------------------------
[INFO] Total time: 21:14 min
[INFO] Finished at: 2016-02-09T23:38:04+00:00
[INFO] Final Memory: 87M/832M
[INFO] ------------------------------------------------------------------------
[ERROR] Failed to execute goal org.apache.maven.plugins:maven-surefire-plugin:2.17:test (default-test)
on project hadoop-yarn-server-applicationhistoryservice: There are test failures.
[ERROR] 
[ERROR] Please refer to <https://builds.apache.org/job/Hadoop-Yarn-trunk/ws/hadoop-yarn-project/hadoop-yarn/hadoop-yarn-server/hadoop-yarn-server-applicationhistoryservice/target/surefire-reports>
for the individual test results.
[ERROR] -> [Help 1]
[ERROR] 
[ERROR] To see the full stack trace of the errors, re-run Maven with the -e switch.
[ERROR] Re-run Maven using the -X switch to enable full debug logging.
[ERROR] 
[ERROR] For more information about the errors and possible solutions, please read the following
articles:
[ERROR] [Help 1] http://cwiki.apache.org/confluence/display/MAVEN/MojoFailureException
[ERROR] 
[ERROR] After correcting the problems, you can resume the build with the command
[ERROR]   mvn <goals> -rf :hadoop-yarn-server-applicationhistoryservice
Build step 'Execute shell' marked build as failure
Archiving artifacts
Recording test results

Mime
View raw message