hadoop-yarn-dev mailing list archives

Site index · List index
Message view « Date » · « Thread »
Top « Date » · « Thread »
From Apache Jenkins Server <jenk...@builds.apache.org>
Subject Build failed in Jenkins: Hadoop-Yarn-trunk-Java8 #1006
Date Wed, 03 Feb 2016 03:08:49 GMT
See <https://builds.apache.org/job/Hadoop-Yarn-trunk-Java8/1006/changes>

Changes:

[junping_du] Adding release 2.6.5 to CHANGES.txt

[vinayakumarb] HDFS-9715. Check storage ID uniqueness on datanode startup (Contributed

------------------------------------------
[...truncated 3693 lines...]
[INFO] Apache Hadoop Common .............................. SUCCESS [ 45.257 s]
[INFO] Apache Hadoop NFS ................................. SUCCESS [  1.697 s]
[INFO] Apache Hadoop KMS ................................. SUCCESS [  5.511 s]
[INFO] Apache Hadoop Common Project ...................... SUCCESS [  0.093 s]
[INFO] Apache Hadoop HDFS Client ......................... SUCCESS [ 28.544 s]
[INFO] Apache Hadoop HDFS ................................ SUCCESS [ 36.965 s]
[INFO] Apache Hadoop HDFS Native Client .................. SUCCESS [  0.540 s]
[INFO] Apache Hadoop HttpFS .............................. SUCCESS [ 24.255 s]
[INFO] Apache Hadoop HDFS BookKeeper Journal ............. SUCCESS [  1.355 s]
[INFO] Apache Hadoop HDFS-NFS ............................ SUCCESS [  1.315 s]
[INFO] Apache Hadoop HDFS Project ........................ SUCCESS [  0.044 s]
[INFO] Apache Hadoop YARN ................................ SUCCESS [  0.037 s]
[INFO] Apache Hadoop YARN API ............................ SUCCESS [ 11.201 s]
[INFO] Apache Hadoop YARN Common ......................... SUCCESS [ 10.124 s]
[INFO] Apache Hadoop YARN Server ......................... SUCCESS [  0.119 s]
[INFO] Apache Hadoop YARN Server Common .................. SUCCESS [  2.754 s]
[INFO] Apache Hadoop YARN NodeManager .................... SUCCESS [  5.738 s]
[INFO] Apache Hadoop YARN Web Proxy ...................... SUCCESS [  0.909 s]
[INFO] Apache Hadoop YARN ApplicationHistoryService ...... SUCCESS [  1.754 s]
[INFO] Apache Hadoop YARN ResourceManager ................ SUCCESS [ 12.104 s]
[INFO] Apache Hadoop YARN Server Tests ................... SUCCESS [  1.286 s]
[INFO] Apache Hadoop YARN Client ......................... SUCCESS [  2.095 s]
[INFO] Apache Hadoop YARN SharedCacheManager ............. SUCCESS [  0.823 s]
[INFO] Apache Hadoop YARN Timeline Plugin Storage ........ SUCCESS [  1.671 s]
[INFO] Apache Hadoop YARN Applications ................... SUCCESS [  0.078 s]
[INFO] Apache Hadoop YARN DistributedShell ............... SUCCESS [  0.814 s]
[INFO] Apache Hadoop YARN Unmanaged Am Launcher .......... SUCCESS [  0.550 s]
[INFO] Apache Hadoop YARN Site ........................... SUCCESS [  0.144 s]
[INFO] Apache Hadoop YARN Registry ....................... SUCCESS [  1.341 s]
[INFO] Apache Hadoop YARN Project ........................ SUCCESS [  0.148 s]
[INFO] Apache Hadoop MapReduce Client .................... SUCCESS [  0.146 s]
[INFO] Apache Hadoop MapReduce Core ...................... SUCCESS [  6.806 s]
[INFO] Apache Hadoop MapReduce Common .................... SUCCESS [  4.076 s]
[INFO] Apache Hadoop MapReduce Shuffle ................... SUCCESS [  0.777 s]
[INFO] Apache Hadoop MapReduce App ....................... SUCCESS [  3.870 s]
[INFO] Apache Hadoop MapReduce HistoryServer ............. SUCCESS [  1.898 s]
[INFO] Apache Hadoop MapReduce JobClient ................. SUCCESS [  5.304 s]
[INFO] Apache Hadoop MapReduce HistoryServer Plugins ..... SUCCESS [  0.555 s]
[INFO] Apache Hadoop MapReduce NativeTask ................ SUCCESS [  1.036 s]
[INFO] Apache Hadoop MapReduce Examples .................. SUCCESS [  1.649 s]
[INFO] Apache Hadoop MapReduce ........................... SUCCESS [  0.139 s]
[INFO] Apache Hadoop MapReduce Streaming ................. SUCCESS [  1.444 s]
[INFO] Apache Hadoop Distributed Copy .................... SUCCESS [  2.494 s]
[INFO] Apache Hadoop Archives ............................ SUCCESS [  0.454 s]
[INFO] Apache Hadoop Archive Logs ........................ SUCCESS [  0.512 s]
[INFO] Apache Hadoop Rumen ............................... SUCCESS [  1.060 s]
[INFO] Apache Hadoop Gridmix ............................. SUCCESS [  1.435 s]
[INFO] Apache Hadoop Data Join ........................... SUCCESS [  0.371 s]
[INFO] Apache Hadoop Ant Tasks ........................... SUCCESS [  0.237 s]
[INFO] Apache Hadoop Extras .............................. SUCCESS [  0.609 s]
[INFO] Apache Hadoop Pipes ............................... SUCCESS [  0.081 s]
[INFO] Apache Hadoop OpenStack support ................... SUCCESS [  0.540 s]
[INFO] Apache Hadoop Amazon Web Services support ......... SUCCESS [  0.552 s]
[INFO] Apache Hadoop Azure support ....................... SUCCESS [  1.699 s]
[INFO] Apache Hadoop Client .............................. SUCCESS [  1.363 s]
[INFO] Apache Hadoop Mini-Cluster ........................ SUCCESS [  0.260 s]
[INFO] Apache Hadoop Scheduler Load Simulator ............ SUCCESS [  1.482 s]
[INFO] Apache Hadoop Tools Dist .......................... SUCCESS [  0.463 s]
[INFO] Apache Hadoop Kafka Library support ............... SUCCESS [  0.226 s]
[INFO] Apache Hadoop Tools ............................... SUCCESS [  0.039 s]
[INFO] Apache Hadoop Distribution ........................ SUCCESS [  0.074 s]
[INFO] ------------------------------------------------------------------------
[INFO] BUILD SUCCESS
[INFO] ------------------------------------------------------------------------
[INFO] Total time: 04:30 min
[INFO] Finished at: 2016-02-03T02:57:18+00:00
[INFO] Final Memory: 256M/1017M
[INFO] ------------------------------------------------------------------------
+ cd hadoop-yarn-project
+ /home/jenkins/tools/maven/latest/bin/mvn clean verify checkstyle:checkstyle findbugs:findbugs
-Pdist -Pnative -Dtar -Dmaven.javadoc.skip=true
Java HotSpot(TM) 64-Bit Server VM warning: ignoring option MaxPermSize=768m; support was removed
in 8.0
[INFO] Scanning for projects...
[INFO] ------------------------------------------------------------------------
[INFO] Reactor Build Order:
[INFO] 
[INFO] Apache Hadoop YARN
[INFO] Apache Hadoop YARN API
[INFO] Apache Hadoop YARN Common
[INFO] Apache Hadoop YARN Server
[INFO] Apache Hadoop YARN Server Common
[INFO] Apache Hadoop YARN NodeManager
[INFO] Apache Hadoop YARN Web Proxy
[INFO] Apache Hadoop YARN ApplicationHistoryService
[INFO] Apache Hadoop YARN ResourceManager
[INFO] Apache Hadoop YARN Server Tests
[INFO] Apache Hadoop YARN Client
[INFO] Apache Hadoop YARN SharedCacheManager
[INFO] Apache Hadoop YARN Timeline Plugin Storage
[INFO] Apache Hadoop YARN Applications
[INFO] Apache Hadoop YARN DistributedShell
[INFO] Apache Hadoop YARN Unmanaged Am Launcher
[INFO] Apache Hadoop YARN Site
[INFO] Apache Hadoop YARN Registry
[INFO] Apache Hadoop YARN Project
[INFO] 
[INFO] Using the builder org.apache.maven.lifecycle.internal.builder.singlethreaded.SingleThreadedBuilder
with a thread count of 1
[INFO]                                                                         
[INFO] ------------------------------------------------------------------------
[INFO] Building Apache Hadoop YARN 3.0.0-SNAPSHOT
[INFO] ------------------------------------------------------------------------
[INFO] 
[INFO] --- maven-clean-plugin:2.5:clean (default-clean) @ hadoop-yarn ---
[INFO] Deleting <https://builds.apache.org/job/Hadoop-Yarn-trunk-Java8/ws/hadoop-yarn-project/hadoop-yarn/target>
[INFO] 
[INFO] --- maven-antrun-plugin:1.7:run (create-testdirs) @ hadoop-yarn ---
[INFO] Executing tasks

main:
    [mkdir] Created dir: <https://builds.apache.org/job/Hadoop-Yarn-trunk-Java8/ws/hadoop-yarn-project/hadoop-yarn/target/test-dir>
[INFO] Executed tasks
[INFO] 
[INFO] --- maven-source-plugin:2.3:jar-no-fork (hadoop-java-sources) @ hadoop-yarn ---
[INFO] 
[INFO] --- maven-source-plugin:2.3:test-jar-no-fork (hadoop-java-sources) @ hadoop-yarn ---
[INFO] 
[INFO] --- maven-enforcer-plugin:1.3.1:enforce (dist-enforce) @ hadoop-yarn ---
[INFO] 
[INFO] --- maven-site-plugin:3.4:attach-descriptor (attach-descriptor) @ hadoop-yarn ---
[INFO] 
[INFO] --- maven-javadoc-plugin:2.8.1:jar (module-javadocs) @ hadoop-yarn ---
[INFO] Skipping javadoc generation
[INFO] 
[INFO] --- maven-enforcer-plugin:1.3.1:enforce (depcheck) @ hadoop-yarn ---
[INFO] 
[INFO] --- maven-checkstyle-plugin:2.15:checkstyle (default-cli) @ hadoop-yarn ---
[INFO] 
[INFO] --- findbugs-maven-plugin:3.0.0:findbugs (default-cli) @ hadoop-yarn ---
[INFO]                                                                         
[INFO] ------------------------------------------------------------------------
[INFO] Building Apache Hadoop YARN API 3.0.0-SNAPSHOT
[INFO] ------------------------------------------------------------------------
[INFO] 
[INFO] --- maven-clean-plugin:2.5:clean (default-clean) @ hadoop-yarn-api ---
[INFO] Deleting <https://builds.apache.org/job/Hadoop-Yarn-trunk-Java8/ws/hadoop-yarn-project/hadoop-yarn/hadoop-yarn-api/target>
[INFO] 
[INFO] --- maven-antrun-plugin:1.7:run (create-testdirs) @ hadoop-yarn-api ---
[INFO] Executing tasks

main:
    [mkdir] Created dir: <https://builds.apache.org/job/Hadoop-Yarn-trunk-Java8/ws/hadoop-yarn-project/hadoop-yarn/hadoop-yarn-api/target/test-dir>
[INFO] Executed tasks
[INFO] 
[INFO] --- hadoop-maven-plugins:3.0.0-SNAPSHOT:protoc (compile-protoc) @ hadoop-yarn-api ---
[INFO] Wrote protoc checksums to file <https://builds.apache.org/job/Hadoop-Yarn-trunk-Java8/ws/hadoop-yarn-project/hadoop-yarn/hadoop-yarn-api/target/hadoop-maven-plugins-protoc-checksums.json>
[INFO] 
[INFO] --- maven-resources-plugin:2.6:resources (default-resources) @ hadoop-yarn-api ---
[INFO] Using 'UTF-8' encoding to copy filtered resources.
[INFO] Copying 1 resource
[INFO] 
[INFO] --- maven-compiler-plugin:3.1:compile (default-compile) @ hadoop-yarn-api ---
[INFO] Changes detected - recompiling the module!
[INFO] Compiling 235 source files to <https://builds.apache.org/job/Hadoop-Yarn-trunk-Java8/ws/hadoop-yarn-project/hadoop-yarn/hadoop-yarn-api/target/classes>
[INFO] 
[INFO] --- maven-resources-plugin:2.6:testResources (default-testResources) @ hadoop-yarn-api
---
[INFO] Using 'UTF-8' encoding to copy filtered resources.
[INFO] skip non existing resourceDirectory <https://builds.apache.org/job/Hadoop-Yarn-trunk-Java8/ws/hadoop-yarn-project/hadoop-yarn/hadoop-yarn-api/src/test/resources>
[INFO] 
[INFO] --- maven-compiler-plugin:3.1:testCompile (default-testCompile) @ hadoop-yarn-api ---
[INFO] Changes detected - recompiling the module!
[INFO] Compiling 1 source file to <https://builds.apache.org/job/Hadoop-Yarn-trunk-Java8/ws/hadoop-yarn-project/hadoop-yarn/hadoop-yarn-api/target/test-classes>
[INFO] 
[INFO] --- maven-jar-plugin:2.5:test-jar (default) @ hadoop-yarn-api ---
[INFO] Building jar: <https://builds.apache.org/job/Hadoop-Yarn-trunk-Java8/ws/hadoop-yarn-project/hadoop-yarn/hadoop-yarn-api/target/hadoop-yarn-api-3.0.0-SNAPSHOT-tests.jar>
[INFO] 
[INFO] --- maven-surefire-plugin:2.17:test (default-test) @ hadoop-yarn-api ---
[INFO] Surefire report directory: <https://builds.apache.org/job/Hadoop-Yarn-trunk-Java8/ws/hadoop-yarn-project/hadoop-yarn/hadoop-yarn-api/target/surefire-reports>

-------------------------------------------------------
 T E S T S
-------------------------------------------------------

-------------------------------------------------------
 T E S T S
-------------------------------------------------------
Java HotSpot(TM) 64-Bit Server VM warning: ignoring option MaxPermSize=768m; support was removed
in 8.0
Running org.apache.hadoop.yarn.conf.TestYarnConfigurationFields
Tests run: 2, Failures: 0, Errors: 0, Skipped: 0, Time elapsed: 0.851 sec - in org.apache.hadoop.yarn.conf.TestYarnConfigurationFields

Results :

Tests run: 2, Failures: 0, Errors: 0, Skipped: 0

[INFO] 
[INFO] --- maven-jar-plugin:2.5:jar (default-jar) @ hadoop-yarn-api ---
[INFO] Building jar: <https://builds.apache.org/job/Hadoop-Yarn-trunk-Java8/ws/hadoop-yarn-project/hadoop-yarn/hadoop-yarn-api/target/hadoop-yarn-api-3.0.0-SNAPSHOT.jar>
[INFO] 
[INFO] --- maven-source-plugin:2.3:jar-no-fork (hadoop-java-sources) @ hadoop-yarn-api ---
[INFO] Building jar: <https://builds.apache.org/job/Hadoop-Yarn-trunk-Java8/ws/hadoop-yarn-project/hadoop-yarn/hadoop-yarn-api/target/hadoop-yarn-api-3.0.0-SNAPSHOT-sources.jar>
[INFO] 
[INFO] --- maven-source-plugin:2.3:test-jar-no-fork (hadoop-java-sources) @ hadoop-yarn-api
---
[INFO] Building jar: <https://builds.apache.org/job/Hadoop-Yarn-trunk-Java8/ws/hadoop-yarn-project/hadoop-yarn/hadoop-yarn-api/target/hadoop-yarn-api-3.0.0-SNAPSHOT-test-sources.jar>
[INFO] 
[INFO] --- maven-enforcer-plugin:1.3.1:enforce (dist-enforce) @ hadoop-yarn-api ---
[INFO] 
[INFO] --- maven-site-plugin:3.4:attach-descriptor (attach-descriptor) @ hadoop-yarn-api ---
[INFO] 
[INFO] --- maven-javadoc-plugin:2.8.1:jar (module-javadocs) @ hadoop-yarn-api ---
[INFO] Skipping javadoc generation
[INFO] 
[INFO] --- maven-enforcer-plugin:1.3.1:enforce (depcheck) @ hadoop-yarn-api ---
[INFO] 
[INFO] --- maven-checkstyle-plugin:2.15:checkstyle (default-cli) @ hadoop-yarn-api ---
[INFO] There are 38050 errors reported by Checkstyle 6.6 with checkstyle/checkstyle.xml ruleset.
[WARNING] Unable to locate Source XRef to link to - DISABLED
[INFO] 
[INFO] --- findbugs-maven-plugin:3.0.0:findbugs (default-cli) @ hadoop-yarn-api ---
[INFO] Fork Value is true
[INFO] ------------------------------------------------------------------------
[INFO] Reactor Summary:
[INFO] 
[INFO] Apache Hadoop YARN ................................ SUCCESS [  8.225 s]
[INFO] Apache Hadoop YARN API ............................ FAILURE [11:16 min]
[INFO] Apache Hadoop YARN Common ......................... SKIPPED
[INFO] Apache Hadoop YARN Server ......................... SKIPPED
[INFO] Apache Hadoop YARN Server Common .................. SKIPPED
[INFO] Apache Hadoop YARN NodeManager .................... SKIPPED
[INFO] Apache Hadoop YARN Web Proxy ...................... SKIPPED
[INFO] Apache Hadoop YARN ApplicationHistoryService ...... SKIPPED
[INFO] Apache Hadoop YARN ResourceManager ................ SKIPPED
[INFO] Apache Hadoop YARN Server Tests ................... SKIPPED
[INFO] Apache Hadoop YARN Client ......................... SKIPPED
[INFO] Apache Hadoop YARN SharedCacheManager ............. SKIPPED
[INFO] Apache Hadoop YARN Timeline Plugin Storage ........ SKIPPED
[INFO] Apache Hadoop YARN Applications ................... SKIPPED
[INFO] Apache Hadoop YARN DistributedShell ............... SKIPPED
[INFO] Apache Hadoop YARN Unmanaged Am Launcher .......... SKIPPED
[INFO] Apache Hadoop YARN Site ........................... SKIPPED
[INFO] Apache Hadoop YARN Registry ....................... SKIPPED
[INFO] Apache Hadoop YARN Project ........................ SKIPPED
[INFO] ------------------------------------------------------------------------
[INFO] BUILD FAILURE
[INFO] ------------------------------------------------------------------------
[INFO] Total time: 11:27 min
[INFO] Finished at: 2016-02-03T03:08:51+00:00
[INFO] Final Memory: 75M/1191M
[INFO] ------------------------------------------------------------------------
[ERROR] Failed to execute goal org.codehaus.mojo:findbugs-maven-plugin:3.0.0:findbugs (default-cli)
on project hadoop-yarn-api: Execution default-cli of goal org.codehaus.mojo:findbugs-maven-plugin:3.0.0:findbugs
failed: Timeout: killed the sub-process -> [Help 1]
[ERROR] 
[ERROR] To see the full stack trace of the errors, re-run Maven with the -e switch.
[ERROR] Re-run Maven using the -X switch to enable full debug logging.
[ERROR] 
[ERROR] For more information about the errors and possible solutions, please read the following
articles:
[ERROR] [Help 1] http://cwiki.apache.org/confluence/display/MAVEN/PluginExecutionException
[ERROR] 
[ERROR] After correcting the problems, you can resume the build with the command
[ERROR]   mvn <goals> -rf :hadoop-yarn-api
Build step 'Execute shell' marked build as failure
Archiving artifacts
Recording test results

Mime
View raw message