hadoop-yarn-dev mailing list archives

Site index · List index
Message view « Date » · « Thread »
Top « Date » · « Thread »
From Apache Jenkins Server <jenk...@builds.apache.org>
Subject Hadoop-Yarn-trunk-Java8 - Build # 1041 - Failure
Date Thu, 11 Feb 2016 02:55:37 GMT
See https://builds.apache.org/job/Hadoop-Yarn-trunk-Java8/1041/

###################################################################################
########################## LAST 60 LINES OF THE CONSOLE ###########################
[...truncated 5362 lines...]
Tests in error: 
  TestApplicationPriority.testUpdateInvalidPriorityAtRuntime:369 » ServiceConfiguration
  TestApplicationPriority.testRMRestartWithChangeInPriority:419 » NullPointer
  TestApplicationPriority.testApplicationPriorityAllocation:167 » NullPointer
  TestApplicationPriority.testApplicationPriorityAllocationWithChangeInPriority:472 » NullPointer
  TestApplicationPriority.testOrderOfActivatingThePriorityApplicationOnRMRestart:626 » NullPointer
  TestApplicationPriority.testPriorityWithPendingApplications:252 » NullPointer
  TestApplicationPriority.testUpdatePriorityAtRuntime:335 » NullPointer

Tests run: 1409, Failures: 0, Errors: 7, Skipped: 2

[INFO] ------------------------------------------------------------------------
[INFO] Reactor Summary:
[INFO] 
[INFO] Apache Hadoop YARN ................................ SUCCESS [  3.245 s]
[INFO] Apache Hadoop YARN API ............................ SUCCESS [01:18 min]
[INFO] Apache Hadoop YARN Common ......................... SUCCESS [02:34 min]
[INFO] Apache Hadoop YARN Server ......................... SUCCESS [  0.053 s]
[INFO] Apache Hadoop YARN Server Common .................. SUCCESS [ 35.882 s]
[INFO] Apache Hadoop YARN NodeManager .................... SUCCESS [09:41 min]
[INFO] Apache Hadoop YARN Web Proxy ...................... SUCCESS [ 17.744 s]
[INFO] Apache Hadoop YARN ApplicationHistoryService ...... SUCCESS [03:11 min]
[INFO] Apache Hadoop YARN ResourceManager ................ FAILURE [  01:05 h]
[INFO] Apache Hadoop YARN Server Tests ................... SKIPPED
[INFO] Apache Hadoop YARN Client ......................... SKIPPED
[INFO] Apache Hadoop YARN SharedCacheManager ............. SKIPPED
[INFO] Apache Hadoop YARN Timeline Plugin Storage ........ SKIPPED
[INFO] Apache Hadoop YARN Applications ................... SKIPPED
[INFO] Apache Hadoop YARN DistributedShell ............... SKIPPED
[INFO] Apache Hadoop YARN Unmanaged Am Launcher .......... SKIPPED
[INFO] Apache Hadoop YARN Site ........................... SKIPPED
[INFO] Apache Hadoop YARN Registry ....................... SKIPPED
[INFO] Apache Hadoop YARN Project ........................ SKIPPED
[INFO] ------------------------------------------------------------------------
[INFO] BUILD FAILURE
[INFO] ------------------------------------------------------------------------
[INFO] Total time: 01:23 h
[INFO] Finished at: 2016-02-11T02:55:34+00:00
[INFO] Final Memory: 62M/1057M
[INFO] ------------------------------------------------------------------------
[ERROR] Failed to execute goal org.apache.maven.plugins:maven-surefire-plugin:2.17:test (default-test)
on project hadoop-yarn-server-resourcemanager: There are test failures.
[ERROR] 
[ERROR] Please refer to /home/jenkins/jenkins-slave/workspace/Hadoop-Yarn-trunk-Java8/hadoop-yarn-project/hadoop-yarn/hadoop-yarn-server/hadoop-yarn-server-resourcemanager/target/surefire-reports
for the individual test results.
[ERROR] -> [Help 1]
[ERROR] 
[ERROR] To see the full stack trace of the errors, re-run Maven with the -e switch.
[ERROR] Re-run Maven using the -X switch to enable full debug logging.
[ERROR] 
[ERROR] For more information about the errors and possible solutions, please read the following
articles:
[ERROR] [Help 1] http://cwiki.apache.org/confluence/display/MAVEN/MojoFailureException
[ERROR] 
[ERROR] After correcting the problems, you can resume the build with the command
[ERROR]   mvn <goals> -rf :hadoop-yarn-server-resourcemanager
Build step 'Execute shell' marked build as failure
Archiving artifacts
Recording test results
Sending e-mails to: yarn-dev@hadoop.apache.org
Email was triggered for: Failure - Any
Sending email for trigger: Failure - Any



###################################################################################
############################## FAILED TESTS (if any) ##############################
7 tests failed.
FAILED:  org.apache.hadoop.yarn.server.resourcemanager.scheduler.capacity.TestApplicationPriority.testUpdateInvalidPriorityAtRuntime

Error Message:
org.apache.hadoop.security.token.TokenIdentifier: Provider org.apache.hadoop.hdfs.security.token.block.BlockTokenIdentifier
not found

Stack Trace:
java.util.ServiceConfigurationError: org.apache.hadoop.security.token.TokenIdentifier: Provider
org.apache.hadoop.hdfs.security.token.block.BlockTokenIdentifier not found
	at java.util.ServiceLoader.fail(ServiceLoader.java:239)
	at java.util.ServiceLoader.access$300(ServiceLoader.java:185)
	at java.util.ServiceLoader$LazyIterator.nextService(ServiceLoader.java:372)
	at java.util.ServiceLoader$LazyIterator.next(ServiceLoader.java:404)
	at java.util.ServiceLoader$1.next(ServiceLoader.java:480)
	at org.apache.hadoop.security.token.Token.getClassForIdentifier(Token.java:117)
	at org.apache.hadoop.security.token.Token.decodeIdentifier(Token.java:138)
	at org.apache.hadoop.yarn.server.resourcemanager.MockAM.registerAppAttempt(MockAM.java:126)
	at org.apache.hadoop.yarn.server.resourcemanager.MockAM.registerAppAttempt(MockAM.java:106)
	at org.apache.hadoop.yarn.server.resourcemanager.scheduler.capacity.TestApplicationPriority.testUpdateInvalidPriorityAtRuntime(TestApplicationPriority.java:369)


FAILED:  org.apache.hadoop.yarn.server.resourcemanager.scheduler.capacity.TestApplicationPriority.testRMRestartWithChangeInPriority

Error Message:
null

Stack Trace:
java.lang.NullPointerException: null
	at javax.security.auth.Subject$ClassSet.populateSet(Subject.java:1391)
	at javax.security.auth.Subject$ClassSet.<init>(Subject.java:1353)
	at javax.security.auth.Subject.getPublicCredentials(Subject.java:720)
	at org.apache.hadoop.security.UserGroupInformation.getTokenIdentifiers(UserGroupInformation.java:1513)
	at org.apache.hadoop.yarn.server.utils.YarnServerSecurityUtils.selectAMRMTokenIdentifier(YarnServerSecurityUtils.java:104)
	at org.apache.hadoop.yarn.server.utils.YarnServerSecurityUtils.authorizeRequest(YarnServerSecurityUtils.java:76)
	at org.apache.hadoop.yarn.server.resourcemanager.ApplicationMasterService.registerApplicationMaster(ApplicationMasterService.java:182)
	at org.apache.hadoop.yarn.server.resourcemanager.MockAM$1.run(MockAM.java:134)
	at org.apache.hadoop.yarn.server.resourcemanager.MockAM$1.run(MockAM.java:131)
	at java.security.AccessController.doPrivileged(Native Method)
	at javax.security.auth.Subject.doAs(Subject.java:422)
	at org.apache.hadoop.security.UserGroupInformation.doAs(UserGroupInformation.java:1743)
	at org.apache.hadoop.yarn.server.resourcemanager.MockAM.registerAppAttempt(MockAM.java:130)
	at org.apache.hadoop.yarn.server.resourcemanager.MockAM.registerAppAttempt(MockAM.java:106)
	at org.apache.hadoop.yarn.server.resourcemanager.scheduler.capacity.TestApplicationPriority.testRMRestartWithChangeInPriority(TestApplicationPriority.java:419)


FAILED:  org.apache.hadoop.yarn.server.resourcemanager.scheduler.capacity.TestApplicationPriority.testApplicationPriorityAllocation

Error Message:
null

Stack Trace:
java.lang.NullPointerException: null
	at javax.security.auth.Subject$ClassSet.populateSet(Subject.java:1391)
	at javax.security.auth.Subject$ClassSet.<init>(Subject.java:1353)
	at javax.security.auth.Subject.getPublicCredentials(Subject.java:720)
	at org.apache.hadoop.security.UserGroupInformation.getTokenIdentifiers(UserGroupInformation.java:1513)
	at org.apache.hadoop.yarn.server.utils.YarnServerSecurityUtils.selectAMRMTokenIdentifier(YarnServerSecurityUtils.java:104)
	at org.apache.hadoop.yarn.server.utils.YarnServerSecurityUtils.authorizeRequest(YarnServerSecurityUtils.java:76)
	at org.apache.hadoop.yarn.server.resourcemanager.ApplicationMasterService.registerApplicationMaster(ApplicationMasterService.java:182)
	at org.apache.hadoop.yarn.server.resourcemanager.MockAM$1.run(MockAM.java:134)
	at org.apache.hadoop.yarn.server.resourcemanager.MockAM$1.run(MockAM.java:131)
	at java.security.AccessController.doPrivileged(Native Method)
	at javax.security.auth.Subject.doAs(Subject.java:422)
	at org.apache.hadoop.security.UserGroupInformation.doAs(UserGroupInformation.java:1743)
	at org.apache.hadoop.yarn.server.resourcemanager.MockAM.registerAppAttempt(MockAM.java:130)
	at org.apache.hadoop.yarn.server.resourcemanager.MockAM.registerAppAttempt(MockAM.java:106)
	at org.apache.hadoop.yarn.server.resourcemanager.scheduler.capacity.TestApplicationPriority.testApplicationPriorityAllocation(TestApplicationPriority.java:167)


FAILED:  org.apache.hadoop.yarn.server.resourcemanager.scheduler.capacity.TestApplicationPriority.testApplicationPriorityAllocationWithChangeInPriority

Error Message:
null

Stack Trace:
java.lang.NullPointerException: null
	at javax.security.auth.Subject$ClassSet.populateSet(Subject.java:1391)
	at javax.security.auth.Subject$ClassSet.<init>(Subject.java:1353)
	at javax.security.auth.Subject.getPublicCredentials(Subject.java:720)
	at org.apache.hadoop.security.UserGroupInformation.getTokenIdentifiers(UserGroupInformation.java:1513)
	at org.apache.hadoop.yarn.server.utils.YarnServerSecurityUtils.selectAMRMTokenIdentifier(YarnServerSecurityUtils.java:104)
	at org.apache.hadoop.yarn.server.utils.YarnServerSecurityUtils.authorizeRequest(YarnServerSecurityUtils.java:76)
	at org.apache.hadoop.yarn.server.resourcemanager.ApplicationMasterService.registerApplicationMaster(ApplicationMasterService.java:182)
	at org.apache.hadoop.yarn.server.resourcemanager.MockAM$1.run(MockAM.java:134)
	at org.apache.hadoop.yarn.server.resourcemanager.MockAM$1.run(MockAM.java:131)
	at java.security.AccessController.doPrivileged(Native Method)
	at javax.security.auth.Subject.doAs(Subject.java:422)
	at org.apache.hadoop.security.UserGroupInformation.doAs(UserGroupInformation.java:1743)
	at org.apache.hadoop.yarn.server.resourcemanager.MockAM.registerAppAttempt(MockAM.java:130)
	at org.apache.hadoop.yarn.server.resourcemanager.MockAM.registerAppAttempt(MockAM.java:106)
	at org.apache.hadoop.yarn.server.resourcemanager.scheduler.capacity.TestApplicationPriority.testApplicationPriorityAllocationWithChangeInPriority(TestApplicationPriority.java:472)


FAILED:  org.apache.hadoop.yarn.server.resourcemanager.scheduler.capacity.TestApplicationPriority.testOrderOfActivatingThePriorityApplicationOnRMRestart

Error Message:
null

Stack Trace:
java.lang.NullPointerException: null
	at javax.security.auth.Subject$ClassSet.populateSet(Subject.java:1391)
	at javax.security.auth.Subject$ClassSet.<init>(Subject.java:1353)
	at javax.security.auth.Subject.getPublicCredentials(Subject.java:720)
	at org.apache.hadoop.security.UserGroupInformation.getTokenIdentifiers(UserGroupInformation.java:1513)
	at org.apache.hadoop.yarn.server.utils.YarnServerSecurityUtils.selectAMRMTokenIdentifier(YarnServerSecurityUtils.java:104)
	at org.apache.hadoop.yarn.server.utils.YarnServerSecurityUtils.authorizeRequest(YarnServerSecurityUtils.java:76)
	at org.apache.hadoop.yarn.server.resourcemanager.ApplicationMasterService.registerApplicationMaster(ApplicationMasterService.java:182)
	at org.apache.hadoop.yarn.server.resourcemanager.MockAM$1.run(MockAM.java:134)
	at org.apache.hadoop.yarn.server.resourcemanager.MockAM$1.run(MockAM.java:131)
	at java.security.AccessController.doPrivileged(Native Method)
	at javax.security.auth.Subject.doAs(Subject.java:422)
	at org.apache.hadoop.security.UserGroupInformation.doAs(UserGroupInformation.java:1743)
	at org.apache.hadoop.yarn.server.resourcemanager.MockAM.registerAppAttempt(MockAM.java:130)
	at org.apache.hadoop.yarn.server.resourcemanager.MockAM.registerAppAttempt(MockAM.java:106)
	at org.apache.hadoop.yarn.server.resourcemanager.scheduler.capacity.TestApplicationPriority.testOrderOfActivatingThePriorityApplicationOnRMRestart(TestApplicationPriority.java:626)


FAILED:  org.apache.hadoop.yarn.server.resourcemanager.scheduler.capacity.TestApplicationPriority.testPriorityWithPendingApplications

Error Message:
null

Stack Trace:
java.lang.NullPointerException: null
	at javax.security.auth.Subject$ClassSet.populateSet(Subject.java:1391)
	at javax.security.auth.Subject$ClassSet.<init>(Subject.java:1353)
	at javax.security.auth.Subject.getPublicCredentials(Subject.java:720)
	at org.apache.hadoop.security.UserGroupInformation.getTokenIdentifiers(UserGroupInformation.java:1513)
	at org.apache.hadoop.yarn.server.utils.YarnServerSecurityUtils.selectAMRMTokenIdentifier(YarnServerSecurityUtils.java:104)
	at org.apache.hadoop.yarn.server.utils.YarnServerSecurityUtils.authorizeRequest(YarnServerSecurityUtils.java:76)
	at org.apache.hadoop.yarn.server.resourcemanager.ApplicationMasterService.registerApplicationMaster(ApplicationMasterService.java:182)
	at org.apache.hadoop.yarn.server.resourcemanager.MockAM$1.run(MockAM.java:134)
	at org.apache.hadoop.yarn.server.resourcemanager.MockAM$1.run(MockAM.java:131)
	at java.security.AccessController.doPrivileged(Native Method)
	at javax.security.auth.Subject.doAs(Subject.java:422)
	at org.apache.hadoop.security.UserGroupInformation.doAs(UserGroupInformation.java:1743)
	at org.apache.hadoop.yarn.server.resourcemanager.MockAM.registerAppAttempt(MockAM.java:130)
	at org.apache.hadoop.yarn.server.resourcemanager.MockAM.registerAppAttempt(MockAM.java:106)
	at org.apache.hadoop.yarn.server.resourcemanager.scheduler.capacity.TestApplicationPriority.testPriorityWithPendingApplications(TestApplicationPriority.java:252)


FAILED:  org.apache.hadoop.yarn.server.resourcemanager.scheduler.capacity.TestApplicationPriority.testUpdatePriorityAtRuntime

Error Message:
null

Stack Trace:
java.lang.NullPointerException: null
	at javax.security.auth.Subject$ClassSet.populateSet(Subject.java:1391)
	at javax.security.auth.Subject$ClassSet.<init>(Subject.java:1353)
	at javax.security.auth.Subject.getPublicCredentials(Subject.java:720)
	at org.apache.hadoop.security.UserGroupInformation.getTokenIdentifiers(UserGroupInformation.java:1513)
	at org.apache.hadoop.yarn.server.utils.YarnServerSecurityUtils.selectAMRMTokenIdentifier(YarnServerSecurityUtils.java:104)
	at org.apache.hadoop.yarn.server.utils.YarnServerSecurityUtils.authorizeRequest(YarnServerSecurityUtils.java:76)
	at org.apache.hadoop.yarn.server.resourcemanager.ApplicationMasterService.registerApplicationMaster(ApplicationMasterService.java:182)
	at org.apache.hadoop.yarn.server.resourcemanager.MockAM$1.run(MockAM.java:134)
	at org.apache.hadoop.yarn.server.resourcemanager.MockAM$1.run(MockAM.java:131)
	at java.security.AccessController.doPrivileged(Native Method)
	at javax.security.auth.Subject.doAs(Subject.java:422)
	at org.apache.hadoop.security.UserGroupInformation.doAs(UserGroupInformation.java:1743)
	at org.apache.hadoop.yarn.server.resourcemanager.MockAM.registerAppAttempt(MockAM.java:130)
	at org.apache.hadoop.yarn.server.resourcemanager.MockAM.registerAppAttempt(MockAM.java:106)
	at org.apache.hadoop.yarn.server.resourcemanager.scheduler.capacity.TestApplicationPriority.testUpdatePriorityAtRuntime(TestApplicationPriority.java:335)



Mime
  • Unnamed multipart/mixed (inline, None, 0 bytes)
View raw message