hadoop-yarn-dev mailing list archives

Site index · List index
Message view « Date » · « Thread »
Top « Date » · « Thread »
From Apache Jenkins Server <jenk...@builds.apache.org>
Subject Hadoop-Yarn-trunk-Java8 - Build # 1142 - Failure
Date Wed, 02 Mar 2016 19:33:40 GMT
See https://builds.apache.org/job/Hadoop-Yarn-trunk-Java8/1142/

###################################################################################
########################## LAST 60 LINES OF THE CONSOLE ###########################
[...truncated 5259 lines...]
Java HotSpot(TM) 64-Bit Server VM warning: ignoring option MaxPermSize=768m; support was removed
in 8.0
Running org.apache.hadoop.yarn.server.resourcemanager.TestRMAuditLogger
Tests run: 3, Failures: 0, Errors: 0, Skipped: 0, Time elapsed: 2.601 sec - in org.apache.hadoop.yarn.server.resourcemanager.TestRMAuditLogger

Results :

Tests in error: 
  TestSchedulingPolicy.testIsApplicableTo:81 ยป  test timed out after 1000 millis...

Tests run: 1419, Failures: 0, Errors: 1, Skipped: 2

[INFO] ------------------------------------------------------------------------
[INFO] Reactor Summary:
[INFO] 
[INFO] Apache Hadoop YARN ................................ SUCCESS [  6.730 s]
[INFO] Apache Hadoop YARN API ............................ SUCCESS [02:24 min]
[INFO] Apache Hadoop YARN Common ......................... SUCCESS [03:43 min]
[INFO] Apache Hadoop YARN Server ......................... SUCCESS [  0.094 s]
[INFO] Apache Hadoop YARN Server Common .................. SUCCESS [ 50.155 s]
[INFO] Apache Hadoop YARN NodeManager .................... SUCCESS [12:21 min]
[INFO] Apache Hadoop YARN Web Proxy ...................... SUCCESS [ 32.154 s]
[INFO] Apache Hadoop YARN ApplicationHistoryService ...... SUCCESS [06:18 min]
[INFO] Apache Hadoop YARN ResourceManager ................ FAILURE [  01:25 h]
[INFO] Apache Hadoop YARN Server Tests ................... SKIPPED
[INFO] Apache Hadoop YARN Client ......................... SKIPPED
[INFO] Apache Hadoop YARN SharedCacheManager ............. SKIPPED
[INFO] Apache Hadoop YARN Timeline Plugin Storage ........ SKIPPED
[INFO] Apache Hadoop YARN Applications ................... SKIPPED
[INFO] Apache Hadoop YARN DistributedShell ............... SKIPPED
[INFO] Apache Hadoop YARN Unmanaged Am Launcher .......... SKIPPED
[INFO] Apache Hadoop YARN Site ........................... SKIPPED
[INFO] Apache Hadoop YARN Registry ....................... SKIPPED
[INFO] Apache Hadoop YARN Project ........................ SKIPPED
[INFO] ------------------------------------------------------------------------
[INFO] BUILD FAILURE
[INFO] ------------------------------------------------------------------------
[INFO] Total time: 01:51 h
[INFO] Finished at: 2016-03-02T19:33:36+00:00
[INFO] Final Memory: 61M/1091M
[INFO] ------------------------------------------------------------------------
[ERROR] Failed to execute goal org.apache.maven.plugins:maven-surefire-plugin:2.17:test (default-test)
on project hadoop-yarn-server-resourcemanager: There are test failures.
[ERROR] 
[ERROR] Please refer to /home/jenkins/jenkins-slave/workspace/Hadoop-Yarn-trunk-Java8/hadoop-yarn-project/hadoop-yarn/hadoop-yarn-server/hadoop-yarn-server-resourcemanager/target/surefire-reports
for the individual test results.
[ERROR] -> [Help 1]
[ERROR] 
[ERROR] To see the full stack trace of the errors, re-run Maven with the -e switch.
[ERROR] Re-run Maven using the -X switch to enable full debug logging.
[ERROR] 
[ERROR] For more information about the errors and possible solutions, please read the following
articles:
[ERROR] [Help 1] http://cwiki.apache.org/confluence/display/MAVEN/MojoFailureException
[ERROR] 
[ERROR] After correcting the problems, you can resume the build with the command
[ERROR]   mvn <goals> -rf :hadoop-yarn-server-resourcemanager
Build step 'Execute shell' marked build as failure
Archiving artifacts
Recording test results
Sending e-mails to: yarn-dev@hadoop.apache.org
Email was triggered for: Failure - Any
Sending email for trigger: Failure - Any



###################################################################################
############################## FAILED TESTS (if any) ##############################
1 tests failed.
FAILED:  org.apache.hadoop.yarn.server.resourcemanager.scheduler.fair.TestSchedulingPolicy.testIsApplicableTo

Error Message:
test timed out after 1000 milliseconds

Stack Trace:
java.lang.Exception: test timed out after 1000 milliseconds
	at org.apache.hadoop.yarn.proto.YarnProtos$ResourceProto.newBuilder(YarnProtos.java:5080)
	at org.apache.hadoop.yarn.api.records.impl.pb.ResourcePBImpl.<init>(ResourcePBImpl.java:36)
	at sun.reflect.NativeConstructorAccessorImpl.newInstance0(Native Method)
	at sun.reflect.NativeConstructorAccessorImpl.newInstance(NativeConstructorAccessorImpl.java:62)
	at sun.reflect.DelegatingConstructorAccessorImpl.newInstance(DelegatingConstructorAccessorImpl.java:45)
	at java.lang.reflect.Constructor.newInstance(Constructor.java:408)
	at org.apache.hadoop.yarn.factories.impl.pb.RecordFactoryPBImpl.newRecordInstance(RecordFactoryPBImpl.java:70)
	at org.apache.hadoop.yarn.util.Records.newRecord(Records.java:36)
	at org.apache.hadoop.yarn.util.resource.Resources.createResource(Resources.java:102)
	at org.apache.hadoop.yarn.util.resource.Resources.createResource(Resources.java:98)
	at org.apache.hadoop.yarn.server.resourcemanager.scheduler.fair.policies.FairSharePolicy$FairShareComparator.<clinit>(FairSharePolicy.java:71)
	at org.apache.hadoop.yarn.server.resourcemanager.scheduler.fair.policies.FairSharePolicy.<clinit>(FairSharePolicy.java:47)
	at sun.reflect.NativeConstructorAccessorImpl.newInstance0(Native Method)
	at sun.reflect.NativeConstructorAccessorImpl.newInstance(NativeConstructorAccessorImpl.java:62)
	at sun.reflect.DelegatingConstructorAccessorImpl.newInstance(DelegatingConstructorAccessorImpl.java:45)
	at java.lang.reflect.Constructor.newInstance(Constructor.java:408)
	at org.apache.hadoop.util.ReflectionUtils.newInstance(ReflectionUtils.java:132)
	at org.apache.hadoop.yarn.server.resourcemanager.scheduler.fair.SchedulingPolicy.getInstance(SchedulingPolicy.java:55)
	at org.apache.hadoop.yarn.server.resourcemanager.scheduler.fair.SchedulingPolicy.<clinit>(SchedulingPolicy.java:43)
	at org.apache.hadoop.yarn.server.resourcemanager.scheduler.fair.TestSchedulingPolicy.testIsApplicableTo(TestSchedulingPolicy.java:81)



Mime
  • Unnamed multipart/mixed (inline, None, 0 bytes)
View raw message