hadoop-yarn-dev mailing list archives

Site index · List index
Message view « Date » · « Thread »
Top « Date » · « Thread »
From Apache Jenkins Server <jenk...@builds.apache.org>
Subject Hadoop-Yarn-trunk - Build # 2109 - Failure
Date Thu, 05 May 2016 09:07:13 GMT
See https://builds.apache.org/job/Hadoop-Yarn-trunk/2109/

###################################################################################
########################## LAST 60 LINES OF THE CONSOLE ###########################
[...truncated 9625 lines...]

Results :

Failed tests: 
  TestRMRestart.testQueueMetricsOnRMRestart:1849->assertQueueMetrics:1874 expected:<2>
but was:<1>

Tests in error: 
  TestAMRestart.testAMRestartNotLostContainerCompleteMsg:1011 ยป  test timed out ...

Tests run: 1378, Failures: 1, Errors: 1, Skipped: 3

[INFO] ------------------------------------------------------------------------
[INFO] Reactor Summary:
[INFO] 
[INFO] Apache Hadoop YARN ................................ SUCCESS [  3.373 s]
[INFO] Apache Hadoop YARN API ............................ SUCCESS [04:26 min]
[INFO] Apache Hadoop YARN Common ......................... SUCCESS [03:18 min]
[INFO] Apache Hadoop YARN Server ......................... SUCCESS [  0.095 s]
[INFO] Apache Hadoop YARN Server Common .................. SUCCESS [ 49.724 s]
[INFO] Apache Hadoop YARN NodeManager .................... SUCCESS [12:08 min]
[INFO] Apache Hadoop YARN Web Proxy ...................... SUCCESS [ 25.429 s]
[INFO] Apache Hadoop YARN ApplicationHistoryService ...... SUCCESS [03:32 min]
[INFO] Apache Hadoop YARN ResourceManager ................ FAILURE [32:34 min]
[INFO] Apache Hadoop YARN Server Tests ................... SKIPPED
[INFO] Apache Hadoop YARN Client ......................... SKIPPED
[INFO] Apache Hadoop YARN SharedCacheManager ............. SKIPPED
[INFO] Apache Hadoop YARN Timeline Plugin Storage ........ SKIPPED
[INFO] Apache Hadoop YARN Applications ................... SKIPPED
[INFO] Apache Hadoop YARN DistributedShell ............... SKIPPED
[INFO] Apache Hadoop YARN Unmanaged Am Launcher .......... SKIPPED
[INFO] Apache Hadoop YARN Site ........................... SKIPPED
[INFO] Apache Hadoop YARN Registry ....................... SKIPPED
[INFO] Apache Hadoop YARN Project ........................ SKIPPED
[INFO] ------------------------------------------------------------------------
[INFO] BUILD FAILURE
[INFO] ------------------------------------------------------------------------
[INFO] Total time: 57:20 min
[INFO] Finished at: 2016-05-05T09:07:11+00:00
[INFO] Final Memory: 68M/463M
[INFO] ------------------------------------------------------------------------
[ERROR] Failed to execute goal org.apache.maven.plugins:maven-surefire-plugin:2.17:test (default-test)
on project hadoop-yarn-server-resourcemanager: There are test failures.
[ERROR] 
[ERROR] Please refer to /home/jenkins/jenkins-slave/workspace/Hadoop-Yarn-trunk/hadoop-yarn-project/hadoop-yarn/hadoop-yarn-server/hadoop-yarn-server-resourcemanager/target/surefire-reports
for the individual test results.
[ERROR] -> [Help 1]
[ERROR] 
[ERROR] To see the full stack trace of the errors, re-run Maven with the -e switch.
[ERROR] Re-run Maven using the -X switch to enable full debug logging.
[ERROR] 
[ERROR] For more information about the errors and possible solutions, please read the following
articles:
[ERROR] [Help 1] http://cwiki.apache.org/confluence/display/MAVEN/MojoFailureException
[ERROR] 
[ERROR] After correcting the problems, you can resume the build with the command
[ERROR]   mvn <goals> -rf :hadoop-yarn-server-resourcemanager
Build step 'Execute shell' marked build as failure
Archiving artifacts
Recording test results
Sending e-mails to: yarn-dev@hadoop.apache.org
Email was triggered for: Failure - Any
Sending email for trigger: Failure - Any



###################################################################################
############################## FAILED TESTS (if any) ##############################
2 tests failed.
FAILED:  org.apache.hadoop.yarn.server.resourcemanager.TestRMRestart.testQueueMetricsOnRMRestart

Error Message:
expected:<2> but was:<1>

Stack Trace:
java.lang.AssertionError: expected:<2> but was:<1>
	at org.junit.Assert.fail(Assert.java:88)
	at org.junit.Assert.failNotEquals(Assert.java:743)
	at org.junit.Assert.assertEquals(Assert.java:118)
	at org.junit.Assert.assertEquals(Assert.java:555)
	at org.junit.Assert.assertEquals(Assert.java:542)
	at org.apache.hadoop.yarn.server.resourcemanager.TestRMRestart.assertQueueMetrics(TestRMRestart.java:1874)
	at org.apache.hadoop.yarn.server.resourcemanager.TestRMRestart.testQueueMetricsOnRMRestart(TestRMRestart.java:1849)


FAILED:  org.apache.hadoop.yarn.server.resourcemanager.applicationsmanager.TestAMRestart.testAMRestartNotLostContainerCompleteMsg

Error Message:
test timed out after 30000 milliseconds

Stack Trace:
java.lang.Exception: test timed out after 30000 milliseconds
	at java.lang.Thread.sleep(Native Method)
	at org.apache.hadoop.yarn.server.resourcemanager.MockRM.waitForState(MockRM.java:261)
	at org.apache.hadoop.yarn.server.resourcemanager.MockRM.waitForState(MockRM.java:225)
	at org.apache.hadoop.yarn.server.resourcemanager.MockRM.waitForState(MockRM.java:207)
	at org.apache.hadoop.yarn.server.resourcemanager.MockRM.sendAMLaunched(MockRM.java:746)
	at org.apache.hadoop.yarn.server.resourcemanager.applicationsmanager.TestAMRestart.testAMRestartNotLostContainerCompleteMsg(TestAMRestart.java:1011)




Mime
View raw message