hadoop-yarn-dev mailing list archives

Site index · List index
Message view « Date » · « Thread »
Top « Date » · « Thread »
From Apache Jenkins Server <jenk...@builds.apache.org>
Subject Hadoop-Yarn-trunk-Java8 - Build # 1530 - Still Failing
Date Thu, 02 Jun 2016 13:29:40 GMT
See https://builds.apache.org/job/Hadoop-Yarn-trunk-Java8/1530/

###################################################################################
########################## LAST 60 LINES OF THE CONSOLE ###########################
[...truncated 30110 lines...]
[INFO] Reactor Summary:
[INFO] 
[INFO] Apache Hadoop YARN ................................. SUCCESS [  3.842 s]
[INFO] Apache Hadoop YARN API ............................. SUCCESS [01:25 min]
[INFO] Apache Hadoop YARN Common .......................... SUCCESS [02:53 min]
[INFO] Apache Hadoop YARN Server .......................... SUCCESS [  0.055 s]
[INFO] Apache Hadoop YARN Server Common ................... SUCCESS [ 33.216 s]
[INFO] Apache Hadoop YARN NodeManager ..................... SUCCESS [11:10 min]
[INFO] Apache Hadoop YARN Web Proxy ....................... SUCCESS [ 19.032 s]
[INFO] Apache Hadoop YARN ApplicationHistoryService ....... SUCCESS [02:43 min]
[INFO] Apache Hadoop YARN ResourceManager ................. FAILURE [31:55 min]
[INFO] Apache Hadoop YARN Server Tests .................... SKIPPED
[INFO] Apache Hadoop YARN Client .......................... SKIPPED
[INFO] Apache Hadoop YARN SharedCacheManager .............. SKIPPED
[INFO] Apache Hadoop YARN Timeline Plugin Storage ......... SKIPPED
[INFO] Apache Hadoop YARN Applications .................... SUCCESS [  0.048 s]
[INFO] Apache Hadoop YARN DistributedShell ................ SKIPPED
[INFO] Apache Hadoop YARN Unmanaged Am Launcher ........... SKIPPED
[INFO] Apache Hadoop YARN Site ............................ SUCCESS [  0.043 s]
[INFO] Apache Hadoop YARN Registry ........................ SUCCESS [ 40.793 s]
[INFO] Apache Hadoop YARN Project ......................... SKIPPED
[INFO] ------------------------------------------------------------------------
[INFO] BUILD FAILURE
[INFO] ------------------------------------------------------------------------
[INFO] Total time: 51:48 min
[INFO] Finished at: 2016-06-02T13:29:22+00:00
[INFO] Final Memory: 118M/3828M
[INFO] ------------------------------------------------------------------------
[WARNING] The requested profile "docs" could not be activated because it does not exist.
[WARNING] The requested profile "parallel-tests" could not be activated because it does not
exist.
[ERROR] Failed to execute goal org.apache.maven.plugins:maven-surefire-plugin:2.17:test (default-test)
on project hadoop-yarn-server-resourcemanager: There are test failures.
[ERROR] 
[ERROR] Please refer to /home/jenkins/jenkins-slave/workspace/Hadoop-Yarn-trunk-Java8/source/hadoop-yarn-project/hadoop-yarn/hadoop-yarn-server/hadoop-yarn-server-resourcemanager/target/surefire-reports
for the individual test results.
[ERROR] -> [Help 1]
[ERROR] 
[ERROR] To see the full stack trace of the errors, re-run Maven with the -e switch.
[ERROR] Re-run Maven using the -X switch to enable full debug logging.
[ERROR] 
[ERROR] For more information about the errors and possible solutions, please read the following
articles:
[ERROR] [Help 1] http://cwiki.apache.org/confluence/display/MAVEN/MojoFailureException
[ERROR] 
[ERROR] After correcting the problems, you can resume the build with the command
[ERROR]   mvn <goals> -rf :hadoop-yarn-server-resourcemanager
Build step 'Execute shell' marked build as failure
Archiving artifacts
Setting LATEST1_8_HOME=/home/jenkins/jenkins-slave/tools/hudson.model.JDK/latest1.8
Setting MAVEN_3_3_3_HOME=/home/jenkins/jenkins-slave/tools/hudson.tasks.Maven_MavenInstallation/maven-3.3.3
Recording test results
Setting LATEST1_8_HOME=/home/jenkins/jenkins-slave/tools/hudson.model.JDK/latest1.8
Setting MAVEN_3_3_3_HOME=/home/jenkins/jenkins-slave/tools/hudson.tasks.Maven_MavenInstallation/maven-3.3.3
Setting LATEST1_8_HOME=/home/jenkins/jenkins-slave/tools/hudson.model.JDK/latest1.8
Setting MAVEN_3_3_3_HOME=/home/jenkins/jenkins-slave/tools/hudson.tasks.Maven_MavenInstallation/maven-3.3.3
Sending e-mails to: yarn-dev@hadoop.apache.org
Email was triggered for: Failure - Any
Sending email for trigger: Failure - Any
Setting LATEST1_8_HOME=/home/jenkins/jenkins-slave/tools/hudson.model.JDK/latest1.8
Setting MAVEN_3_3_3_HOME=/home/jenkins/jenkins-slave/tools/hudson.tasks.Maven_MavenInstallation/maven-3.3.3
Setting LATEST1_8_HOME=/home/jenkins/jenkins-slave/tools/hudson.model.JDK/latest1.8
Setting MAVEN_3_3_3_HOME=/home/jenkins/jenkins-slave/tools/hudson.tasks.Maven_MavenInstallation/maven-3.3.3



###################################################################################
############################## FAILED TESTS (if any) ##############################
1 tests failed.
FAILED:  org.apache.hadoop.yarn.server.resourcemanager.applicationsmanager.TestAMRestart.testShouldNotCountFailureToMaxAttemptRetry

Error Message:
Attempt state is not correct (timeout). expected:<SCHEDULED> but was:<ALLOCATED>

Stack Trace:
java.lang.AssertionError: Attempt state is not correct (timeout). expected:<SCHEDULED>
but was:<ALLOCATED>
	at org.junit.Assert.fail(Assert.java:88)
	at org.junit.Assert.failNotEquals(Assert.java:743)
	at org.junit.Assert.assertEquals(Assert.java:118)
	at org.apache.hadoop.yarn.server.resourcemanager.MockRM.waitForState(MockRM.java:266)
	at org.apache.hadoop.yarn.server.resourcemanager.MockRM.waitForState(MockRM.java:225)
	at org.apache.hadoop.yarn.server.resourcemanager.MockRM.waitForState(MockRM.java:207)
	at org.apache.hadoop.yarn.server.resourcemanager.MockRM.waitForAttemptScheduled(MockRM.java:955)
	at org.apache.hadoop.yarn.server.resourcemanager.MockRM.launchAM(MockRM.java:942)
	at org.apache.hadoop.yarn.server.resourcemanager.MockRM.launchAndRegisterAM(MockRM.java:961)
	at org.apache.hadoop.yarn.server.resourcemanager.MockRM.waitForNewAMToLaunchAndRegister(MockRM.java:295)
	at org.apache.hadoop.yarn.server.resourcemanager.applicationsmanager.TestAMRestart.testShouldNotCountFailureToMaxAttemptRetry(TestAMRestart.java:647)




Mime
View raw message