hadoop-yarn-dev mailing list archives

Site index · List index
Message view « Date » · « Thread »
Top « Date » · « Thread »
From Apache Jenkins Server <jenk...@builds.apache.org>
Subject Hadoop-Yarn-trunk-Java8 - Build # 1532 - Still Failing
Date Thu, 02 Jun 2016 18:35:05 GMT
See https://builds.apache.org/job/Hadoop-Yarn-trunk-Java8/1532/

###################################################################################
########################## LAST 60 LINES OF THE CONSOLE ###########################
[...truncated 29574 lines...]
[INFO] Reactor Summary:
[INFO] 
[INFO] Apache Hadoop YARN ................................. SUCCESS [  3.137 s]
[INFO] Apache Hadoop YARN API ............................. SUCCESS [01:30 min]
[INFO] Apache Hadoop YARN Common .......................... SUCCESS [03:03 min]
[INFO] Apache Hadoop YARN Server .......................... SUCCESS [  0.057 s]
[INFO] Apache Hadoop YARN Server Common ................... SUCCESS [ 37.006 s]
[INFO] Apache Hadoop YARN NodeManager ..................... SUCCESS [11:28 min]
[INFO] Apache Hadoop YARN Web Proxy ....................... SUCCESS [ 20.841 s]
[INFO] Apache Hadoop YARN ApplicationHistoryService ....... SUCCESS [03:24 min]
[INFO] Apache Hadoop YARN ResourceManager ................. FAILURE [36:05 min]
[INFO] Apache Hadoop YARN Server Tests .................... SKIPPED
[INFO] Apache Hadoop YARN Client .......................... SKIPPED
[INFO] Apache Hadoop YARN SharedCacheManager .............. SKIPPED
[INFO] Apache Hadoop YARN Timeline Plugin Storage ......... SKIPPED
[INFO] Apache Hadoop YARN Applications .................... SUCCESS [  0.039 s]
[INFO] Apache Hadoop YARN DistributedShell ................ SKIPPED
[INFO] Apache Hadoop YARN Unmanaged Am Launcher ........... SKIPPED
[INFO] Apache Hadoop YARN Site ............................ SUCCESS [  0.044 s]
[INFO] Apache Hadoop YARN Registry ........................ SUCCESS [ 48.326 s]
[INFO] Apache Hadoop YARN Project ......................... SKIPPED
[INFO] ------------------------------------------------------------------------
[INFO] BUILD FAILURE
[INFO] ------------------------------------------------------------------------
[INFO] Total time: 57:22 min
[INFO] Finished at: 2016-06-02T18:34:44+00:00
[INFO] Final Memory: 123M/4715M
[INFO] ------------------------------------------------------------------------
[WARNING] The requested profile "docs" could not be activated because it does not exist.
[WARNING] The requested profile "parallel-tests" could not be activated because it does not
exist.
[ERROR] Failed to execute goal org.apache.maven.plugins:maven-surefire-plugin:2.17:test (default-test)
on project hadoop-yarn-server-resourcemanager: There are test failures.
[ERROR] 
[ERROR] Please refer to /home/jenkins/jenkins-slave/workspace/Hadoop-Yarn-trunk-Java8/source/hadoop-yarn-project/hadoop-yarn/hadoop-yarn-server/hadoop-yarn-server-resourcemanager/target/surefire-reports
for the individual test results.
[ERROR] -> [Help 1]
[ERROR] 
[ERROR] To see the full stack trace of the errors, re-run Maven with the -e switch.
[ERROR] Re-run Maven using the -X switch to enable full debug logging.
[ERROR] 
[ERROR] For more information about the errors and possible solutions, please read the following
articles:
[ERROR] [Help 1] http://cwiki.apache.org/confluence/display/MAVEN/MojoFailureException
[ERROR] 
[ERROR] After correcting the problems, you can resume the build with the command
[ERROR]   mvn <goals> -rf :hadoop-yarn-server-resourcemanager
Build step 'Execute shell' marked build as failure
Archiving artifacts
Setting LATEST1_8_HOME=/home/jenkins/jenkins-slave/tools/hudson.model.JDK/latest1.8
Setting MAVEN_3_3_3_HOME=/home/jenkins/jenkins-slave/tools/hudson.tasks.Maven_MavenInstallation/maven-3.3.3
Recording test results
Setting LATEST1_8_HOME=/home/jenkins/jenkins-slave/tools/hudson.model.JDK/latest1.8
Setting MAVEN_3_3_3_HOME=/home/jenkins/jenkins-slave/tools/hudson.tasks.Maven_MavenInstallation/maven-3.3.3
Setting LATEST1_8_HOME=/home/jenkins/jenkins-slave/tools/hudson.model.JDK/latest1.8
Setting MAVEN_3_3_3_HOME=/home/jenkins/jenkins-slave/tools/hudson.tasks.Maven_MavenInstallation/maven-3.3.3
Sending e-mails to: yarn-dev@hadoop.apache.org
Email was triggered for: Failure - Any
Sending email for trigger: Failure - Any
Setting LATEST1_8_HOME=/home/jenkins/jenkins-slave/tools/hudson.model.JDK/latest1.8
Setting MAVEN_3_3_3_HOME=/home/jenkins/jenkins-slave/tools/hudson.tasks.Maven_MavenInstallation/maven-3.3.3
Setting LATEST1_8_HOME=/home/jenkins/jenkins-slave/tools/hudson.model.JDK/latest1.8
Setting MAVEN_3_3_3_HOME=/home/jenkins/jenkins-slave/tools/hudson.tasks.Maven_MavenInstallation/maven-3.3.3



###################################################################################
############################## FAILED TESTS (if any) ##############################
2 tests failed.
FAILED:  org.apache.hadoop.yarn.server.resourcemanager.applicationsmanager.TestAMRestart.testRMAppAttemptFailuresValidityInterval

Error Message:
expected:<2> but was:<3>

Stack Trace:
java.lang.AssertionError: expected:<2> but was:<3>
	at org.junit.Assert.fail(Assert.java:88)
	at org.junit.Assert.failNotEquals(Assert.java:743)
	at org.junit.Assert.assertEquals(Assert.java:118)
	at org.junit.Assert.assertEquals(Assert.java:555)
	at org.junit.Assert.assertEquals(Assert.java:542)
	at org.apache.hadoop.yarn.server.resourcemanager.applicationsmanager.TestAMRestart.testRMAppAttemptFailuresValidityInterval(TestAMRestart.java:927)


FAILED:  org.apache.hadoop.yarn.server.resourcemanager.webapp.TestRMWebServicesDelegationTokens.testCreateDelegationToken[0]

Error Message:
expected:<OK> but was:<Unauthorized>

Stack Trace:
java.lang.AssertionError: expected:<OK> but was:<Unauthorized>
	at org.junit.Assert.fail(Assert.java:88)
	at org.junit.Assert.failNotEquals(Assert.java:743)
	at org.junit.Assert.assertEquals(Assert.java:118)
	at org.junit.Assert.assertEquals(Assert.java:144)
	at org.apache.hadoop.yarn.server.resourcemanager.webapp.TestRMWebServicesDelegationTokens$3.call(TestRMWebServicesDelegationTokens.java:337)
	at org.apache.hadoop.yarn.server.resourcemanager.webapp.TestRMWebServicesDelegationTokens$3.call(TestRMWebServicesDelegationTokens.java:317)
	at org.apache.hadoop.security.authentication.KerberosTestUtils$1.run(KerberosTestUtils.java:120)
	at java.security.AccessController.doPrivileged(Native Method)
	at javax.security.auth.Subject.doAs(Subject.java:422)
	at org.apache.hadoop.security.authentication.KerberosTestUtils.doAs(KerberosTestUtils.java:117)
	at org.apache.hadoop.security.authentication.KerberosTestUtils.doAsClient(KerberosTestUtils.java:133)
	at org.apache.hadoop.yarn.server.resourcemanager.webapp.TestRMWebServicesDelegationTokens.verifyKerberosAuthCreate(TestRMWebServicesDelegationTokens.java:317)
	at org.apache.hadoop.yarn.server.resourcemanager.webapp.TestRMWebServicesDelegationTokens.testCreateDelegationToken(TestRMWebServicesDelegationTokens.java:290)




Mime
View raw message