hadoop-yarn-dev mailing list archives

Site index · List index
Message view « Date » · « Thread »
Top « Date » · « Thread »
From Apache Jenkins Server <jenk...@builds.apache.org>
Subject Apache Hadoop qbt Report: trunk+JDK8 on Linux/aarch
Date Fri, 07 Feb 2020 01:16:24 GMT
ARM Build Details : https://builds.apache.org/job/Hadoop-qbt-linux-ARM-trunk/102/

============================ 
CHANGES 
============================ 

[Feb 5, 2020 1:44:05 AM] (jhung) YARN-10116. Expose diagnostics in RMAppManager summary
[Feb 6, 2020 11:25:06 AM] (snemeth) YARN-10101. Support listing of aggregated logs for containers
belonging
[Feb 6, 2020 2:13:25 PM] (github) HADOOP-16832. S3Guard testing doc: Add required parameters
for S3Guard


============================ 
TESTS 
============================ 

There are 23599 total tests of which 12 test(s) failed and 2473 test(s) were skipped.  

============================ 
FAILED TESTS 
============================ 

12 tests failed.
FAILED:  org.apache.hadoop.hdfs.server.namenode.ha.TestDelegationTokensWithHA.testObserverReadProxyProviderWithDT
FAILED:  org.apache.hadoop.yarn.applications.distributedshell.TestDistributedShell.testDSShellWithOpportunisticContainers
FAILED:  org.apache.hadoop.yarn.applications.distributedshell.TestDistributedShell.testDSShellWithEnforceExecutionType
FAILED:  org.apache.hadoop.yarn.server.timelineservice.reader.TestTimelineReaderWebServicesHBaseStorage.org.apache.hadoop.yarn.server.timelineservice.reader.TestTimelineReaderWebServicesHBaseStorage
FAILED:  org.apache.hadoop.yarn.server.timelineservice.storage.TestHBaseTimelineStorageApps.org.apache.hadoop.yarn.server.timelineservice.storage.TestHBaseTimelineStorageApps
FAILED:  org.apache.hadoop.yarn.server.timelineservice.storage.TestHBaseTimelineStorageDomain.org.apache.hadoop.yarn.server.timelineservice.storage.TestHBaseTimelineStorageDomain
FAILED:  org.apache.hadoop.yarn.server.timelineservice.storage.TestHBaseTimelineStorageEntities.org.apache.hadoop.yarn.server.timelineservice.storage.TestHBaseTimelineStorageEntities
FAILED:  org.apache.hadoop.yarn.server.timelineservice.storage.TestHBaseTimelineStorageSchema.org.apache.hadoop.yarn.server.timelineservice.storage.TestHBaseTimelineStorageSchema
FAILED:  org.apache.hadoop.yarn.server.timelineservice.storage.TestTimelineWriterHBaseDown.testTimelineWriterHBaseDown
FAILED:  org.apache.hadoop.yarn.server.timelineservice.storage.flow.TestHBaseStorageFlowActivity.org.apache.hadoop.yarn.server.timelineservice.storage.flow.TestHBaseStorageFlowActivity
FAILED:  org.apache.hadoop.yarn.server.timelineservice.storage.flow.TestHBaseStorageFlowRun.org.apache.hadoop.yarn.server.timelineservice.storage.flow.TestHBaseStorageFlowRun
FAILED:  org.apache.hadoop.yarn.server.timelineservice.storage.flow.TestHBaseStorageFlowRunCompaction.org.apache.hadoop.yarn.server.timelineservice.storage.flow.TestHBaseStorageFlowRunCompaction


Complete test report can be accessed at https://builds.apache.org/job/Hadoop-qbt-linux-ARM-trunk/102/testReport

IN ATTACHMENT COMPRESSED BUILD LOGS.
Mime
View raw message