hadoop-yarn-dev mailing list archives

Site index · List index
Message view « Date » · « Thread »
Top « Date » · « Thread »
From "Ahmed Hussein (Jira)" <j...@apache.org>
Subject [jira] [Created] (YARN-10140) TestTimelineAuthFilterForV2 fails due to login failures in branch-2.10
Date Sun, 16 Feb 2020 18:33:00 GMT
Ahmed Hussein created YARN-10140:
------------------------------------

             Summary: TestTimelineAuthFilterForV2 fails due to login failures in branch-2.10
                 Key: YARN-10140
                 URL: https://issues.apache.org/jira/browse/YARN-10140
             Project: Hadoop YARN
          Issue Type: Bug
          Components: timelineservice
    Affects Versions: 2.10.0
            Reporter: Ahmed Hussein


For branch-2.10, it seems that {{TestTimelineAuthFilterForV2}} was broken for some time.
Using {{git bisect}} tool, I found that the first bad commit is "{{a3470c65d8b4e205c8a16d0c0b8dad10d0134bb8}}"
in HADOOP-15959 .
For trunk, the JUnit passes without failures.

The stack trace is:

{code:bash}
[ERROR] Tests run: 4, Failures: 0, Errors: 2, Skipped: 0, Time elapsed: 20.231 s <<<
FAILURE! - in org.apache.hadoop.yarn.server.timelineservice.security.TestTimelineAuthFilterForV2
[ERROR] testPutTimelineEntities[0](org.apache.hadoop.yarn.server.timelineservice.security.TestTimelineAuthFilterForV2)
 Time elapsed: 0.877 s  <<< ERROR!
org.apache.hadoop.security.KerberosAuthException: Login failure for user: HTTP/localhost@EXAMPLE.COM
from keytab /home/ahussein/workspace/repos/amahadoop-yhadoop-3090/hadoop-yarn-project/hadoop-yarn/hadoop-yarn-server/hadoop-yarn-server-tests/target/bf6554f1-1df4-4ce0-8516-e6c337067870
javax.security.auth.login.LoginException: java.lang.IllegalArgumentException: Illegal principal
name HTTP/localhost@EXAMPLE.COM: org.apache.hadoop.security.authentication.util.KerberosName$NoMatchingRule:
No rules applied to HTTP/localhost@EXAMPLE.COM
	at org.apache.hadoop.security.UserGroupInformation.loginUserFromKeytab(UserGroupInformation.java:1104)
	at org.apache.hadoop.security.SecurityUtil.login(SecurityUtil.java:312)
	at org.apache.hadoop.yarn.server.timelineservice.security.TestTimelineAuthFilterForV2.initialize(TestTimelineAuthFilterForV2.java:209)
	at sun.reflect.NativeMethodAccessorImpl.invoke0(Native Method)
	at sun.reflect.NativeMethodAccessorImpl.invoke(NativeMethodAccessorImpl.java:62)
	at sun.reflect.DelegatingMethodAccessorImpl.invoke(DelegatingMethodAccessorImpl.java:43)
	at java.lang.reflect.Method.invoke(Method.java:498)
	at org.junit.runners.model.FrameworkMethod$1.runReflectiveCall(FrameworkMethod.java:47)
	at org.junit.internal.runners.model.ReflectiveCallable.run(ReflectiveCallable.java:12)
	at org.junit.runners.model.FrameworkMethod.invokeExplosively(FrameworkMethod.java:44)
	at org.junit.internal.runners.statements.RunBefores.evaluate(RunBefores.java:24)
	at org.junit.internal.runners.statements.RunAfters.evaluate(RunAfters.java:27)
	at org.junit.runners.ParentRunner.runLeaf(ParentRunner.java:271)
	at org.junit.runners.BlockJUnit4ClassRunner.runChild(BlockJUnit4ClassRunner.java:70)
	at org.junit.runners.BlockJUnit4ClassRunner.runChild(BlockJUnit4ClassRunner.java:50)
	at org.junit.runners.ParentRunner$3.run(ParentRunner.java:238)
	at org.junit.runners.ParentRunner$1.schedule(ParentRunner.java:63)
	at org.junit.runners.ParentRunner.runChildren(ParentRunner.java:236)
	at org.junit.runners.ParentRunner.access$000(ParentRunner.java:53)
	at org.junit.runners.ParentRunner$2.evaluate(ParentRunner.java:229)
	at org.junit.runners.ParentRunner.run(ParentRunner.java:309)
	at org.junit.runners.Suite.runChild(Suite.java:127)
	at org.junit.runners.Suite.runChild(Suite.java:26)
	at org.junit.runners.ParentRunner$3.run(ParentRunner.java:238)
	at org.junit.runners.ParentRunner$1.schedule(ParentRunner.java:63)
	at org.junit.runners.ParentRunner.runChildren(ParentRunner.java:236)
	at org.junit.runners.ParentRunner.access$000(ParentRunner.java:53)
	at org.junit.runners.ParentRunner$2.evaluate(ParentRunner.java:229)
	at org.junit.internal.runners.statements.RunBefores.evaluate(RunBefores.java:26)
	at org.junit.internal.runners.statements.RunAfters.evaluate(RunAfters.java:27)
	at org.junit.runners.ParentRunner.run(ParentRunner.java:309)
	at org.apache.maven.surefire.junit4.JUnit4Provider.execute(JUnit4Provider.java:365)
	at org.apache.maven.surefire.junit4.JUnit4Provider.executeWithRerun(JUnit4Provider.java:273)
	at org.apache.maven.surefire.junit4.JUnit4Provider.executeTestSet(JUnit4Provider.java:238)
	at org.apache.maven.surefire.junit4.JUnit4Provider.invoke(JUnit4Provider.java:159)
	at org.apache.maven.surefire.booter.ForkedBooter.invokeProviderInSameClassLoader(ForkedBooter.java:379)
	at org.apache.maven.surefire.booter.ForkedBooter.runSuitesInProcess(ForkedBooter.java:340)
	at org.apache.maven.surefire.booter.ForkedBooter.execute(ForkedBooter.java:125)
	at org.apache.maven.surefire.booter.ForkedBooter.main(ForkedBooter.java:413)
Caused by: javax.security.auth.login.LoginException: java.lang.IllegalArgumentException: Illegal
principal name HTTP/localhost@EXAMPLE.COM: org.apache.hadoop.security.authentication.util.KerberosName$NoMatchingRule:
No rules applied to HTTP/localhost@EXAMPLE.COM
	at org.apache.hadoop.security.UserGroupInformation$HadoopLoginModule.commit(UserGroupInformation.java:224)
	at sun.reflect.NativeMethodAccessorImpl.invoke0(Native Method)
	at sun.reflect.NativeMethodAccessorImpl.invoke(NativeMethodAccessorImpl.java:62)
	at sun.reflect.DelegatingMethodAccessorImpl.invoke(DelegatingMethodAccessorImpl.java:43)
	at java.lang.reflect.Method.invoke(Method.java:498)
	at javax.security.auth.login.LoginContext.invoke(LoginContext.java:755)
	at javax.security.auth.login.LoginContext.access$000(LoginContext.java:195)
	at javax.security.auth.login.LoginContext$4.run(LoginContext.java:682)
	at javax.security.auth.login.LoginContext$4.run(LoginContext.java:680)
	at java.security.AccessController.doPrivileged(Native Method)
	at javax.security.auth.login.LoginContext.invokePriv(LoginContext.java:680)
	at javax.security.auth.login.LoginContext.login(LoginContext.java:588)
	at org.apache.hadoop.security.UserGroupInformation.loginUserFromKeytab(UserGroupInformation.java:1095)
	... 38 more
Caused by: java.lang.IllegalArgumentException: Illegal principal name HTTP/localhost@EXAMPLE.COM:
org.apache.hadoop.security.authentication.util.KerberosName$NoMatchingRule: No rules applied
to HTTP/localhost@EXAMPLE.COM
	at org.apache.hadoop.security.User.<init>(User.java:51)
	at org.apache.hadoop.security.User.<init>(User.java:43)
	at org.apache.hadoop.security.UserGroupInformation$HadoopLoginModule.commit(UserGroupInformation.java:222)
	... 50 more
Caused by: org.apache.hadoop.security.authentication.util.KerberosName$NoMatchingRule: No
rules applied to HTTP/localhost@EXAMPLE.COM
	at org.apache.hadoop.security.authentication.util.KerberosName.getShortName(KerberosName.java:401)
	at org.apache.hadoop.security.User.<init>(User.java:48)
	... 52 more

[ERROR] testPutTimelineEntities[3](org.apache.hadoop.yarn.server.timelineservice.security.TestTimelineAuthFilterForV2)
 Time elapsed: 0.239 s  <<< ERROR!
org.apache.hadoop.security.KerberosAuthException: Login failure for user: HTTP/localhost@EXAMPLE.COM
from keytab /home/ahussein/workspace/repos/amahadoop-yhadoop-3090/hadoop-yarn-project/hadoop-yarn/hadoop-yarn-server/hadoop-yarn-server-tests/target/bf6554f1-1df4-4ce0-8516-e6c337067870
javax.security.auth.login.LoginException: java.lang.IllegalArgumentException: Illegal principal
name HTTP/localhost@EXAMPLE.COM: org.apache.hadoop.security.authentication.util.KerberosName$NoMatchingRule:
No rules applied to HTTP/localhost@EXAMPLE.COM
	at org.apache.hadoop.security.UserGroupInformation.loginUserFromKeytab(UserGroupInformation.java:1104)
	at org.apache.hadoop.security.SecurityUtil.login(SecurityUtil.java:312)
	at org.apache.hadoop.yarn.server.timelineservice.security.TestTimelineAuthFilterForV2.initialize(TestTimelineAuthFilterForV2.java:209)
	at sun.reflect.NativeMethodAccessorImpl.invoke0(Native Method)
	at sun.reflect.NativeMethodAccessorImpl.invoke(NativeMethodAccessorImpl.java:62)
	at sun.reflect.DelegatingMethodAccessorImpl.invoke(DelegatingMethodAccessorImpl.java:43)
	at java.lang.reflect.Method.invoke(Method.java:498)
	at org.junit.runners.model.FrameworkMethod$1.runReflectiveCall(FrameworkMethod.java:47)
	at org.junit.internal.runners.model.ReflectiveCallable.run(ReflectiveCallable.java:12)
	at org.junit.runners.model.FrameworkMethod.invokeExplosively(FrameworkMethod.java:44)
	at org.junit.internal.runners.statements.RunBefores.evaluate(RunBefores.java:24)
	at org.junit.internal.runners.statements.RunAfters.evaluate(RunAfters.java:27)
	at org.junit.runners.ParentRunner.runLeaf(ParentRunner.java:271)
	at org.junit.runners.BlockJUnit4ClassRunner.runChild(BlockJUnit4ClassRunner.java:70)
	at org.junit.runners.BlockJUnit4ClassRunner.runChild(BlockJUnit4ClassRunner.java:50)
	at org.junit.runners.ParentRunner$3.run(ParentRunner.java:238)
	at org.junit.runners.ParentRunner$1.schedule(ParentRunner.java:63)
	at org.junit.runners.ParentRunner.runChildren(ParentRunner.java:236)
	at org.junit.runners.ParentRunner.access$000(ParentRunner.java:53)
	at org.junit.runners.ParentRunner$2.evaluate(ParentRunner.java:229)
	at org.junit.runners.ParentRunner.run(ParentRunner.java:309)
	at org.junit.runners.Suite.runChild(Suite.java:127)
	at org.junit.runners.Suite.runChild(Suite.java:26)
	at org.junit.runners.ParentRunner$3.run(ParentRunner.java:238)
	at org.junit.runners.ParentRunner$1.schedule(ParentRunner.java:63)
	at org.junit.runners.ParentRunner.runChildren(ParentRunner.java:236)
	at org.junit.runners.ParentRunner.access$000(ParentRunner.java:53)
	at org.junit.runners.ParentRunner$2.evaluate(ParentRunner.java:229)
	at org.junit.internal.runners.statements.RunBefores.evaluate(RunBefores.java:26)
	at org.junit.internal.runners.statements.RunAfters.evaluate(RunAfters.java:27)
	at org.junit.runners.ParentRunner.run(ParentRunner.java:309)
	at org.apache.maven.surefire.junit4.JUnit4Provider.execute(JUnit4Provider.java:365)
	at org.apache.maven.surefire.junit4.JUnit4Provider.executeWithRerun(JUnit4Provider.java:273)
	at org.apache.maven.surefire.junit4.JUnit4Provider.executeTestSet(JUnit4Provider.java:238)
	at org.apache.maven.surefire.junit4.JUnit4Provider.invoke(JUnit4Provider.java:159)
	at org.apache.maven.surefire.booter.ForkedBooter.invokeProviderInSameClassLoader(ForkedBooter.java:379)
	at org.apache.maven.surefire.booter.ForkedBooter.runSuitesInProcess(ForkedBooter.java:340)
	at org.apache.maven.surefire.booter.ForkedBooter.execute(ForkedBooter.java:125)
	at org.apache.maven.surefire.booter.ForkedBooter.main(ForkedBooter.java:413)
Caused by: javax.security.auth.login.LoginException: java.lang.IllegalArgumentException: Illegal
principal name HTTP/localhost@EXAMPLE.COM: org.apache.hadoop.security.authentication.util.KerberosName$NoMatchingRule:
No rules applied to HTTP/localhost@EXAMPLE.COM
	at org.apache.hadoop.security.UserGroupInformation$HadoopLoginModule.commit(UserGroupInformation.java:224)
	at sun.reflect.NativeMethodAccessorImpl.invoke0(Native Method)
	at sun.reflect.NativeMethodAccessorImpl.invoke(NativeMethodAccessorImpl.java:62)
	at sun.reflect.DelegatingMethodAccessorImpl.invoke(DelegatingMethodAccessorImpl.java:43)
	at java.lang.reflect.Method.invoke(Method.java:498)
	at javax.security.auth.login.LoginContext.invoke(LoginContext.java:755)
	at javax.security.auth.login.LoginContext.access$000(LoginContext.java:195)
	at javax.security.auth.login.LoginContext$4.run(LoginContext.java:682)
	at javax.security.auth.login.LoginContext$4.run(LoginContext.java:680)
	at java.security.AccessController.doPrivileged(Native Method)
	at javax.security.auth.login.LoginContext.invokePriv(LoginContext.java:680)
	at javax.security.auth.login.LoginContext.login(LoginContext.java:588)
	at org.apache.hadoop.security.UserGroupInformation.loginUserFromKeytab(UserGroupInformation.java:1095)
	... 38 more
Caused by: java.lang.IllegalArgumentException: Illegal principal name HTTP/localhost@EXAMPLE.COM:
org.apache.hadoop.security.authentication.util.KerberosName$NoMatchingRule: No rules applied
to HTTP/localhost@EXAMPLE.COM
	at org.apache.hadoop.security.User.<init>(User.java:51)
	at org.apache.hadoop.security.User.<init>(User.java:43)
	at org.apache.hadoop.security.UserGroupInformation$HadoopLoginModule.commit(UserGroupInformation.java:222)
	... 50 more
Caused by: org.apache.hadoop.security.authentication.util.KerberosName$NoMatchingRule: No
rules applied to HTTP/localhost@EXAMPLE.COM
	at org.apache.hadoop.security.authentication.util.KerberosName.getShortName(KerberosName.java:401)
	at org.apache.hadoop.security.User.<init>(User.java:48)
	... 52 more

[INFO]
[INFO] Results:
[INFO]
[ERROR] Errors:
[ERROR]   TestTimelineAuthFilterForV2.initialize:209 » KerberosAuth Login failure for us...
[ERROR]   TestTimelineAuthFilterForV2.initialize:209 » KerberosAuth Login failure for us...
[INFO]
[ERROR] Tests run: 4, Failures: 0, Errors: 2, Skipped: 0
{code}




--
This message was sent by Atlassian Jira
(v8.3.4#803005)

---------------------------------------------------------------------
To unsubscribe, e-mail: yarn-dev-unsubscribe@hadoop.apache.org
For additional commands, e-mail: yarn-dev-help@hadoop.apache.org


Mime
View raw message