hbase-builds mailing list archives

Site index · List index
Message view « Date » · « Thread »
Top « Date » · « Thread »
From apurt...@apache.org
Subject Build failed in Jenkins: HBase-TRUNK #403
Date Fri, 28 Jun 2013 01:28:59 GMT
See <http://54.241.6.143/job/HBase-TRUNK/403/changes>

Changes:

[Michael Stack] HBASE-8813 Fix time b/w recoverLease invocations from HBASE 8449

[Michael Stack] HBASE-8799 TestAccessController#testBulkLoad has been failing for some time
on trunk/0.95; DISABLING FALING TEST FOR NOW

[Andrew Purtell] HBASE-8811. REST service ignores misspelled 'check' parameter, causing unexpected
mutations (Chip Salzenberg and Andrew Purtell)

[tedyu] HBASE-8790 NullPointerException thrown when stopping regionserver (Liang Xie)

------------------------------------------
[...truncated 6798 lines...]
Tests run: 4, Failures: 0, Errors: 0, Skipped: 0, Time elapsed: 1.901 sec
Running org.apache.hadoop.hbase.regionserver.TestGetClosestAtOrBefore
Tests run: 3, Failures: 0, Errors: 0, Skipped: 0, Time elapsed: 1.773 sec
Running org.apache.hadoop.hbase.regionserver.TestCompoundBloomFilter
Tests run: 3, Failures: 0, Errors: 0, Skipped: 0, Time elapsed: 23.488 sec
Running org.apache.hadoop.hbase.regionserver.TestCompaction
Tests run: 18, Failures: 0, Errors: 0, Skipped: 0, Time elapsed: 88.08 sec
Running org.apache.hadoop.hbase.regionserver.TestCacheOnWriteInSchema
Tests run: 3, Failures: 0, Errors: 0, Skipped: 0, Time elapsed: 2.479 sec
Running org.apache.hadoop.hbase.regionserver.wal.TestHLogSplit
Tests run: 35, Failures: 0, Errors: 0, Skipped: 1, Time elapsed: 137.102 sec
Running org.apache.hadoop.hbase.regionserver.TestStore
Tests run: 15, Failures: 0, Errors: 0, Skipped: 0, Time elapsed: 13.252 sec
Running org.apache.hadoop.hbase.regionserver.TestServerCustomProtocol
Tests run: 7, Failures: 0, Errors: 0, Skipped: 0, Time elapsed: 41.255 sec
Running org.apache.hadoop.hbase.regionserver.TestMemStore
Tests run: 24, Failures: 0, Errors: 0, Skipped: 0, Time elapsed: 30.36 sec
Running org.apache.hadoop.hbase.regionserver.TestRegionMergeTransactionOnCluster
Tests run: 2, Failures: 0, Errors: 0, Skipped: 0, Time elapsed: 22.151 sec
Running org.apache.hadoop.hbase.master.TestMasterMetricsWrapper
Tests run: 1, Failures: 0, Errors: 0, Skipped: 0, Time elapsed: 14.623 sec
Running org.apache.hadoop.hbase.regionserver.TestCompactionWithCoprocessor
Tests run: 18, Failures: 0, Errors: 0, Skipped: 0, Time elapsed: 67.863 sec
Running org.apache.hadoop.hbase.master.TestDeadServer
Tests run: 3, Failures: 0, Errors: 0, Skipped: 0, Time elapsed: 0.413 sec
Running org.apache.hadoop.hbase.master.TestMasterShutdown
Tests run: 2, Failures: 0, Errors: 0, Skipped: 0, Time elapsed: 21.459 sec
Running org.apache.hadoop.hbase.master.TestMasterTransitions
Tests run: 3, Failures: 0, Errors: 0, Skipped: 3, Time elapsed: 15.887 sec
Running org.apache.hadoop.hbase.regionserver.TestSplitTransactionOnCluster
Tests run: 9, Failures: 0, Errors: 0, Skipped: 0, Time elapsed: 50.514 sec
Running org.apache.hadoop.hbase.regionserver.wal.TestLogRollAbort
Tests run: 1, Failures: 0, Errors: 0, Skipped: 0, Time elapsed: 276.269 sec
Running org.apache.hadoop.hbase.master.TestZKBasedOpenCloseRegion
Tests run: 4, Failures: 0, Errors: 0, Skipped: 0, Time elapsed: 17.673 sec
Running org.apache.hadoop.hbase.master.cleaner.TestLogsCleaner
Tests run: 1, Failures: 0, Errors: 0, Skipped: 0, Time elapsed: 12.278 sec
Running org.apache.hadoop.hbase.master.cleaner.TestHFileCleaner
Tests run: 3, Failures: 0, Errors: 0, Skipped: 0, Time elapsed: 4.981 sec
Running org.apache.hadoop.hbase.master.TestRollingRestart
Tests run: 1, Failures: 0, Errors: 0, Skipped: 0, Time elapsed: 37.715 sec
Running org.apache.hadoop.hbase.master.TestAssignmentManager
Tests run: 15, Failures: 0, Errors: 0, Skipped: 0, Time elapsed: 4.853 sec
Running org.apache.hadoop.hbase.master.cleaner.TestSnapshotFromMaster
Tests run: 4, Failures: 0, Errors: 0, Skipped: 0, Time elapsed: 32.064 sec
Running org.apache.hadoop.hbase.master.TestMasterFailoverBalancerPersistence
Tests run: 1, Failures: 0, Errors: 0, Skipped: 0, Time elapsed: 15.121 sec
Running org.apache.hadoop.hbase.master.TestMasterNoCluster
Tests run: 4, Failures: 0, Errors: 0, Skipped: 0, Time elapsed: 9.663 sec
Running org.apache.hadoop.hbase.master.TestSplitLogManager
Tests run: 13, Failures: 0, Errors: 0, Skipped: 0, Time elapsed: 83.84 sec
Running org.apache.hadoop.hbase.master.TestMasterMetrics
Tests run: 2, Failures: 0, Errors: 0, Skipped: 0, Time elapsed: 24.385 sec
Running org.apache.hadoop.hbase.master.TestMaster
Tests run: 4, Failures: 0, Errors: 0, Skipped: 0, Time elapsed: 23.178 sec
Running org.apache.hadoop.hbase.master.balancer.TestDefaultLoadBalancer
Tests run: 1, Failures: 0, Errors: 0, Skipped: 0, Time elapsed: 2.935 sec
Running org.apache.hadoop.hbase.master.balancer.TestBaseLoadBalancer
Tests run: 3, Failures: 0, Errors: 0, Skipped: 0, Time elapsed: 1.354 sec
Running org.apache.hadoop.hbase.master.TestActiveMasterManager
Tests run: 2, Failures: 0, Errors: 0, Skipped: 0, Time elapsed: 2.219 sec
Running org.apache.hadoop.hbase.master.TestClusterStatusPublisher
Tests run: 3, Failures: 0, Errors: 0, Skipped: 0, Time elapsed: 0.502 sec
Running org.apache.hadoop.hbase.master.TestMasterFileSystem
Tests run: 2, Failures: 0, Errors: 0, Skipped: 0, Time elapsed: 11.281 sec
Running org.apache.hadoop.hbase.master.TestMasterStatusServlet
Tests run: 4, Failures: 0, Errors: 0, Skipped: 0, Time elapsed: 2.506 sec
Running org.apache.hadoop.hbase.master.TestMasterRestartAfterDisablingTable
Tests run: 1, Failures: 0, Errors: 0, Skipped: 0, Time elapsed: 18.203 sec
Running org.apache.hadoop.hbase.master.TestRegionPlacement
Tests run: 3, Failures: 0, Errors: 0, Skipped: 0, Time elapsed: 30.368 sec
Running org.apache.hadoop.hbase.master.TestOpenedRegionHandler
Tests run: 2, Failures: 0, Errors: 0, Skipped: 0, Time elapsed: 15.378 sec
Running org.apache.hadoop.hbase.master.TestAssignmentManagerOnCluster
Tests run: 9, Failures: 0, Errors: 0, Skipped: 0, Time elapsed: 46.021 sec
Running org.apache.hadoop.hbase.master.handler.TestCreateTableHandler
Tests run: 2, Failures: 0, Errors: 0, Skipped: 0, Time elapsed: 20.435 sec
Running org.apache.hadoop.hbase.master.TestRestartCluster
Tests run: 2, Failures: 0, Errors: 0, Skipped: 0, Time elapsed: 33.096 sec
Running org.apache.hadoop.hbase.master.handler.TestTableDescriptorModification
Tests run: 3, Failures: 0, Errors: 0, Skipped: 0, Time elapsed: 22.202 sec
Running org.apache.hadoop.hbase.master.snapshot.TestSnapshotFileCache
Tests run: 4, Failures: 0, Errors: 0, Skipped: 0, Time elapsed: 4.879 sec
Running org.apache.hadoop.hbase.regionserver.wal.TestLogRolling
Tests run: 4, Failures: 0, Errors: 0, Skipped: 0, Time elapsed: 447.556 sec
Running org.apache.hadoop.hbase.master.handler.TestTableDeleteFamilyHandler
Tests run: 1, Failures: 0, Errors: 0, Skipped: 0, Time elapsed: 40.426 sec
Running org.apache.hadoop.hbase.master.TestHMasterRPCException
Tests run: 1, Failures: 0, Errors: 0, Skipped: 0, Time elapsed: 3.144 sec
Running org.apache.hadoop.hbase.trace.TestHTraceHooks
Tests run: 1, Failures: 0, Errors: 0, Skipped: 0, Time elapsed: 14.215 sec
Running org.apache.hadoop.hbase.master.TestMasterFailover
Tests run: 4, Failures: 0, Errors: 0, Skipped: 0, Time elapsed: 70.465 sec
Running org.apache.hadoop.hbase.backup.example.TestZooKeeperTableArchiveClient
Tests run: 3, Failures: 0, Errors: 0, Skipped: 0, Time elapsed: 7.871 sec
Running org.apache.hadoop.hbase.master.balancer.TestStochasticLoadBalancer
Tests run: 12, Failures: 0, Errors: 0, Skipped: 0, Time elapsed: 241.605 sec
Running org.apache.hadoop.hbase.master.TestTableLockManager
Tests run: 5, Failures: 0, Errors: 0, Skipped: 0, Time elapsed: 117.734 sec
Running org.apache.hadoop.hbase.TestClusterBootOrder
Tests run: 2, Failures: 0, Errors: 0, Skipped: 0, Time elapsed: 31.084 sec
Running org.apache.hadoop.hbase.TestZooKeeper
Tests run: 10, Failures: 0, Errors: 0, Skipped: 0, Time elapsed: 31.773 sec
Running org.apache.hadoop.hbase.coprocessor.TestBigDecimalColumnInterpreter
Tests run: 38, Failures: 0, Errors: 0, Skipped: 0, Time elapsed: 21.225 sec
Running org.apache.hadoop.hbase.coprocessor.TestRowProcessorEndpoint
Tests run: 4, Failures: 0, Errors: 0, Skipped: 0, Time elapsed: 33.787 sec
Running org.apache.hadoop.hbase.coprocessor.TestRegionServerCoprocessorExceptionWithRemove
Tests run: 1, Failures: 0, Errors: 0, Skipped: 0, Time elapsed: 17.088 sec
Running org.apache.hadoop.hbase.coprocessor.TestRegionObserverBypass
Tests run: 2, Failures: 0, Errors: 0, Skipped: 0, Time elapsed: 16.736 sec
Running org.apache.hadoop.hbase.coprocessor.TestMasterCoprocessorExceptionWithAbort
Tests run: 1, Failures: 0, Errors: 0, Skipped: 0, Time elapsed: 24.011 sec
Running org.apache.hadoop.hbase.coprocessor.TestOpenTableInCoprocessor
Tests run: 1, Failures: 0, Errors: 0, Skipped: 0, Time elapsed: 30.184 sec
Running org.apache.hadoop.hbase.coprocessor.TestRegionObserverInterface
Tests run: 7, Failures: 0, Errors: 0, Skipped: 0, Time elapsed: 36.738 sec
Running org.apache.hadoop.hbase.coprocessor.TestMasterCoprocessorExceptionWithRemove
Tests run: 1, Failures: 0, Errors: 0, Skipped: 0, Time elapsed: 15.716 sec
Running org.apache.hadoop.hbase.coprocessor.TestRegionServerCoprocessorExceptionWithAbort
Tests run: 1, Failures: 0, Errors: 0, Skipped: 0, Time elapsed: 16.642 sec
Running org.apache.hadoop.hbase.backup.TestHFileArchiving
Tests run: 5, Failures: 0, Errors: 0, Skipped: 0, Time elapsed: 164.485 sec
Running org.apache.hadoop.hbase.coprocessor.TestClassLoading
Tests run: 8, Failures: 0, Errors: 0, Skipped: 0, Time elapsed: 32.754 sec
Running org.apache.hadoop.hbase.coprocessor.TestRegionObserverScannerOpenHook
Tests run: 1, Failures: 0, Errors: 0, Skipped: 0, Time elapsed: 13.203 sec
Running org.apache.hadoop.hbase.coprocessor.TestCoprocessorEndpoint
Tests run: 6, Failures: 0, Errors: 0, Skipped: 0, Time elapsed: 14.136 sec
Running org.apache.hadoop.hbase.master.TestDistributedLogSplitting
Tests run: 14, Failures: 0, Errors: 0, Skipped: 0, Time elapsed: 394.885 sec
Running org.apache.hadoop.hbase.coprocessor.TestMasterObserver
Tests run: 5, Failures: 0, Errors: 0, Skipped: 0, Time elapsed: 38.53 sec
Running org.apache.hadoop.hbase.coprocessor.TestAggregateProtocol
Tests run: 45, Failures: 0, Errors: 0, Skipped: 0, Time elapsed: 15.537 sec
Running org.apache.hadoop.hbase.fs.TestBlockReorder
Tests run: 3, Failures: 0, Errors: 0, Skipped: 0, Time elapsed: 29.203 sec
Running org.apache.hadoop.hbase.coprocessor.TestWALObserver
Tests run: 3, Failures: 0, Errors: 0, Skipped: 0, Time elapsed: 83.882 sec

Results :

Tests run: 1580, Failures: 0, Errors: 0, Skipped: 15

[JENKINS] Recording test results
[INFO]                                                                         
[INFO] ------------------------------------------------------------------------
[INFO] Skipping HBase
[INFO] This project has been banned from the build due to previous failures.
[INFO] ------------------------------------------------------------------------
[INFO]                                                                         
[INFO] ------------------------------------------------------------------------
[INFO] Skipping HBase
[INFO] This project has been banned from the build due to previous failures.
[INFO] ------------------------------------------------------------------------
[INFO] ------------------------------------------------------------------------
[INFO] Reactor Summary:
[INFO] 
[INFO] HBase ............................................. SUCCESS [55.623s]
[INFO] HBase - Common .................................... SUCCESS [1:11.152s]
[INFO] HBase - Protocol .................................. SUCCESS [20.050s]
[INFO] HBase - Client .................................... SUCCESS [25.927s]
[INFO] HBase - Prefix Tree ............................... SUCCESS [5.331s]
[INFO] HBase - Hadoop Compatibility ...................... SUCCESS [6.034s]
[INFO] HBase - Hadoop One Compatibility .................. SUCCESS [10.348s]
[INFO] HBase - Server .................................... FAILURE [59:31.021s]
[INFO] HBase - Integration Tests ......................... SKIPPED
[INFO] HBase - Examples .................................. SKIPPED
[INFO] HBase - Assembly .................................. SKIPPED
[INFO] ------------------------------------------------------------------------
[INFO] BUILD FAILURE
[INFO] ------------------------------------------------------------------------
[INFO] Total time: 1:03:18.055s
[INFO] Finished at: Fri Jun 28 01:28:31 UTC 2013
[INFO] Final Memory: 63M/406M
[INFO] ------------------------------------------------------------------------
[JENKINS] Archiving <http://54.241.6.143/job/HBase-TRUNK/ws/hbase-common/pom.xml> to
/var/lib/jenkins/jobs/HBase-TRUNK/modules/org.apache.hbase$hbase-common/builds/2013-06-28_00-25-07/archive/org.apache.hbase/hbase-common/0.97.0-SNAPSHOT/hbase-common-0.97.0-SNAPSHOT.pom
[JENKINS] Archiving <http://54.241.6.143/job/HBase-TRUNK/ws/hbase-common/target/hbase-common-0.97.0-SNAPSHOT.jar>
to /var/lib/jenkins/jobs/HBase-TRUNK/modules/org.apache.hbase$hbase-common/builds/2013-06-28_00-25-07/archive/org.apache.hbase/hbase-common/0.97.0-SNAPSHOT/hbase-common-0.97.0-SNAPSHOT.jar
[JENKINS] Archiving <http://54.241.6.143/job/HBase-TRUNK/ws/hbase-common/target/hbase-common-0.97.0-SNAPSHOT-sources.jar>
to /var/lib/jenkins/jobs/HBase-TRUNK/modules/org.apache.hbase$hbase-common/builds/2013-06-28_00-25-07/archive/org.apache.hbase/hbase-common/0.97.0-SNAPSHOT/hbase-common-0.97.0-SNAPSHOT-sources.jar
[JENKINS] Archiving <http://54.241.6.143/job/HBase-TRUNK/ws/hbase-common/target/hbase-common-0.97.0-SNAPSHOT-tests.jar>
to /var/lib/jenkins/jobs/HBase-TRUNK/modules/org.apache.hbase$hbase-common/builds/2013-06-28_00-25-07/archive/org.apache.hbase/hbase-common/0.97.0-SNAPSHOT/hbase-common-0.97.0-SNAPSHOT-tests.jar
[JENKINS] Archiving <http://54.241.6.143/job/HBase-TRUNK/ws/hbase-hadoop-compat/pom.xml>
to /var/lib/jenkins/jobs/HBase-TRUNK/modules/org.apache.hbase$hbase-hadoop-compat/builds/2013-06-28_00-25-07/archive/org.apache.hbase/hbase-hadoop-compat/0.97.0-SNAPSHOT/hbase-hadoop-compat-0.97.0-SNAPSHOT.pom
[JENKINS] Archiving <http://54.241.6.143/job/HBase-TRUNK/ws/hbase-hadoop-compat/target/hbase-hadoop-compat-0.97.0-SNAPSHOT.jar>
to /var/lib/jenkins/jobs/HBase-TRUNK/modules/org.apache.hbase$hbase-hadoop-compat/builds/2013-06-28_00-25-07/archive/org.apache.hbase/hbase-hadoop-compat/0.97.0-SNAPSHOT/hbase-hadoop-compat-0.97.0-SNAPSHOT.jar
[JENKINS] Archiving <http://54.241.6.143/job/HBase-TRUNK/ws/hbase-hadoop-compat/target/hbase-hadoop-compat-0.97.0-SNAPSHOT-sources.jar>
to /var/lib/jenkins/jobs/HBase-TRUNK/modules/org.apache.hbase$hbase-hadoop-compat/builds/2013-06-28_00-25-07/archive/org.apache.hbase/hbase-hadoop-compat/0.97.0-SNAPSHOT/hbase-hadoop-compat-0.97.0-SNAPSHOT-sources.jar
[JENKINS] Archiving <http://54.241.6.143/job/HBase-TRUNK/ws/hbase-hadoop-compat/target/hbase-hadoop-compat-0.97.0-SNAPSHOT-tests.jar>
to /var/lib/jenkins/jobs/HBase-TRUNK/modules/org.apache.hbase$hbase-hadoop-compat/builds/2013-06-28_00-25-07/archive/org.apache.hbase/hbase-hadoop-compat/0.97.0-SNAPSHOT/hbase-hadoop-compat-0.97.0-SNAPSHOT-tests.jar
[JENKINS] Archiving <http://54.241.6.143/job/HBase-TRUNK/ws/hbase-examples/pom.xml>
to /var/lib/jenkins/jobs/HBase-TRUNK/modules/org.apache.hbase$hbase-examples/builds/2013-06-28_00-25-07/archive/org.apache.hbase/hbase-examples/0.97.0-SNAPSHOT/hbase-examples-0.97.0-SNAPSHOT.pom
[JENKINS] Archiving <http://54.241.6.143/job/HBase-TRUNK/ws/hbase-it/pom.xml> to /var/lib/jenkins/jobs/HBase-TRUNK/modules/org.apache.hbase$hbase-it/builds/2013-06-28_00-25-07/archive/org.apache.hbase/hbase-it/0.97.0-SNAPSHOT/hbase-it-0.97.0-SNAPSHOT.pom
[JENKINS] Archiving <http://54.241.6.143/job/HBase-TRUNK/ws/pom.xml> to /var/lib/jenkins/jobs/HBase-TRUNK/modules/org.apache.hbase$hbase/builds/2013-06-28_00-25-06/archive/org.apache.hbase/hbase/0.97.0-SNAPSHOT/hbase-0.97.0-SNAPSHOT.pom
[JENKINS] Archiving <http://54.241.6.143/job/HBase-TRUNK/ws/target/hbase-0.97.0-SNAPSHOT-site.xml>
to /var/lib/jenkins/jobs/HBase-TRUNK/modules/org.apache.hbase$hbase/builds/2013-06-28_00-25-06/archive/org.apache.hbase/hbase/0.97.0-SNAPSHOT/hbase-0.97.0-SNAPSHOT-site.xml
[JENKINS] Archiving <http://54.241.6.143/job/HBase-TRUNK/ws/hbase-assembly/pom.xml>
to /var/lib/jenkins/jobs/HBase-TRUNK/modules/org.apache.hbase$hbase-assembly/builds/2013-06-28_00-25-07/archive/org.apache.hbase/hbase-assembly/0.97.0-SNAPSHOT/hbase-assembly-0.97.0-SNAPSHOT.pom
[JENKINS] Archiving <http://54.241.6.143/job/HBase-TRUNK/ws/hbase-client/pom.xml> to
/var/lib/jenkins/jobs/HBase-TRUNK/modules/org.apache.hbase$hbase-client/builds/2013-06-28_00-25-06/archive/org.apache.hbase/hbase-client/0.97.0-SNAPSHOT/hbase-client-0.97.0-SNAPSHOT.pom
[JENKINS] Archiving <http://54.241.6.143/job/HBase-TRUNK/ws/hbase-client/target/hbase-client-0.97.0-SNAPSHOT.jar>
to /var/lib/jenkins/jobs/HBase-TRUNK/modules/org.apache.hbase$hbase-client/builds/2013-06-28_00-25-06/archive/org.apache.hbase/hbase-client/0.97.0-SNAPSHOT/hbase-client-0.97.0-SNAPSHOT.jar
[JENKINS] Archiving <http://54.241.6.143/job/HBase-TRUNK/ws/hbase-client/target/hbase-client-0.97.0-SNAPSHOT-sources.jar>
to /var/lib/jenkins/jobs/HBase-TRUNK/modules/org.apache.hbase$hbase-client/builds/2013-06-28_00-25-06/archive/org.apache.hbase/hbase-client/0.97.0-SNAPSHOT/hbase-client-0.97.0-SNAPSHOT-sources.jar
[JENKINS] Archiving <http://54.241.6.143/job/HBase-TRUNK/ws/hbase-client/target/hbase-client-0.97.0-SNAPSHOT-tests.jar>
to /var/lib/jenkins/jobs/HBase-TRUNK/modules/org.apache.hbase$hbase-client/builds/2013-06-28_00-25-06/archive/org.apache.hbase/hbase-client/0.97.0-SNAPSHOT/hbase-client-0.97.0-SNAPSHOT-tests.jar
[JENKINS] Archiving <http://54.241.6.143/job/HBase-TRUNK/ws/hbase-prefix-tree/pom.xml>
to /var/lib/jenkins/jobs/HBase-TRUNK/modules/org.apache.hbase$hbase-prefix-tree/builds/2013-06-28_00-25-07/archive/org.apache.hbase/hbase-prefix-tree/0.97.0-SNAPSHOT/hbase-prefix-tree-0.97.0-SNAPSHOT.pom
[JENKINS] Archiving <http://54.241.6.143/job/HBase-TRUNK/ws/hbase-prefix-tree/target/hbase-prefix-tree-0.97.0-SNAPSHOT.jar>
to /var/lib/jenkins/jobs/HBase-TRUNK/modules/org.apache.hbase$hbase-prefix-tree/builds/2013-06-28_00-25-07/archive/org.apache.hbase/hbase-prefix-tree/0.97.0-SNAPSHOT/hbase-prefix-tree-0.97.0-SNAPSHOT.jar
[JENKINS] Archiving <http://54.241.6.143/job/HBase-TRUNK/ws/hbase-prefix-tree/target/hbase-prefix-tree-0.97.0-SNAPSHOT-sources.jar>
to /var/lib/jenkins/jobs/HBase-TRUNK/modules/org.apache.hbase$hbase-prefix-tree/builds/2013-06-28_00-25-07/archive/org.apache.hbase/hbase-prefix-tree/0.97.0-SNAPSHOT/hbase-prefix-tree-0.97.0-SNAPSHOT-sources.jar
[JENKINS] Archiving <http://54.241.6.143/job/HBase-TRUNK/ws/hbase-prefix-tree/target/hbase-prefix-tree-0.97.0-SNAPSHOT-tests.jar>
to /var/lib/jenkins/jobs/HBase-TRUNK/modules/org.apache.hbase$hbase-prefix-tree/builds/2013-06-28_00-25-07/archive/org.apache.hbase/hbase-prefix-tree/0.97.0-SNAPSHOT/hbase-prefix-tree-0.97.0-SNAPSHOT-tests.jar
[JENKINS] Archiving <http://54.241.6.143/job/HBase-TRUNK/ws/hbase-protocol/pom.xml>
to /var/lib/jenkins/jobs/HBase-TRUNK/modules/org.apache.hbase$hbase-protocol/builds/2013-06-28_00-25-06/archive/org.apache.hbase/hbase-protocol/0.97.0-SNAPSHOT/hbase-protocol-0.97.0-SNAPSHOT.pom
[JENKINS] Archiving <http://54.241.6.143/job/HBase-TRUNK/ws/hbase-protocol/target/hbase-protocol-0.97.0-SNAPSHOT.jar>
to /var/lib/jenkins/jobs/HBase-TRUNK/modules/org.apache.hbase$hbase-protocol/builds/2013-06-28_00-25-06/archive/org.apache.hbase/hbase-protocol/0.97.0-SNAPSHOT/hbase-protocol-0.97.0-SNAPSHOT.jar
[JENKINS] Archiving <http://54.241.6.143/job/HBase-TRUNK/ws/hbase-protocol/target/hbase-protocol-0.97.0-SNAPSHOT-sources.jar>
to /var/lib/jenkins/jobs/HBase-TRUNK/modules/org.apache.hbase$hbase-protocol/builds/2013-06-28_00-25-06/archive/org.apache.hbase/hbase-protocol/0.97.0-SNAPSHOT/hbase-protocol-0.97.0-SNAPSHOT-sources.jar
[JENKINS] Archiving <http://54.241.6.143/job/HBase-TRUNK/ws/hbase-protocol/target/hbase-protocol-0.97.0-SNAPSHOT-tests.jar>
to /var/lib/jenkins/jobs/HBase-TRUNK/modules/org.apache.hbase$hbase-protocol/builds/2013-06-28_00-25-06/archive/org.apache.hbase/hbase-protocol/0.97.0-SNAPSHOT/hbase-protocol-0.97.0-SNAPSHOT-tests.jar
[JENKINS] Archiving <http://54.241.6.143/job/HBase-TRUNK/ws/hbase-hadoop1-compat/pom.xml>
to /var/lib/jenkins/jobs/HBase-TRUNK/modules/org.apache.hbase$hbase-hadoop1-compat/builds/2013-06-28_00-25-07/archive/org.apache.hbase/hbase-hadoop1-compat/0.97.0-SNAPSHOT/hbase-hadoop1-compat-0.97.0-SNAPSHOT.pom
[JENKINS] Archiving <http://54.241.6.143/job/HBase-TRUNK/ws/hbase-hadoop1-compat/target/hbase-hadoop1-compat-0.97.0-SNAPSHOT.jar>
to /var/lib/jenkins/jobs/HBase-TRUNK/modules/org.apache.hbase$hbase-hadoop1-compat/builds/2013-06-28_00-25-07/archive/org.apache.hbase/hbase-hadoop1-compat/0.97.0-SNAPSHOT/hbase-hadoop1-compat-0.97.0-SNAPSHOT.jar
[JENKINS] Archiving <http://54.241.6.143/job/HBase-TRUNK/ws/hbase-hadoop1-compat/target/hbase-hadoop1-compat-0.97.0-SNAPSHOT-sources.jar>
to /var/lib/jenkins/jobs/HBase-TRUNK/modules/org.apache.hbase$hbase-hadoop1-compat/builds/2013-06-28_00-25-07/archive/org.apache.hbase/hbase-hadoop1-compat/0.97.0-SNAPSHOT/hbase-hadoop1-compat-0.97.0-SNAPSHOT-sources.jar
[JENKINS] Archiving <http://54.241.6.143/job/HBase-TRUNK/ws/hbase-hadoop1-compat/target/hbase-hadoop1-compat-0.97.0-SNAPSHOT-tests.jar>
to /var/lib/jenkins/jobs/HBase-TRUNK/modules/org.apache.hbase$hbase-hadoop1-compat/builds/2013-06-28_00-25-07/archive/org.apache.hbase/hbase-hadoop1-compat/0.97.0-SNAPSHOT/hbase-hadoop1-compat-0.97.0-SNAPSHOT-tests.jar
[JENKINS] Archiving <http://54.241.6.143/job/HBase-TRUNK/ws/hbase-server/pom.xml> to
/var/lib/jenkins/jobs/HBase-TRUNK/modules/org.apache.hbase$hbase-server/builds/2013-06-28_00-25-06/archive/org.apache.hbase/hbase-server/0.97.0-SNAPSHOT/hbase-server-0.97.0-SNAPSHOT.pom
Waiting for Jenkins to finish collecting data
mavenExecutionResult exceptions not empty
message : Failed to execute goal org.apache.maven.plugins:maven-surefire-plugin:2.12-TRUNK-HBASE-2:test
(secondPartTestsExecution) on project hbase-server: Failure or timeout
cause : Failure or timeout
Stack trace : 
org.apache.maven.lifecycle.LifecycleExecutionException: Failed to execute goal org.apache.maven.plugins:maven-surefire-plugin:2.12-TRUNK-HBASE-2:test
(secondPartTestsExecution) on project hbase-server: Failure or timeout
	at org.apache.maven.lifecycle.internal.MojoExecutor.execute(MojoExecutor.java:217)
	at org.apache.maven.lifecycle.internal.MojoExecutor.execute(MojoExecutor.java:153)
	at org.apache.maven.lifecycle.internal.MojoExecutor.execute(MojoExecutor.java:145)
	at org.apache.maven.lifecycle.internal.LifecycleModuleBuilder.buildProject(LifecycleModuleBuilder.java:84)
	at org.apache.maven.lifecycle.internal.LifecycleModuleBuilder.buildProject(LifecycleModuleBuilder.java:59)
	at org.apache.maven.lifecycle.internal.LifecycleStarter.singleThreadedBuild(LifecycleStarter.java:183)
	at org.apache.maven.lifecycle.internal.LifecycleStarter.execute(LifecycleStarter.java:161)
	at org.apache.maven.DefaultMaven.doExecute(DefaultMaven.java:320)
	at org.apache.maven.DefaultMaven.execute(DefaultMaven.java:156)
	at org.jvnet.hudson.maven3.launcher.Maven3Launcher.main(Maven3Launcher.java:79)
	at sun.reflect.NativeMethodAccessorImpl.invoke0(Native Method)
	at sun.reflect.NativeMethodAccessorImpl.invoke(NativeMethodAccessorImpl.java:39)
	at sun.reflect.DelegatingMethodAccessorImpl.invoke(DelegatingMethodAccessorImpl.java:25)
	at java.lang.reflect.Method.invoke(Method.java:597)
	at org.codehaus.plexus.classworlds.launcher.Launcher.launchStandard(Launcher.java:329)
	at org.codehaus.plexus.classworlds.launcher.Launcher.launch(Launcher.java:239)
	at org.jvnet.hudson.maven3.agent.Maven3Main.launch(Maven3Main.java:158)
	at hudson.maven.Maven3Builder.call(Maven3Builder.java:100)
	at hudson.maven.Maven3Builder.call(Maven3Builder.java:66)
	at hudson.remoting.UserRequest.perform(UserRequest.java:118)
	at hudson.remoting.UserRequest.perform(UserRequest.java:48)
	at hudson.remoting.Request$2.run(Request.java:326)
	at hudson.remoting.InterceptingExecutorService$1.call(InterceptingExecutorService.java:72)
	at java.util.concurrent.FutureTask$Sync.innerRun(FutureTask.java:303)
	at java.util.concurrent.FutureTask.run(FutureTask.java:138)
	at java.util.concurrent.ThreadPoolExecutor$Worker.runTask(ThreadPoolExecutor.java:895)
	at java.util.concurrent.ThreadPoolExecutor$Worker.run(ThreadPoolExecutor.java:918)
	at java.lang.Thread.run(Thread.java:662)
Caused by: org.apache.maven.plugin.MojoExecutionException: Failure or timeout
	at org.apache.maven.plugin.surefire.SurefirePlugin.assertNoFailureOrTimeout(SurefirePlugin.java:643)
	at org.apache.maven.plugin.surefire.SurefirePlugin.handleSummary(SurefirePlugin.java:624)
	at org.apache.maven.plugin.surefire.AbstractSurefireMojo.executeAfterPreconditionsChecked(AbstractSurefireMojo.java:137)
	at org.apache.maven.plugin.surefire.AbstractSurefireMojo.execute(AbstractSurefireMojo.java:98)
	at org.apache.maven.plugin.DefaultBuildPluginManager.executeMojo(DefaultBuildPluginManager.java:101)
	at org.apache.maven.lifecycle.internal.MojoExecutor.execute(MojoExecutor.java:209)
	... 27 more
channel stopped

Mime
View raw message