hbase-builds mailing list archives

Site index · List index
Message view « Date » · « Thread »
Top « Date » · « Thread »
From Stack <st...@duboce.net>
Subject Re: Build failed in Jenkins: HBase-0.95-Hadoop-2 #518
Date Fri, 28 Jun 2013 21:25:41 GMT
I added back maxpermsize of 1g for both 0.95 builds.  It failed again w/
OOME perm gen

-Xmx4g -XX:+CMSClassUnloadingEnabled -XX:+CMSPermGenSweepingEnabled
-XX:MaxPermSize=1g

St.Ack


On Fri, Jun 28, 2013 at 2:18 PM, <apurtell@apache.org> wrote:

> See <http://54.241.6.143/job/HBase-0.95-Hadoop-2/518/>
>
> ------------------------------------------
> [...truncated 7757 lines...]
> Running org.apache.hadoop.hbase.security.access.TestZKPermissionsWatcher
> Tests run: 1, Failures: 0, Errors: 0, Skipped: 0, Time elapsed: 9.886 sec
> Running org.apache.hadoop.hbase.security.access.TestAccessControlFilter
> Tests run: 1, Failures: 0, Errors: 0, Skipped: 0, Time elapsed: 12.097 sec
> Running org.apache.hadoop.hbase.backup.TestHFileArchiving
> Tests run: 5, Failures: 0, Errors: 0, Skipped: 0, Time elapsed: 88.797 sec
> Running org.apache.hadoop.hbase.security.access.TestTablePermissions
> Tests run: 7, Failures: 0, Errors: 0, Skipped: 0, Time elapsed: 26.034 sec
> Running org.apache.hadoop.hbase.TestRegionRebalancing
> Tests run: 2, Failures: 0, Errors: 0, Skipped: 0, Time elapsed: 34.17 sec
> Running org.apache.hadoop.hbase.snapshot.TestSnapshotDescriptionUtils
> Tests run: 2, Failures: 0, Errors: 0, Skipped: 0, Time elapsed: 1.22 sec
> Running org.apache.hadoop.hbase.TestFullLogReconstruction
> Tests run: 1, Failures: 0, Errors: 0, Skipped: 0, Time elapsed: 33.689 sec
> Running org.apache.hadoop.hbase.snapshot.TestFlushSnapshotFromClient
> Tests run: 5, Failures: 0, Errors: 0, Skipped: 0, Time elapsed: 41.594 sec
> Running org.apache.hadoop.hbase.snapshot.TestExportSnapshot
> Tests run: 4, Failures: 0, Errors: 0, Skipped: 0, Time elapsed: 33.516 sec
> Running org.apache.hadoop.hbase.mapred.TestTableInputFormat
> Tests run: 10, Failures: 0, Errors: 0, Skipped: 0, Time elapsed: 27.679 sec
> Running org.apache.hadoop.hbase.filter.TestFilterWrapper
> Tests run: 1, Failures: 0, Errors: 0, Skipped: 0, Time elapsed: 15.086 sec
> Running org.apache.hadoop.hbase.filter.TestFilterWithScanLimits
> Tests run: 1, Failures: 0, Errors: 0, Skipped: 0, Time elapsed: 17.463 sec
> Running org.apache.hadoop.hbase.filter.TestColumnRangeFilter
> Tests run: 1, Failures: 0, Errors: 0, Skipped: 0, Time elapsed: 22.924 sec
> Running org.apache.hadoop.hbase.mapreduce.TestTableMapReduceUtil
> Tests run: 1, Failures: 0, Errors: 0, Skipped: 0, Time elapsed: 5.875 sec
> Running org.apache.hadoop.hbase.security.access.TestAccessController
> Tests run: 39, Failures: 0, Errors: 0, Skipped: 1, Time elapsed: 147.75 sec
> Running org.apache.hadoop.hbase.mapred.TestTableMapReduce
> Tests run: 1, Failures: 0, Errors: 0, Skipped: 0, Time elapsed: 79.322 sec
> Running org.apache.hadoop.hbase.snapshot.TestRestoreFlushSnapshotFromClient
> Tests run: 5, Failures: 0, Errors: 0, Skipped: 0, Time elapsed: 95.793 sec
> Running org.apache.hadoop.hbase.mapreduce.TestHRegionPartitioner
> Tests run: 1, Failures: 0, Errors: 0, Skipped: 0, Time elapsed: 28.336 sec
> Running org.apache.hadoop.hbase.mapreduce.TestLoadIncrementalHFiles
> Tests run: 7, Failures: 0, Errors: 0, Skipped: 0, Time elapsed: 24.351 sec
> Running org.apache.hadoop.hbase.mapreduce.TestMultithreadedTableMapper
> Tests run: 1, Failures: 0, Errors: 0, Skipped: 0, Time elapsed: 205.101 sec
> Running org.apache.hadoop.hbase.mapreduce.TestTimeRangeMapRed
> Tests run: 1, Failures: 0, Errors: 0, Skipped: 0, Time elapsed: 100.23 sec
> java.lang.OutOfMemoryError: PermGen space
> org.apache.maven.surefire.booter.SurefireBooterForkException: Error
> occurred in starting fork, check output in log
>         at
> org.apache.maven.plugin.surefire.booterclient.ForkStarter.fork(ForkStarter.java:238)
>         at
> org.apache.maven.plugin.surefire.booterclient.ForkStarter.access$000(ForkStarter.java:64)
>         at
> org.apache.maven.plugin.surefire.booterclient.ForkStarter$ParallelFork.call(ForkStarter.java:303)
>         at
> org.apache.maven.plugin.surefire.booterclient.ForkStarter$ParallelFork.call(ForkStarter.java:285)
>         at
> java.util.concurrent.FutureTask$Sync.innerRun(FutureTask.java:303)
>         at java.util.concurrent.FutureTask.run(FutureTask.java:138)
>         at
> java.util.concurrent.ThreadPoolExecutor$Worker.runTask(ThreadPoolExecutor.java:895)
>         at
> java.util.concurrent.ThreadPoolExecutor$Worker.run(ThreadPoolExecutor.java:918)
>         at java.lang.Thread.run(Thread.java:662)
> org.apache.maven.surefire.booter.SurefireBooterForkException: Error
> occurred in starting fork, check output in log
>         at
> org.apache.maven.plugin.surefire.booterclient.ForkStarter.fork(ForkStarter.java:238)
>         at
> org.apache.maven.plugin.surefire.booterclient.ForkStarter.access$000(ForkStarter.java:64)
>         at
> org.apache.maven.plugin.surefire.booterclient.ForkStarter$ParallelFork.call(ForkStarter.java:303)
>         at
> org.apache.maven.plugin.surefire.booterclient.ForkStarter$ParallelFork.call(ForkStarter.java:285)
>         at
> java.util.concurrent.FutureTask$Sync.innerRun(FutureTask.java:303)
>         at java.util.concurrent.FutureTask.run(FutureTask.java:138)
>         at
> java.util.concurrent.ThreadPoolExecutor$Worker.runTask(ThreadPoolExecutor.java:895)
>         at
> java.util.concurrent.ThreadPoolExecutor$Worker.run(ThreadPoolExecutor.java:918)
>         at java.lang.Thread.run(Thread.java:662)
> Running org.apache.hadoop.hbase.mapreduce.TestHLogRecordReader
> Tests run: 2, Failures: 0, Errors: 0, Skipped: 0, Time elapsed: 11.328 sec
> org.apache.maven.surefire.booter.SurefireBooterForkException: Error
> occurred in starting fork, check output in log
>         at
> org.apache.maven.plugin.surefire.booterclient.ForkStarter.fork(ForkStarter.java:238)
>         at
> org.apache.maven.plugin.surefire.booterclient.ForkStarter.access$000(ForkStarter.java:64)
>         at
> org.apache.maven.plugin.surefire.booterclient.ForkStarter$ParallelFork.call(ForkStarter.java:303)
>         at
> org.apache.maven.plugin.surefire.booterclient.ForkStarter$ParallelFork.call(ForkStarter.java:285)
>         at
> java.util.concurrent.FutureTask$Sync.innerRun(FutureTask.java:303)
>         at java.util.concurrent.FutureTask.run(FutureTask.java:138)
>         at
> java.util.concurrent.ThreadPoolExecutor$Worker.runTask(ThreadPoolExecutor.java:895)
>         at
> java.util.concurrent.ThreadPoolExecutor$Worker.run(ThreadPoolExecutor.java:918)
>         at java.lang.Thread.run(Thread.java:662)
> Running org.apache.hadoop.hbase.mapreduce.TestCopyTable
> Tests run: 4, Failures: 0, Errors: 0, Skipped: 0, Time elapsed: 245.764 sec
> Running org.apache.hadoop.hbase.mapreduce.TestCellCounter
> Tests run: 2, Failures: 0, Errors: 0, Skipped: 0, Time elapsed: 135.801 sec
> Running org.apache.hadoop.hbase.mapreduce.TestSecureLoadIncrementalHFiles
> Tests run: 7, Failures: 0, Errors: 0, Skipped: 0, Time elapsed: 24.266 sec
> Running org.apache.hadoop.hbase.mapreduce.TestImportExport
> Tests run: 9, Failures: 0, Errors: 0, Skipped: 0, Time elapsed: 583.545 sec
> No results for java.util.concurrent.FutureTask@1831418c
> No results for java.util.concurrent.FutureTask@49c65abc
> No results for java.util.concurrent.FutureTask@7d6f127a
> Running
> org.apache.hadoop.hbase.mapreduce.TestSecureLoadIncrementalHFilesSplitRecovery
> Tests run: 4, Failures: 0, Errors: 0, Skipped: 0, Time elapsed: 43.661 sec
> Running org.apache.hadoop.hbase.mapreduce.TestWALPlayer
> Tests run: 3, Failures: 0, Errors: 0, Skipped: 0, Time elapsed: 116.175 sec
> Running org.apache.hadoop.hbase.mapreduce.TestTableMapReduce
> Tests run: 2, Failures: 0, Errors: 0, Skipped: 0, Time elapsed: 362.168 sec
> Running org.apache.hadoop.hbase.constraint.TestConstraint
> Tests run: 5, Failures: 0, Errors: 0, Skipped: 0, Time elapsed: 29.217 sec
> Running org.apache.hadoop.hbase.mapreduce.TestRowCounter
> Tests run: 4, Failures: 0, Errors: 0, Skipped: 0, Time elapsed: 178.284 sec
> Running org.apache.hadoop.hbase.trace.TestHTraceHooks
> Tests run: 1, Failures: 0, Errors: 0, Skipped: 0, Time elapsed: 18.96 sec
> Running org.apache.hadoop.hbase.thrift.TestThriftServerCmdLine
> Tests run: 32, Failures: 0, Errors: 0, Skipped: 0, Time elapsed: 66.46 sec
> Running org.apache.hadoop.hbase.replication.TestReplicationStateZKImpl
> Tests run: 3, Failures: 0, Errors: 0, Skipped: 0, Time elapsed: 9.377 sec
> Running org.apache.hadoop.hbase.thrift.TestThriftServer
> Tests run: 1, Failures: 0, Errors: 0, Skipped: 0, Time elapsed: 153.399 sec
> Running org.apache.hadoop.hbase.mapreduce.TestImportTsv
> Tests run: 5, Failures: 0, Errors: 0, Skipped: 0, Time elapsed: 323.935 sec
> Running
> org.apache.hadoop.hbase.replication.TestReplicationQueueFailoverCompressed
> Tests run: 1, Failures: 0, Errors: 0, Skipped: 0, Time elapsed: 100.248 sec
> Running
> org.apache.hadoop.hbase.replication.regionserver.TestReplicationSourceManager
> Tests run: 3, Failures: 0, Errors: 0, Skipped: 0, Time elapsed: 7.657 sec
> Running
> org.apache.hadoop.hbase.replication.regionserver.TestReplicationSink
> Tests run: 5, Failures: 0, Errors: 0, Skipped: 0, Time elapsed: 23.961 sec
> Running
> org.apache.hadoop.hbase.replication.TestReplicationDisableInactivePeer
> Tests run: 1, Failures: 0, Errors: 0, Skipped: 0, Time elapsed: 67.936 sec
> Running org.apache.hadoop.hbase.replication.TestReplicationQueueFailover
> Tests run: 1, Failures: 0, Errors: 0, Skipped: 0, Time elapsed: 74.36 sec
> Running org.apache.hadoop.hbase.replication.TestReplicationSource
> Tests run: 1, Failures: 0, Errors: 0, Skipped: 0, Time elapsed: 5.644 sec
> Running org.apache.hadoop.hbase.replication.TestReplicationZookeeper
> Tests run: 4, Failures: 0, Errors: 0, Skipped: 0, Time elapsed: 1.569 sec
> Running org.apache.hadoop.hbase.replication.TestMultiSlaveReplication
> Tests run: 1, Failures: 0, Errors: 0, Skipped: 0, Time elapsed: 35.748 sec
> Running org.apache.hadoop.hbase.replication.TestMasterReplication
> Tests run: 2, Failures: 0, Errors: 0, Skipped: 0, Time elapsed: 47.082 sec
> org.apache.maven.surefire.booter.SurefireBooterForkException: Error
> occurred in starting fork, check output in log
>         at
> org.apache.maven.plugin.surefire.booterclient.ForkStarter.fork(ForkStarter.java:238)
>         at
> org.apache.maven.plugin.surefire.booterclient.ForkStarter.access$000(ForkStarter.java:64)
>         at
> org.apache.maven.plugin.surefire.booterclient.ForkStarter$ParallelFork.call(ForkStarter.java:303)
>         at
> org.apache.maven.plugin.surefire.booterclient.ForkStarter$ParallelFork.call(ForkStarter.java:285)
>         at
> java.util.concurrent.FutureTask$Sync.innerRun(FutureTask.java:303)
>         at java.util.concurrent.FutureTask.run(FutureTask.java:138)
>         at
> java.util.concurrent.ThreadPoolExecutor$Worker.runTask(ThreadPoolExecutor.java:895)
>         at
> java.util.concurrent.ThreadPoolExecutor$Worker.run(ThreadPoolExecutor.java:918)
>         at java.lang.Thread.run(Thread.java:662)
> Running org.apache.hadoop.hbase.replication.TestReplicationSmallTests
> Tests run: 8, Failures: 0, Errors: 0, Skipped: 0, Time elapsed: 61.469 sec
> Running
> org.apache.hadoop.hbase.mapreduce.TestLoadIncrementalHFilesSplitRecovery
> Tests run: 4, Failures: 0, Errors: 0, Skipped: 0, Time elapsed: 764.065 sec
> No results for java.util.concurrent.FutureTask@6f5c87c7
>
> Results :
>
> Tests run: 1430, Failures: 0, Errors: 0, Skipped: 15
>
> [JENKINS] Recording test results
> [INFO]
> [INFO]
> ------------------------------------------------------------------------
> [INFO] Skipping HBase
> [INFO] This project has been banned from the build due to previous
> failures.
> [INFO]
> ------------------------------------------------------------------------
> [INFO]
> [INFO]
> ------------------------------------------------------------------------
> [INFO] Skipping HBase
> [INFO] This project has been banned from the build due to previous
> failures.
> [INFO]
> ------------------------------------------------------------------------
> [INFO]
> ------------------------------------------------------------------------
> [INFO] Reactor Summary:
> [INFO]
> [INFO] HBase ............................................. SUCCESS
> [40.300s]
> [INFO] HBase - Common .................................... SUCCESS
> [1:37.028s]
> [INFO] HBase - Protocol .................................. SUCCESS
> [17.882s]
> [INFO] HBase - Client .................................... SUCCESS
> [25.141s]
> [INFO] HBase - Prefix Tree ............................... SUCCESS [5.391s]
> [INFO] HBase - Hadoop Compatibility ...................... SUCCESS [6.036s]
> [INFO] HBase - Hadoop Two Compatibility .................. SUCCESS
> [20.317s]
> [INFO] HBase - Server .................................... FAILURE
> [58:25.424s]
> [INFO] HBase - Integration Tests ......................... SKIPPED
> [INFO] HBase - Examples .................................. SKIPPED
> [INFO] HBase - Assembly .................................. SKIPPED
> [INFO]
> ------------------------------------------------------------------------
> [INFO] BUILD FAILURE
> [INFO]
> ------------------------------------------------------------------------
> [INFO] Total time: 1:02:29.498s
> [INFO] Finished at: Fri Jun 28 21:17:57 UTC 2013
> [INFO] Final Memory: 128M/649M
> [INFO]
> ------------------------------------------------------------------------
> [JENKINS] Archiving <
> http://54.241.6.143/job/HBase-0.95-Hadoop-2/ws/hbase-hadoop2-compat/pom.xml>
> to
> /var/lib/jenkins/jobs/HBase-0.95-Hadoop-2/modules/org.apache.hbase$hbase-hadoop2-compat/builds/2013-06-28_20-15-21/archive/org.apache.hbase/hbase-hadoop2-compat/0.97.0-SNAPSHOT/hbase-hadoop2-compat-0.97.0-SNAPSHOT.pom
> [JENKINS] Archiving <
> http://54.241.6.143/job/HBase-0.95-Hadoop-2/ws/hbase-hadoop2-compat/target/hbase-hadoop2-compat-0.97.0-SNAPSHOT.jar>
> to
> /var/lib/jenkins/jobs/HBase-0.95-Hadoop-2/modules/org.apache.hbase$hbase-hadoop2-compat/builds/2013-06-28_20-15-21/archive/org.apache.hbase/hbase-hadoop2-compat/0.97.0-SNAPSHOT/hbase-hadoop2-compat-0.97.0-SNAPSHOT.jar
> [JENKINS] Archiving <
> http://54.241.6.143/job/HBase-0.95-Hadoop-2/ws/hbase-hadoop2-compat/target/hbase-hadoop2-compat-0.97.0-SNAPSHOT-sources.jar>
> to
> /var/lib/jenkins/jobs/HBase-0.95-Hadoop-2/modules/org.apache.hbase$hbase-hadoop2-compat/builds/2013-06-28_20-15-21/archive/org.apache.hbase/hbase-hadoop2-compat/0.97.0-SNAPSHOT/hbase-hadoop2-compat-0.97.0-SNAPSHOT-sources.jar
> [JENKINS] Archiving <
> http://54.241.6.143/job/HBase-0.95-Hadoop-2/ws/hbase-hadoop2-compat/target/hbase-hadoop2-compat-0.97.0-SNAPSHOT-tests.jar>
> to
> /var/lib/jenkins/jobs/HBase-0.95-Hadoop-2/modules/org.apache.hbase$hbase-hadoop2-compat/builds/2013-06-28_20-15-21/archive/org.apache.hbase/hbase-hadoop2-compat/0.97.0-SNAPSHOT/hbase-hadoop2-compat-0.97.0-SNAPSHOT-tests.jar
> [JENKINS] Archiving <
> http://54.241.6.143/job/HBase-0.95-Hadoop-2/ws/hbase-common/pom.xml> to
> /var/lib/jenkins/jobs/HBase-0.95-Hadoop-2/modules/org.apache.hbase$hbase-common/builds/2013-06-28_20-15-21/archive/org.apache.hbase/hbase-common/0.97.0-SNAPSHOT/hbase-common-0.97.0-SNAPSHOT.pom
> [JENKINS] Archiving <
> http://54.241.6.143/job/HBase-0.95-Hadoop-2/ws/hbase-common/target/hbase-common-0.97.0-SNAPSHOT.jar>
> to
> /var/lib/jenkins/jobs/HBase-0.95-Hadoop-2/modules/org.apache.hbase$hbase-common/builds/2013-06-28_20-15-21/archive/org.apache.hbase/hbase-common/0.97.0-SNAPSHOT/hbase-common-0.97.0-SNAPSHOT.jar
> [JENKINS] Archiving <
> http://54.241.6.143/job/HBase-0.95-Hadoop-2/ws/hbase-common/target/hbase-common-0.97.0-SNAPSHOT-sources.jar>
> to
> /var/lib/jenkins/jobs/HBase-0.95-Hadoop-2/modules/org.apache.hbase$hbase-common/builds/2013-06-28_20-15-21/archive/org.apache.hbase/hbase-common/0.97.0-SNAPSHOT/hbase-common-0.97.0-SNAPSHOT-sources.jar
> [JENKINS] Archiving <
> http://54.241.6.143/job/HBase-0.95-Hadoop-2/ws/hbase-common/target/hbase-common-0.97.0-SNAPSHOT-tests.jar>
> to
> /var/lib/jenkins/jobs/HBase-0.95-Hadoop-2/modules/org.apache.hbase$hbase-common/builds/2013-06-28_20-15-21/archive/org.apache.hbase/hbase-common/0.97.0-SNAPSHOT/hbase-common-0.97.0-SNAPSHOT-tests.jar
> [JENKINS] Archiving <
> http://54.241.6.143/job/HBase-0.95-Hadoop-2/ws/hbase-hadoop-compat/pom.xml>
> to
> /var/lib/jenkins/jobs/HBase-0.95-Hadoop-2/modules/org.apache.hbase$hbase-hadoop-compat/builds/2013-06-28_20-15-21/archive/org.apache.hbase/hbase-hadoop-compat/0.97.0-SNAPSHOT/hbase-hadoop-compat-0.97.0-SNAPSHOT.pom
> [JENKINS] Archiving <
> http://54.241.6.143/job/HBase-0.95-Hadoop-2/ws/hbase-hadoop-compat/target/hbase-hadoop-compat-0.97.0-SNAPSHOT.jar>
> to
> /var/lib/jenkins/jobs/HBase-0.95-Hadoop-2/modules/org.apache.hbase$hbase-hadoop-compat/builds/2013-06-28_20-15-21/archive/org.apache.hbase/hbase-hadoop-compat/0.97.0-SNAPSHOT/hbase-hadoop-compat-0.97.0-SNAPSHOT.jar
> [JENKINS] Archiving <
> http://54.241.6.143/job/HBase-0.95-Hadoop-2/ws/hbase-hadoop-compat/target/hbase-hadoop-compat-0.97.0-SNAPSHOT-sources.jar>
> to
> /var/lib/jenkins/jobs/HBase-0.95-Hadoop-2/modules/org.apache.hbase$hbase-hadoop-compat/builds/2013-06-28_20-15-21/archive/org.apache.hbase/hbase-hadoop-compat/0.97.0-SNAPSHOT/hbase-hadoop-compat-0.97.0-SNAPSHOT-sources.jar
> [JENKINS] Archiving <
> http://54.241.6.143/job/HBase-0.95-Hadoop-2/ws/hbase-hadoop-compat/target/hbase-hadoop-compat-0.97.0-SNAPSHOT-tests.jar>
> to
> /var/lib/jenkins/jobs/HBase-0.95-Hadoop-2/modules/org.apache.hbase$hbase-hadoop-compat/builds/2013-06-28_20-15-21/archive/org.apache.hbase/hbase-hadoop-compat/0.97.0-SNAPSHOT/hbase-hadoop-compat-0.97.0-SNAPSHOT-tests.jar
> [JENKINS] Archiving <
> http://54.241.6.143/job/HBase-0.95-Hadoop-2/ws/hbase-examples/pom.xml> to
> /var/lib/jenkins/jobs/HBase-0.95-Hadoop-2/modules/org.apache.hbase$hbase-examples/builds/2013-06-28_20-15-21/archive/org.apache.hbase/hbase-examples/0.97.0-SNAPSHOT/hbase-examples-0.97.0-SNAPSHOT.pom
> [JENKINS] Archiving <
> http://54.241.6.143/job/HBase-0.95-Hadoop-2/ws/hbase-it/pom.xml> to
> /var/lib/jenkins/jobs/HBase-0.95-Hadoop-2/modules/org.apache.hbase$hbase-it/builds/2013-06-28_20-15-21/archive/org.apache.hbase/hbase-it/0.97.0-SNAPSHOT/hbase-it-0.97.0-SNAPSHOT.pom
> [JENKINS] Archiving <
> http://54.241.6.143/job/HBase-0.95-Hadoop-2/ws/pom.xml> to
> /var/lib/jenkins/jobs/HBase-0.95-Hadoop-2/modules/org.apache.hbase$hbase/builds/2013-06-28_20-15-21/archive/org.apache.hbase/hbase/0.97.0-SNAPSHOT/hbase-0.97.0-SNAPSHOT.pom
> [JENKINS] Archiving <
> http://54.241.6.143/job/HBase-0.95-Hadoop-2/ws/target/hbase-0.97.0-SNAPSHOT-site.xml>
> to
> /var/lib/jenkins/jobs/HBase-0.95-Hadoop-2/modules/org.apache.hbase$hbase/builds/2013-06-28_20-15-21/archive/org.apache.hbase/hbase/0.97.0-SNAPSHOT/hbase-0.97.0-SNAPSHOT-site.xml
> [JENKINS] Archiving <
> http://54.241.6.143/job/HBase-0.95-Hadoop-2/ws/hbase-assembly/pom.xml> to
> /var/lib/jenkins/jobs/HBase-0.95-Hadoop-2/modules/org.apache.hbase$hbase-assembly/builds/2013-06-28_20-15-21/archive/org.apache.hbase/hbase-assembly/0.97.0-SNAPSHOT/hbase-assembly-0.97.0-SNAPSHOT.pom
> [JENKINS] Archiving <
> http://54.241.6.143/job/HBase-0.95-Hadoop-2/ws/hbase-client/pom.xml> to
> /var/lib/jenkins/jobs/HBase-0.95-Hadoop-2/modules/org.apache.hbase$hbase-client/builds/2013-06-28_20-15-21/archive/org.apache.hbase/hbase-client/0.97.0-SNAPSHOT/hbase-client-0.97.0-SNAPSHOT.pom
> [JENKINS] Archiving <
> http://54.241.6.143/job/HBase-0.95-Hadoop-2/ws/hbase-client/target/hbase-client-0.97.0-SNAPSHOT.jar>
> to
> /var/lib/jenkins/jobs/HBase-0.95-Hadoop-2/modules/org.apache.hbase$hbase-client/builds/2013-06-28_20-15-21/archive/org.apache.hbase/hbase-client/0.97.0-SNAPSHOT/hbase-client-0.97.0-SNAPSHOT.jar
> [JENKINS] Archiving <
> http://54.241.6.143/job/HBase-0.95-Hadoop-2/ws/hbase-client/target/hbase-client-0.97.0-SNAPSHOT-sources.jar>
> to
> /var/lib/jenkins/jobs/HBase-0.95-Hadoop-2/modules/org.apache.hbase$hbase-client/builds/2013-06-28_20-15-21/archive/org.apache.hbase/hbase-client/0.97.0-SNAPSHOT/hbase-client-0.97.0-SNAPSHOT-sources.jar
> [JENKINS] Archiving <
> http://54.241.6.143/job/HBase-0.95-Hadoop-2/ws/hbase-client/target/hbase-client-0.97.0-SNAPSHOT-tests.jar>
> to
> /var/lib/jenkins/jobs/HBase-0.95-Hadoop-2/modules/org.apache.hbase$hbase-client/builds/2013-06-28_20-15-21/archive/org.apache.hbase/hbase-client/0.97.0-SNAPSHOT/hbase-client-0.97.0-SNAPSHOT-tests.jar
> [JENKINS] Archiving <
> http://54.241.6.143/job/HBase-0.95-Hadoop-2/ws/hbase-prefix-tree/pom.xml>
> to
> /var/lib/jenkins/jobs/HBase-0.95-Hadoop-2/modules/org.apache.hbase$hbase-prefix-tree/builds/2013-06-28_20-15-21/archive/org.apache.hbase/hbase-prefix-tree/0.97.0-SNAPSHOT/hbase-prefix-tree-0.97.0-SNAPSHOT.pom
> [JENKINS] Archiving <
> http://54.241.6.143/job/HBase-0.95-Hadoop-2/ws/hbase-prefix-tree/target/hbase-prefix-tree-0.97.0-SNAPSHOT.jar>
> to
> /var/lib/jenkins/jobs/HBase-0.95-Hadoop-2/modules/org.apache.hbase$hbase-prefix-tree/builds/2013-06-28_20-15-21/archive/org.apache.hbase/hbase-prefix-tree/0.97.0-SNAPSHOT/hbase-prefix-tree-0.97.0-SNAPSHOT.jar
> [JENKINS] Archiving <
> http://54.241.6.143/job/HBase-0.95-Hadoop-2/ws/hbase-prefix-tree/target/hbase-prefix-tree-0.97.0-SNAPSHOT-sources.jar>
> to
> /var/lib/jenkins/jobs/HBase-0.95-Hadoop-2/modules/org.apache.hbase$hbase-prefix-tree/builds/2013-06-28_20-15-21/archive/org.apache.hbase/hbase-prefix-tree/0.97.0-SNAPSHOT/hbase-prefix-tree-0.97.0-SNAPSHOT-sources.jar
> [JENKINS] Archiving <
> http://54.241.6.143/job/HBase-0.95-Hadoop-2/ws/hbase-prefix-tree/target/hbase-prefix-tree-0.97.0-SNAPSHOT-tests.jar>
> to
> /var/lib/jenkins/jobs/HBase-0.95-Hadoop-2/modules/org.apache.hbase$hbase-prefix-tree/builds/2013-06-28_20-15-21/archive/org.apache.hbase/hbase-prefix-tree/0.97.0-SNAPSHOT/hbase-prefix-tree-0.97.0-SNAPSHOT-tests.jar
> [JENKINS] Archiving <
> http://54.241.6.143/job/HBase-0.95-Hadoop-2/ws/hbase-protocol/pom.xml> to
> /var/lib/jenkins/jobs/HBase-0.95-Hadoop-2/modules/org.apache.hbase$hbase-protocol/builds/2013-06-28_20-15-21/archive/org.apache.hbase/hbase-protocol/0.97.0-SNAPSHOT/hbase-protocol-0.97.0-SNAPSHOT.pom
> [JENKINS] Archiving <
> http://54.241.6.143/job/HBase-0.95-Hadoop-2/ws/hbase-protocol/target/hbase-protocol-0.97.0-SNAPSHOT.jar>
> to
> /var/lib/jenkins/jobs/HBase-0.95-Hadoop-2/modules/org.apache.hbase$hbase-protocol/builds/2013-06-28_20-15-21/archive/org.apache.hbase/hbase-protocol/0.97.0-SNAPSHOT/hbase-protocol-0.97.0-SNAPSHOT.jar
> [JENKINS] Archiving <
> http://54.241.6.143/job/HBase-0.95-Hadoop-2/ws/hbase-protocol/target/hbase-protocol-0.97.0-SNAPSHOT-sources.jar>
> to
> /var/lib/jenkins/jobs/HBase-0.95-Hadoop-2/modules/org.apache.hbase$hbase-protocol/builds/2013-06-28_20-15-21/archive/org.apache.hbase/hbase-protocol/0.97.0-SNAPSHOT/hbase-protocol-0.97.0-SNAPSHOT-sources.jar
> [JENKINS] Archiving <
> http://54.241.6.143/job/HBase-0.95-Hadoop-2/ws/hbase-protocol/target/hbase-protocol-0.97.0-SNAPSHOT-tests.jar>
> to
> /var/lib/jenkins/jobs/HBase-0.95-Hadoop-2/modules/org.apache.hbase$hbase-protocol/builds/2013-06-28_20-15-21/archive/org.apache.hbase/hbase-protocol/0.97.0-SNAPSHOT/hbase-protocol-0.97.0-SNAPSHOT-tests.jar
> [JENKINS] Archiving <
> http://54.241.6.143/job/HBase-0.95-Hadoop-2/ws/hbase-server/pom.xml> to
> /var/lib/jenkins/jobs/HBase-0.95-Hadoop-2/modules/org.apache.hbase$hbase-server/builds/2013-06-28_20-15-21/archive/org.apache.hbase/hbase-server/0.97.0-SNAPSHOT/hbase-server-0.97.0-SNAPSHOT.pom
> Waiting for Jenkins to finish collecting data
> mavenExecutionResult exceptions not empty
> message : Failed to execute goal
> org.apache.maven.plugins:maven-surefire-plugin:2.12-TRUNK-HBASE-2:test
> (secondPartTestsExecution) on project hbase-server: Failure or timeout
> cause : Failure or timeout
> Stack trace :
> org.apache.maven.lifecycle.LifecycleExecutionException: Failed to execute
> goal org.apache.maven.plugins:maven-surefire-plugin:2.12-TRUNK-HBASE-2:test
> (secondPartTestsExecution) on project hbase-server: Failure or timeout
>         at
> org.apache.maven.lifecycle.internal.MojoExecutor.execute(MojoExecutor.java:217)
>         at
> org.apache.maven.lifecycle.internal.MojoExecutor.execute(MojoExecutor.java:153)
>         at
> org.apache.maven.lifecycle.internal.MojoExecutor.execute(MojoExecutor.java:145)
>         at
> org.apache.maven.lifecycle.internal.LifecycleModuleBuilder.buildProject(LifecycleModuleBuilder.java:84)
>         at
> org.apache.maven.lifecycle.internal.LifecycleModuleBuilder.buildProject(LifecycleModuleBuilder.java:59)
>         at
> org.apache.maven.lifecycle.internal.LifecycleStarter.singleThreadedBuild(LifecycleStarter.java:183)
>         at
> org.apache.maven.lifecycle.internal.LifecycleStarter.execute(LifecycleStarter.java:161)
>         at org.apache.maven.DefaultMaven.doExecute(DefaultMaven.java:320)
>         at org.apache.maven.DefaultMaven.execute(DefaultMaven.java:156)
>         at
> org.jvnet.hudson.maven3.launcher.Maven3Launcher.main(Maven3Launcher.java:79)
>         at sun.reflect.NativeMethodAccessorImpl.invoke0(Native Method)
>         at
> sun.reflect.NativeMethodAccessorImpl.invoke(NativeMethodAccessorImpl.java:39)
>         at
> sun.reflect.DelegatingMethodAccessorImpl.invoke(DelegatingMethodAccessorImpl.java:25)
>         at java.lang.reflect.Method.invoke(Method.java:597)
>         at
> org.codehaus.plexus.classworlds.launcher.Launcher.launchStandard(Launcher.java:329)
>         at
> org.codehaus.plexus.classworlds.launcher.Launcher.launch(Launcher.java:239)
>         at
> org.jvnet.hudson.maven3.agent.Maven3Main.launch(Maven3Main.java:158)
>         at hudson.maven.Maven3Builder.call(Maven3Builder.java:100)
>         at hudson.maven.Maven3Builder.call(Maven3Builder.java:66)
>         at hudson.remoting.UserRequest.perform(UserRequest.java:118)
>         at hudson.remoting.UserRequest.perform(UserRequest.java:48)
>         at hudson.remoting.Request$2.run(Request.java:326)
>         at
> hudson.remoting.InterceptingExecutorService$1.call(InterceptingExecutorService.java:72)
>         at
> java.util.concurrent.FutureTask$Sync.innerRun(FutureTask.java:303)
>         at java.util.concurrent.FutureTask.run(FutureTask.java:138)
>         at
> java.util.concurrent.ThreadPoolExecutor$Worker.runTask(ThreadPoolExecutor.java:895)
>         at
> java.util.concurrent.ThreadPoolExecutor$Worker.run(ThreadPoolExecutor.java:918)
>         at java.lang.Thread.run(Thread.java:662)
> Caused by: org.apache.maven.plugin.MojoExecutionException: Failure or
> timeout
>         at
> org.apache.maven.plugin.surefire.SurefirePlugin.assertNoFailureOrTimeout(SurefirePlugin.java:643)
>         at
> org.apache.maven.plugin.surefire.SurefirePlugin.handleSummary(SurefirePlugin.java:624)
>         at
> org.apache.maven.plugin.surefire.AbstractSurefireMojo.executeAfterPreconditionsChecked(AbstractSurefireMojo.java:137)
>         at
> org.apache.maven.plugin.surefire.AbstractSurefireMojo.execute(AbstractSurefireMojo.java:98)
>         at
> org.apache.maven.plugin.DefaultBuildPluginManager.executeMojo(DefaultBuildPluginManager.java:101)
>         at
> org.apache.maven.lifecycle.internal.MojoExecutor.execute(MojoExecutor.java:209)
>         ... 27 more
> channel stopped
>

Mime
  • Unnamed multipart/alternative (inline, None, 0 bytes)
View raw message