hbase-builds mailing list archives

Site index · List index
Message view « Date » · « Thread »
Top « Date » · « Thread »
From Apache Jenkins Server <jenk...@builds.apache.org>
Subject Build failed in Jenkins: HBase-0.94-security #346
Date Wed, 27 Nov 2013 04:01:34 GMT
See <https://builds.apache.org/job/HBase-0.94-security/346/changes>

Changes:

[larsh] HBASE-10015 Replace intrinsic locking with explicit locks in StoreScanner

[jxiang] HBASE-10026 HBaseAdmin#createTable could fail if region splits too fast

[larsh] roll version to 0.94.15-SNAPSHOT

------------------------------------------
[...truncated 20651 lines...]
Running org.apache.hadoop.hbase.coprocessor.TestAggregateProtocol
Tests run: 45, Failures: 0, Errors: 0, Skipped: 0, Time elapsed: 21.028 sec
Forking command line: /bin/sh -c cd <https://builds.apache.org/job/HBase-0.94-security/ws/trunk>
&& /home/jenkins/tools/java/jdk1.6.0_45-32/jre/bin/java -enableassertions -Xmx1900m
-Djava.security.egd=file:/dev/./urandom -jar <https://builds.apache.org/job/HBase-0.94-security/ws/trunk/target/surefire/surefirebooter8793413116914778076.jar>
<https://builds.apache.org/job/HBase-0.94-security/ws/trunk/target/surefire/surefire1942276913649550713tmp>
<https://builds.apache.org/job/HBase-0.94-security/ws/trunk/target/surefire/surefire_1012979715973433163320tmp>
Running org.apache.hadoop.hbase.coprocessor.TestMasterObserver
Tests run: 5, Failures: 0, Errors: 0, Skipped: 0, Time elapsed: 50.805 sec
Forking command line: /bin/sh -c cd <https://builds.apache.org/job/HBase-0.94-security/ws/trunk>
&& /home/jenkins/tools/java/jdk1.6.0_45-32/jre/bin/java -enableassertions -Xmx1900m
-Djava.security.egd=file:/dev/./urandom -jar <https://builds.apache.org/job/HBase-0.94-security/ws/trunk/target/surefire/surefirebooter7201038558223672285.jar>
<https://builds.apache.org/job/HBase-0.94-security/ws/trunk/target/surefire/surefire2353895635697878145tmp>
<https://builds.apache.org/job/HBase-0.94-security/ws/trunk/target/surefire/surefire_1027232677228081071521tmp>
Running org.apache.hadoop.hbase.coprocessor.TestBigDecimalColumnInterpreter
Tests run: 38, Failures: 0, Errors: 0, Skipped: 0, Time elapsed: 18.554 sec
Forking command line: /bin/sh -c cd <https://builds.apache.org/job/HBase-0.94-security/ws/trunk>
&& /home/jenkins/tools/java/jdk1.6.0_45-32/jre/bin/java -enableassertions -Xmx1900m
-Djava.security.egd=file:/dev/./urandom -jar <https://builds.apache.org/job/HBase-0.94-security/ws/trunk/target/surefire/surefirebooter4528722399132380501.jar>
<https://builds.apache.org/job/HBase-0.94-security/ws/trunk/target/surefire/surefire6814221991066102051tmp>
<https://builds.apache.org/job/HBase-0.94-security/ws/trunk/target/surefire/surefire_1034895766657066125001tmp>
Running org.apache.hadoop.hbase.coprocessor.TestCoprocessorEndpoint
Tests run: 4, Failures: 0, Errors: 0, Skipped: 1, Time elapsed: 35.253 sec
Forking command line: /bin/sh -c cd <https://builds.apache.org/job/HBase-0.94-security/ws/trunk>
&& /home/jenkins/tools/java/jdk1.6.0_45-32/jre/bin/java -enableassertions -Xmx1900m
-Djava.security.egd=file:/dev/./urandom -jar <https://builds.apache.org/job/HBase-0.94-security/ws/trunk/target/surefire/surefirebooter4824119141970043983.jar>
<https://builds.apache.org/job/HBase-0.94-security/ws/trunk/target/surefire/surefire4637762952294543438tmp>
<https://builds.apache.org/job/HBase-0.94-security/ws/trunk/target/surefire/surefire_1043514715759481954973tmp>
Running org.apache.hadoop.hbase.coprocessor.TestOpenTableInCoprocessor
Tests run: 2, Failures: 0, Errors: 0, Skipped: 0, Time elapsed: 31.439 sec
Forking command line: /bin/sh -c cd <https://builds.apache.org/job/HBase-0.94-security/ws/trunk>
&& /home/jenkins/tools/java/jdk1.6.0_45-32/jre/bin/java -enableassertions -Xmx1900m
-Djava.security.egd=file:/dev/./urandom -jar <https://builds.apache.org/job/HBase-0.94-security/ws/trunk/target/surefire/surefirebooter6525633944453763361.jar>
<https://builds.apache.org/job/HBase-0.94-security/ws/trunk/target/surefire/surefire769684088157239894tmp>
<https://builds.apache.org/job/HBase-0.94-security/ws/trunk/target/surefire/surefire_1053409217235862133077tmp>
Running org.apache.hadoop.hbase.coprocessor.TestClassLoading
Tests run: 8, Failures: 0, Errors: 0, Skipped: 0, Time elapsed: 43.056 sec
Forking command line: /bin/sh -c cd <https://builds.apache.org/job/HBase-0.94-security/ws/trunk>
&& /home/jenkins/tools/java/jdk1.6.0_45-32/jre/bin/java -enableassertions -Xmx1900m
-Djava.security.egd=file:/dev/./urandom -jar <https://builds.apache.org/job/HBase-0.94-security/ws/trunk/target/surefire/surefirebooter2638260291071420156.jar>
<https://builds.apache.org/job/HBase-0.94-security/ws/trunk/target/surefire/surefire2786533588966788665tmp>
<https://builds.apache.org/job/HBase-0.94-security/ws/trunk/target/surefire/surefire_1062845248594197793741tmp>
Running org.apache.hadoop.hbase.coprocessor.TestRegionObserverInterface
Tests run: 7, Failures: 0, Errors: 0, Skipped: 0, Time elapsed: 44.77 sec
Forking command line: /bin/sh -c cd <https://builds.apache.org/job/HBase-0.94-security/ws/trunk>
&& /home/jenkins/tools/java/jdk1.6.0_45-32/jre/bin/java -enableassertions -Xmx1900m
-Djava.security.egd=file:/dev/./urandom -jar <https://builds.apache.org/job/HBase-0.94-security/ws/trunk/target/surefire/surefirebooter3963292762633830084.jar>
<https://builds.apache.org/job/HBase-0.94-security/ws/trunk/target/surefire/surefire2515664678741017326tmp>
<https://builds.apache.org/job/HBase-0.94-security/ws/trunk/target/surefire/surefire_1075968089081606067269tmp>
Running org.apache.hadoop.hbase.coprocessor.TestRegionObserverScannerOpenHook
Tests run: 1, Failures: 0, Errors: 0, Skipped: 0, Time elapsed: 17.73 sec
Forking command line: /bin/sh -c cd <https://builds.apache.org/job/HBase-0.94-security/ws/trunk>
&& /home/jenkins/tools/java/jdk1.6.0_45-32/jre/bin/java -enableassertions -Xmx1900m
-Djava.security.egd=file:/dev/./urandom -jar <https://builds.apache.org/job/HBase-0.94-security/ws/trunk/target/surefire/surefirebooter8156483557277496625.jar>
<https://builds.apache.org/job/HBase-0.94-security/ws/trunk/target/surefire/surefire2695725730880311686tmp>
<https://builds.apache.org/job/HBase-0.94-security/ws/trunk/target/surefire/surefire_108469285788366229615tmp>
Running org.apache.hadoop.hbase.coprocessor.TestMasterCoprocessorExceptionWithRemove
Tests run: 1, Failures: 0, Errors: 0, Skipped: 0, Time elapsed: 19.619 sec
Forking command line: /bin/sh -c cd <https://builds.apache.org/job/HBase-0.94-security/ws/trunk>
&& /home/jenkins/tools/java/jdk1.6.0_45-32/jre/bin/java -enableassertions -Xmx1900m
-Djava.security.egd=file:/dev/./urandom -jar <https://builds.apache.org/job/HBase-0.94-security/ws/trunk/target/surefire/surefirebooter9209238815558838599.jar>
<https://builds.apache.org/job/HBase-0.94-security/ws/trunk/target/surefire/surefire7536659949987193864tmp>
<https://builds.apache.org/job/HBase-0.94-security/ws/trunk/target/surefire/surefire_1092550736233314473925tmp>
Running org.apache.hadoop.hbase.coprocessor.TestRegionServerCoprocessorExceptionWithRemove
Tests run: 1, Failures: 0, Errors: 0, Skipped: 0, Time elapsed: 23.606 sec
Forking command line: /bin/sh -c cd <https://builds.apache.org/job/HBase-0.94-security/ws/trunk>
&& /home/jenkins/tools/java/jdk1.6.0_45-32/jre/bin/java -enableassertions -Xmx1900m
-Djava.security.egd=file:/dev/./urandom -jar <https://builds.apache.org/job/HBase-0.94-security/ws/trunk/target/surefire/surefirebooter8641007351836879720.jar>
<https://builds.apache.org/job/HBase-0.94-security/ws/trunk/target/surefire/surefire6252211302978380114tmp>
<https://builds.apache.org/job/HBase-0.94-security/ws/trunk/target/surefire/surefire_1106750091560338778491tmp>
Running org.apache.hadoop.hbase.coprocessor.TestMasterCoprocessorExceptionWithAbort
Tests run: 1, Failures: 0, Errors: 0, Skipped: 0, Time elapsed: 30.339 sec
Forking command line: /bin/sh -c cd <https://builds.apache.org/job/HBase-0.94-security/ws/trunk>
&& /home/jenkins/tools/java/jdk1.6.0_45-32/jre/bin/java -enableassertions -Xmx1900m
-Djava.security.egd=file:/dev/./urandom -jar <https://builds.apache.org/job/HBase-0.94-security/ws/trunk/target/surefire/surefirebooter7327621814080034249.jar>
<https://builds.apache.org/job/HBase-0.94-security/ws/trunk/target/surefire/surefire750738547266013999tmp>
<https://builds.apache.org/job/HBase-0.94-security/ws/trunk/target/surefire/surefire_1113939218787461879056tmp>
Running org.apache.hadoop.hbase.coprocessor.TestWALObserver
Tests run: 3, Failures: 0, Errors: 0, Skipped: 0, Time elapsed: 21.628 sec
Forking command line: /bin/sh -c cd <https://builds.apache.org/job/HBase-0.94-security/ws/trunk>
&& /home/jenkins/tools/java/jdk1.6.0_45-32/jre/bin/java -enableassertions -Xmx1900m
-Djava.security.egd=file:/dev/./urandom -jar <https://builds.apache.org/job/HBase-0.94-security/ws/trunk/target/surefire/surefirebooter509297114925671595.jar>
<https://builds.apache.org/job/HBase-0.94-security/ws/trunk/target/surefire/surefire4427661734393988041tmp>
<https://builds.apache.org/job/HBase-0.94-security/ws/trunk/target/surefire/surefire_1126046744001599474528tmp>
Running org.apache.hadoop.hbase.coprocessor.example.TestBulkDeleteProtocol
Tests run: 8, Failures: 0, Errors: 0, Skipped: 0, Time elapsed: 38.979 sec
Forking command line: /bin/sh -c cd <https://builds.apache.org/job/HBase-0.94-security/ws/trunk>
&& /home/jenkins/tools/java/jdk1.6.0_45-32/jre/bin/java -enableassertions -Xmx1900m
-Djava.security.egd=file:/dev/./urandom -jar <https://builds.apache.org/job/HBase-0.94-security/ws/trunk/target/surefire/surefirebooter8402839238303295758.jar>
<https://builds.apache.org/job/HBase-0.94-security/ws/trunk/target/surefire/surefire8920694180016346876tmp>
<https://builds.apache.org/job/HBase-0.94-security/ws/trunk/target/surefire/surefire_1132729361740048208322tmp>
Running org.apache.hadoop.hbase.coprocessor.example.TestZooKeeperScanPolicyObserver
Tests run: 1, Failures: 0, Errors: 0, Skipped: 0, Time elapsed: 19.636 sec
Forking command line: /bin/sh -c cd <https://builds.apache.org/job/HBase-0.94-security/ws/trunk>
&& /home/jenkins/tools/java/jdk1.6.0_45-32/jre/bin/java -enableassertions -Xmx1900m
-Djava.security.egd=file:/dev/./urandom -jar <https://builds.apache.org/job/HBase-0.94-security/ws/trunk/target/surefire/surefirebooter6332138063387772454.jar>
<https://builds.apache.org/job/HBase-0.94-security/ws/trunk/target/surefire/surefire241505301660844997tmp>
<https://builds.apache.org/job/HBase-0.94-security/ws/trunk/target/surefire/surefire_114880988037355994502tmp>
Running org.apache.hadoop.hbase.coprocessor.TestRegionServerCoprocessorExceptionWithAbort
Tests run: 1, Failures: 0, Errors: 0, Skipped: 0, Time elapsed: 24.894 sec
Forking command line: /bin/sh -c cd <https://builds.apache.org/job/HBase-0.94-security/ws/trunk>
&& /home/jenkins/tools/java/jdk1.6.0_45-32/jre/bin/java -enableassertions -Xmx1900m
-Djava.security.egd=file:/dev/./urandom -jar <https://builds.apache.org/job/HBase-0.94-security/ws/trunk/target/surefire/surefirebooter1236914887660382519.jar>
<https://builds.apache.org/job/HBase-0.94-security/ws/trunk/target/surefire/surefire6276622357340637662tmp>
<https://builds.apache.org/job/HBase-0.94-security/ws/trunk/target/surefire/surefire_1156823673104839350306tmp>
Running org.apache.hadoop.hbase.coprocessor.TestRegionObserverBypass
Tests run: 2, Failures: 0, Errors: 0, Skipped: 0, Time elapsed: 20.289 sec
Forking command line: /bin/sh -c cd <https://builds.apache.org/job/HBase-0.94-security/ws/trunk>
&& /home/jenkins/tools/java/jdk1.6.0_45-32/jre/bin/java -enableassertions -Xmx1900m
-Djava.security.egd=file:/dev/./urandom -jar <https://builds.apache.org/job/HBase-0.94-security/ws/trunk/target/surefire/surefirebooter4950847952875215740.jar>
<https://builds.apache.org/job/HBase-0.94-security/ws/trunk/target/surefire/surefire2364476520669594802tmp>
<https://builds.apache.org/job/HBase-0.94-security/ws/trunk/target/surefire/surefire_1162944797633293478291tmp>
Running org.apache.hadoop.hbase.coprocessor.TestHTableWrapper
Tests run: 1, Failures: 0, Errors: 0, Skipped: 0, Time elapsed: 23.817 sec
Forking command line: /bin/sh -c cd <https://builds.apache.org/job/HBase-0.94-security/ws/trunk>
&& /home/jenkins/tools/java/jdk1.6.0_45-32/jre/bin/java -enableassertions -Xmx1900m
-Djava.security.egd=file:/dev/./urandom -jar <https://builds.apache.org/job/HBase-0.94-security/ws/trunk/target/surefire/surefirebooter5480730158481779266.jar>
<https://builds.apache.org/job/HBase-0.94-security/ws/trunk/target/surefire/surefire4597926816684333746tmp>
<https://builds.apache.org/job/HBase-0.94-security/ws/trunk/target/surefire/surefire_1179221963101367774348tmp>
Running org.apache.hadoop.hbase.thrift2.TestThriftHBaseServiceHandler
Tests run: 19, Failures: 0, Errors: 0, Skipped: 0, Time elapsed: 18.176 sec
Forking command line: /bin/sh -c cd <https://builds.apache.org/job/HBase-0.94-security/ws/trunk>
&& /home/jenkins/tools/java/jdk1.6.0_45-32/jre/bin/java -enableassertions -Xmx1900m
-Djava.security.egd=file:/dev/./urandom -jar <https://builds.apache.org/job/HBase-0.94-security/ws/trunk/target/surefire/surefirebooter6948431311561228614.jar>
<https://builds.apache.org/job/HBase-0.94-security/ws/trunk/target/surefire/surefire3299815436484134657tmp>
<https://builds.apache.org/job/HBase-0.94-security/ws/trunk/target/surefire/surefire_1188966400768110071293tmp>
Running org.apache.hadoop.hbase.avro.TestAvroServer
Tests run: 3, Failures: 0, Errors: 0, Skipped: 0, Time elapsed: 33.202 sec
Forking command line: /bin/sh -c cd <https://builds.apache.org/job/HBase-0.94-security/ws/trunk>
&& /home/jenkins/tools/java/jdk1.6.0_45-32/jre/bin/java -enableassertions -Xmx1900m
-Djava.security.egd=file:/dev/./urandom -jar <https://builds.apache.org/job/HBase-0.94-security/ws/trunk/target/surefire/surefirebooter2865193309118450991.jar>
<https://builds.apache.org/job/HBase-0.94-security/ws/trunk/target/surefire/surefire7677945521107525845tmp>
<https://builds.apache.org/job/HBase-0.94-security/ws/trunk/target/surefire/surefire_1195718275628138204876tmp>
Running org.apache.hadoop.hbase.thrift.TestThriftServer
Tests run: 1, Failures: 0, Errors: 0, Skipped: 0, Time elapsed: 49.484 sec
Forking command line: /bin/sh -c cd <https://builds.apache.org/job/HBase-0.94-security/ws/trunk>
&& /home/jenkins/tools/java/jdk1.6.0_45-32/jre/bin/java -enableassertions -Xmx1900m
-Djava.security.egd=file:/dev/./urandom -jar <https://builds.apache.org/job/HBase-0.94-security/ws/trunk/target/surefire/surefirebooter304736916895958404.jar>
<https://builds.apache.org/job/HBase-0.94-security/ws/trunk/target/surefire/surefire3735288548984165091tmp>
<https://builds.apache.org/job/HBase-0.94-security/ws/trunk/target/surefire/surefire_1207649135854678647353tmp>
Running org.apache.hadoop.hbase.monitoring.TestTaskMonitor
Tests run: 3, Failures: 0, Errors: 0, Skipped: 0, Time elapsed: 0.306 sec
Forking command line: /bin/sh -c cd <https://builds.apache.org/job/HBase-0.94-security/ws/trunk>
&& /home/jenkins/tools/java/jdk1.6.0_45-32/jre/bin/java -enableassertions -Xmx1900m
-Djava.security.egd=file:/dev/./urandom -jar <https://builds.apache.org/job/HBase-0.94-security/ws/trunk/target/surefire/surefirebooter1742275368855879953.jar>
<https://builds.apache.org/job/HBase-0.94-security/ws/trunk/target/surefire/surefire1746823013837620055tmp>
<https://builds.apache.org/job/HBase-0.94-security/ws/trunk/target/surefire/surefire_1217856586725532152684tmp>
Running org.apache.hadoop.hbase.monitoring.TestMemoryBoundedLogMessageBuffer
Tests run: 2, Failures: 0, Errors: 0, Skipped: 0, Time elapsed: 0.231 sec
Forking command line: /bin/sh -c cd <https://builds.apache.org/job/HBase-0.94-security/ws/trunk>
&& /home/jenkins/tools/java/jdk1.6.0_45-32/jre/bin/java -enableassertions -Xmx1900m
-Djava.security.egd=file:/dev/./urandom -jar <https://builds.apache.org/job/HBase-0.94-security/ws/trunk/target/surefire/surefirebooter6822658622204080711.jar>
<https://builds.apache.org/job/HBase-0.94-security/ws/trunk/target/surefire/surefire9080290981384316973tmp>
<https://builds.apache.org/job/HBase-0.94-security/ws/trunk/target/surefire/surefire_1224815311051706810384tmp>
Running org.apache.hadoop.hbase.procedure.TestZKProcedure
Tests run: 4, Failures: 0, Errors: 0, Skipped: 0, Time elapsed: 2.181 sec
Forking command line: /bin/sh -c cd <https://builds.apache.org/job/HBase-0.94-security/ws/trunk>
&& /home/jenkins/tools/java/jdk1.6.0_45-32/jre/bin/java -enableassertions -Xmx1900m
-Djava.security.egd=file:/dev/./urandom -jar <https://builds.apache.org/job/HBase-0.94-security/ws/trunk/target/surefire/surefirebooter8657432224397733802.jar>
<https://builds.apache.org/job/HBase-0.94-security/ws/trunk/target/surefire/surefire8000026191365345444tmp>
<https://builds.apache.org/job/HBase-0.94-security/ws/trunk/target/surefire/surefire_1231803493307177614117tmp>
Running org.apache.hadoop.hbase.procedure.TestZKProcedureControllers
Tests run: 4, Failures: 0, Errors: 0, Skipped: 0, Time elapsed: 2.373 sec
Forking command line: /bin/sh -c cd <https://builds.apache.org/job/HBase-0.94-security/ws/trunk>
&& /home/jenkins/tools/java/jdk1.6.0_45-32/jre/bin/java -enableassertions -Xmx1900m
-Djava.security.egd=file:/dev/./urandom -jar <https://builds.apache.org/job/HBase-0.94-security/ws/trunk/target/surefire/surefirebooter3641438498076978605.jar>
<https://builds.apache.org/job/HBase-0.94-security/ws/trunk/target/surefire/surefire7491270190202647225tmp>
<https://builds.apache.org/job/HBase-0.94-security/ws/trunk/target/surefire/surefire_1247552324126172915058tmp>
Running org.apache.hadoop.hbase.regionserver.TestHRegionOnCluster
Tests run: 1, Failures: 0, Errors: 0, Skipped: 0, Time elapsed: 28.592 sec
Forking command line: /bin/sh -c cd <https://builds.apache.org/job/HBase-0.94-security/ws/trunk>
&& /home/jenkins/tools/java/jdk1.6.0_45-32/jre/bin/java -enableassertions -Xmx1900m
-Djava.security.egd=file:/dev/./urandom -jar <https://builds.apache.org/job/HBase-0.94-security/ws/trunk/target/surefire/surefirebooter7506960426495023091.jar>
<https://builds.apache.org/job/HBase-0.94-security/ws/trunk/target/surefire/surefire4441343050918447664tmp>
<https://builds.apache.org/job/HBase-0.94-security/ws/trunk/target/surefire/surefire_1254318222012571231462tmp>
Running org.apache.hadoop.hbase.catalog.TestMetaReaderEditor
Tests run: 5, Failures: 1, Errors: 4, Skipped: 0, Time elapsed: 717.149 sec <<< FAILURE!
Forking command line: /bin/sh -c cd <https://builds.apache.org/job/HBase-0.94-security/ws/trunk>
&& /home/jenkins/tools/java/jdk1.6.0_45-32/jre/bin/java -enableassertions -Xmx1900m
-Djava.security.egd=file:/dev/./urandom -jar <https://builds.apache.org/job/HBase-0.94-security/ws/trunk/target/surefire/surefirebooter1338999041740632427.jar>
<https://builds.apache.org/job/HBase-0.94-security/ws/trunk/target/surefire/surefire453757085286009142tmp>
<https://builds.apache.org/job/HBase-0.94-security/ws/trunk/target/surefire/surefire_1264035802237951115062tmp>
Running org.apache.hadoop.hbase.regionserver.TestMasterAddressManager
Tests run: 1, Failures: 0, Errors: 0, Skipped: 0, Time elapsed: 0.797 sec
Forking command line: /bin/sh -c cd <https://builds.apache.org/job/HBase-0.94-security/ws/trunk>
&& /home/jenkins/tools/java/jdk1.6.0_45-32/jre/bin/java -enableassertions -Xmx1900m
-Djava.security.egd=file:/dev/./urandom -jar <https://builds.apache.org/job/HBase-0.94-security/ws/trunk/target/surefire/surefirebooter2967863276520097746.jar>
<https://builds.apache.org/job/HBase-0.94-security/ws/trunk/target/surefire/surefire3482435382142590282tmp>
<https://builds.apache.org/job/HBase-0.94-security/ws/trunk/target/surefire/surefire_1277992088914638000214tmp>
Running org.apache.hadoop.hbase.regionserver.TestHRegion
Tests run: 74, Failures: 0, Errors: 0, Skipped: 0, Time elapsed: 53.511 sec
Forking command line: /bin/sh -c cd <https://builds.apache.org/job/HBase-0.94-security/ws/trunk>
&& /home/jenkins/tools/java/jdk1.6.0_45-32/jre/bin/java -enableassertions -Xmx1900m
-Djava.security.egd=file:/dev/./urandom -jar <https://builds.apache.org/job/HBase-0.94-security/ws/trunk/target/surefire/surefirebooter2504852427669246972.jar>
<https://builds.apache.org/job/HBase-0.94-security/ws/trunk/target/surefire/surefire4905715769736074575tmp>
<https://builds.apache.org/job/HBase-0.94-security/ws/trunk/target/surefire/surefire_1281048370345165584602tmp>
Running org.apache.hadoop.hbase.regionserver.TestCompactionWithCoprocessor
Tests run: 17, Failures: 0, Errors: 0, Skipped: 0, Time elapsed: 43.637 sec
Forking command line: /bin/sh -c cd <https://builds.apache.org/job/HBase-0.94-security/ws/trunk>
&& /home/jenkins/tools/java/jdk1.6.0_45-32/jre/bin/java -enableassertions -Xmx1900m
-Djava.security.egd=file:/dev/./urandom -jar <https://builds.apache.org/job/HBase-0.94-security/ws/trunk/target/surefire/surefirebooter455310831768227272.jar>
<https://builds.apache.org/job/HBase-0.94-security/ws/trunk/target/surefire/surefire8541708469978898494tmp>
<https://builds.apache.org/job/HBase-0.94-security/ws/trunk/target/surefire/surefire_1297370625570257253190tmp>
Running org.apache.hadoop.hbase.regionserver.TestRegionServerMetrics
Tests run: 4, Failures: 0, Errors: 0, Skipped: 0, Time elapsed: 98.497 sec
Forking command line: /bin/sh -c cd <https://builds.apache.org/job/HBase-0.94-security/ws/trunk>
&& /home/jenkins/tools/java/jdk1.6.0_45-32/jre/bin/java -enableassertions -Xmx1900m
-Djava.security.egd=file:/dev/./urandom -jar <https://builds.apache.org/job/HBase-0.94-security/ws/trunk/target/surefire/surefirebooter3758210358261221048.jar>
<https://builds.apache.org/job/HBase-0.94-security/ws/trunk/target/surefire/surefire7253264929527936180tmp>
<https://builds.apache.org/job/HBase-0.94-security/ws/trunk/target/surefire/surefire_1304002092924949697962tmp>
Running org.apache.hadoop.hbase.regionserver.TestSplitLogWorker
Tests run: 5, Failures: 0, Errors: 0, Skipped: 0, Time elapsed: 3.875 sec
Forking command line: /bin/sh -c cd <https://builds.apache.org/job/HBase-0.94-security/ws/trunk>
&& /home/jenkins/tools/java/jdk1.6.0_45-32/jre/bin/java -enableassertions -Xmx1900m
-Djava.security.egd=file:/dev/./urandom -jar <https://builds.apache.org/job/HBase-0.94-security/ws/trunk/target/surefire/surefirebooter7035519538393857176.jar>
<https://builds.apache.org/job/HBase-0.94-security/ws/trunk/target/surefire/surefire897175221049755958tmp>
<https://builds.apache.org/job/HBase-0.94-security/ws/trunk/target/surefire/surefire_1312423551189238511739tmp>
Running org.apache.hadoop.hbase.regionserver.TestServerCustomProtocol
Tests run: 7, Failures: 0, Errors: 0, Skipped: 0, Time elapsed: 20.851 sec
Forking command line: /bin/sh -c cd <https://builds.apache.org/job/HBase-0.94-security/ws/trunk>
&& /home/jenkins/tools/java/jdk1.6.0_45-32/jre/bin/java -enableassertions -Xmx1900m
-Djava.security.egd=file:/dev/./urandom -jar <https://builds.apache.org/job/HBase-0.94-security/ws/trunk/target/surefire/surefirebooter8781151981804375632.jar>
<https://builds.apache.org/job/HBase-0.94-security/ws/trunk/target/surefire/surefire4035367216948863200tmp>
<https://builds.apache.org/job/HBase-0.94-security/ws/trunk/target/surefire/surefire_1324955349486777499770tmp>
Running org.apache.hadoop.hbase.regionserver.TestHRegionBusyWait
Tests run: 75, Failures: 0, Errors: 0, Skipped: 0, Time elapsed: 56.834 sec
Forking command line: /bin/sh -c cd <https://builds.apache.org/job/HBase-0.94-security/ws/trunk>
&& /home/jenkins/tools/java/jdk1.6.0_45-32/jre/bin/java -enableassertions -Xmx1900m
-Djava.security.egd=file:/dev/./urandom -jar <https://builds.apache.org/job/HBase-0.94-security/ws/trunk/target/surefire/surefirebooter3518886330570464268.jar>
<https://builds.apache.org/job/HBase-0.94-security/ws/trunk/target/surefire/surefire3057175684793143378tmp>
<https://builds.apache.org/job/HBase-0.94-security/ws/trunk/target/surefire/surefire_1336357909913435208160tmp>
Running org.apache.hadoop.hbase.regionserver.TestStoreFileBlockCacheSummary
Tests run: 1, Failures: 0, Errors: 0, Skipped: 0, Time elapsed: 20.3 sec
Forking command line: /bin/sh -c cd <https://builds.apache.org/job/HBase-0.94-security/ws/trunk>
&& /home/jenkins/tools/java/jdk1.6.0_45-32/jre/bin/java -enableassertions -Xmx1900m
-Djava.security.egd=file:/dev/./urandom -jar <https://builds.apache.org/job/HBase-0.94-security/ws/trunk/target/surefire/surefirebooter6913013474864514087.jar>
<https://builds.apache.org/job/HBase-0.94-security/ws/trunk/target/surefire/surefire3869314383879173530tmp>
<https://builds.apache.org/job/HBase-0.94-security/ws/trunk/target/surefire/surefire_1344248866090586580348tmp>
Running org.apache.hadoop.hbase.regionserver.TestStore
Tests run: 12, Failures: 0, Errors: 0, Skipped: 0, Time elapsed: 18.593 sec
Forking command line: /bin/sh -c cd <https://builds.apache.org/job/HBase-0.94-security/ws/trunk>
&& /home/jenkins/tools/java/jdk1.6.0_45-32/jre/bin/java -enableassertions -Xmx1900m
-Djava.security.egd=file:/dev/./urandom -jar <https://builds.apache.org/job/HBase-0.94-security/ws/trunk/target/surefire/surefirebooter2738635112675602871.jar>
<https://builds.apache.org/job/HBase-0.94-security/ws/trunk/target/surefire/surefire137488968543820708tmp>
<https://builds.apache.org/job/HBase-0.94-security/ws/trunk/target/surefire/surefire_1352743186917790099907tmp>
Running org.apache.hadoop.hbase.regionserver.TestBlocksRead
Tests run: 4, Failures: 0, Errors: 0, Skipped: 0, Time elapsed: 1.562 sec
Forking command line: /bin/sh -c cd <https://builds.apache.org/job/HBase-0.94-security/ws/trunk>
&& /home/jenkins/tools/java/jdk1.6.0_45-32/jre/bin/java -enableassertions -Xmx1900m
-Djava.security.egd=file:/dev/./urandom -jar <https://builds.apache.org/job/HBase-0.94-security/ws/trunk/target/surefire/surefirebooter4327398165823695207.jar>
<https://builds.apache.org/job/HBase-0.94-security/ws/trunk/target/surefire/surefire3298860507770471973tmp>
<https://builds.apache.org/job/HBase-0.94-security/ws/trunk/target/surefire/surefire_1369185871987863508438tmp>
Running org.apache.hadoop.hbase.regionserver.TestAtomicOperation
Tests run: 5, Failures: 0, Errors: 0, Skipped: 0, Time elapsed: 15.48 sec
Forking command line: /bin/sh -c cd <https://builds.apache.org/job/HBase-0.94-security/ws/trunk>
&& /home/jenkins/tools/java/jdk1.6.0_45-32/jre/bin/java -enableassertions -Xmx1900m
-Djava.security.egd=file:/dev/./urandom -jar <https://builds.apache.org/job/HBase-0.94-security/ws/trunk/target/surefire/surefirebooter1921280859504300947.jar>
<https://builds.apache.org/job/HBase-0.94-security/ws/trunk/target/surefire/surefire3688204695252405702tmp>
<https://builds.apache.org/job/HBase-0.94-security/ws/trunk/target/surefire/surefire_1378881290790196130405tmp>
Running org.apache.hadoop.hbase.regionserver.TestSeekOptimizations
Tests run: 6, Failures: 0, Errors: 0, Skipped: 0, Time elapsed: 2.632 sec
Forking command line: /bin/sh -c cd <https://builds.apache.org/job/HBase-0.94-security/ws/trunk>
&& /home/jenkins/tools/java/jdk1.6.0_45-32/jre/bin/java -enableassertions -Xmx1900m
-Djava.security.egd=file:/dev/./urandom -jar <https://builds.apache.org/job/HBase-0.94-security/ws/trunk/target/surefire/surefirebooter8328758187438337198.jar>
<https://builds.apache.org/job/HBase-0.94-security/ws/trunk/target/surefire/surefire1348423890221952691tmp>
<https://builds.apache.org/job/HBase-0.94-security/ws/trunk/target/surefire/surefire_1388869389513426488855tmp>
Running org.apache.hadoop.hbase.regionserver.metrics.TestSchemaMetrics
Tests run: 6, Failures: 0, Errors: 0, Skipped: 0, Time elapsed: 15.226 sec
Forking command line: /bin/sh -c cd <https://builds.apache.org/job/HBase-0.94-security/ws/trunk>
&& /home/jenkins/tools/java/jdk1.6.0_45-32/jre/bin/java -enableassertions -Xmx1900m
-Djava.security.egd=file:/dev/./urandom -jar <https://builds.apache.org/job/HBase-0.94-security/ws/trunk/target/surefire/surefirebooter4921350217586967334.jar>
<https://builds.apache.org/job/HBase-0.94-security/ws/trunk/target/surefire/surefire2252104692291751093tmp>
<https://builds.apache.org/job/HBase-0.94-security/ws/trunk/target/surefire/surefire_1392581210267060280589tmp>
Running org.apache.hadoop.hbase.regionserver.TestFSErrorsExposed
Tests run: 3, Failures: 0, Errors: 0, Skipped: 0, Time elapsed: 34.254 sec
Running org.apache.hadoop.hbase.regionserver.handler.TestCloseRegionHandler
Tests run: 3, Failures: 0, Errors: 0, Skipped: 0, Time elapsed: 2.347 sec
Forking command line: /bin/sh -c cd <https://builds.apache.org/job/HBase-0.94-security/ws/trunk>
&& /home/jenkins/tools/java/jdk1.6.0_45-32/jre/bin/java -enableassertions -Xmx1900m
-Djava.security.egd=file:/dev/./urandom -jar <https://builds.apache.org/job/HBase-0.94-security/ws/trunk/target/surefire/surefirebooter1653150972628082925.jar>
<https://builds.apache.org/job/HBase-0.94-security/ws/trunk/target/surefire/surefire505152957311945391tmp>
<https://builds.apache.org/job/HBase-0.94-security/ws/trunk/target/surefire/surefire_1408659923653828140829tmp>
Forking command line: /bin/sh -c cd <https://builds.apache.org/job/HBase-0.94-security/ws/trunk>
&& /home/jenkins/tools/java/jdk1.6.0_45-32/jre/bin/java -enableassertions -Xmx1900m
-Djava.security.egd=file:/dev/./urandom -jar <https://builds.apache.org/job/HBase-0.94-security/ws/trunk/target/surefire/surefirebooter2047174586534815619.jar>
<https://builds.apache.org/job/HBase-0.94-security/ws/trunk/target/surefire/surefire7761730516111077080tmp>
<https://builds.apache.org/job/HBase-0.94-security/ws/trunk/target/surefire/surefire_1414622495396237140721tmp>
Running org.apache.hadoop.hbase.regionserver.TestParallelPut
Tests run: 2, Failures: 0, Errors: 0, Skipped: 0, Time elapsed: 4.758 sec
Forking command line: /bin/sh -c cd <https://builds.apache.org/job/HBase-0.94-security/ws/trunk>
&& /home/jenkins/tools/java/jdk1.6.0_45-32/jre/bin/java -enableassertions -Xmx1900m
-Djava.security.egd=file:/dev/./urandom -jar <https://builds.apache.org/job/HBase-0.94-security/ws/trunk/target/surefire/surefirebooter6659318629717444399.jar>
<https://builds.apache.org/job/HBase-0.94-security/ws/trunk/target/surefire/surefire4589091143307889402tmp>
<https://builds.apache.org/job/HBase-0.94-security/ws/trunk/target/surefire/surefire_1423890629614202878298tmp>
Running org.apache.hadoop.hbase.regionserver.TestCacheOnWriteInSchema
Tests run: 3, Failures: 0, Errors: 0, Skipped: 0, Time elapsed: 1.526 sec
Forking command line: /bin/sh -c cd <https://builds.apache.org/job/HBase-0.94-security/ws/trunk>
&& /home/jenkins/tools/java/jdk1.6.0_45-32/jre/bin/java -enableassertions -Xmx1900m
-Djava.security.egd=file:/dev/./urandom -jar <https://builds.apache.org/job/HBase-0.94-security/ws/trunk/target/surefire/surefirebooter5558180347998854324.jar>
<https://builds.apache.org/job/HBase-0.94-security/ws/trunk/target/surefire/surefire200061961001589426tmp>
<https://builds.apache.org/job/HBase-0.94-security/ws/trunk/target/surefire/surefire_143296854088071981405tmp>
Running org.apache.hadoop.hbase.regionserver.wal.TestHLogBench
Tests run: 1, Failures: 0, Errors: 0, Skipped: 0, Time elapsed: 1.295 sec
Forking command line: /bin/sh -c cd <https://builds.apache.org/job/HBase-0.94-security/ws/trunk>
&& /home/jenkins/tools/java/jdk1.6.0_45-32/jre/bin/java -enableassertions -Xmx1900m
-Djava.security.egd=file:/dev/./urandom -jar <https://builds.apache.org/job/HBase-0.94-security/ws/trunk/target/surefire/surefirebooter6214537480731335633.jar>
<https://builds.apache.org/job/HBase-0.94-security/ws/trunk/target/surefire/surefire2551115512635006061tmp>
<https://builds.apache.org/job/HBase-0.94-security/ws/trunk/target/surefire/surefire_1443528352786076070525tmp>
Running org.apache.hadoop.hbase.regionserver.handler.TestOpenRegionHandler
Tests run: 4, Failures: 0, Errors: 0, Skipped: 0, Time elapsed: 17.08 sec
Forking command line: /bin/sh -c cd <https://builds.apache.org/job/HBase-0.94-security/ws/trunk>
&& /home/jenkins/tools/java/jdk1.6.0_45-32/jre/bin/java -enableassertions -Xmx1900m
-Djava.security.egd=file:/dev/./urandom -jar <https://builds.apache.org/job/HBase-0.94-security/ws/trunk/target/surefire/surefirebooter2737529373764728108.jar>
<https://builds.apache.org/job/HBase-0.94-security/ws/trunk/target/surefire/surefire8197964885955724441tmp>
<https://builds.apache.org/job/HBase-0.94-security/ws/trunk/target/surefire/surefire_1451641195700753630768tmp>
Running org.apache.hadoop.hbase.regionserver.wal.TestLogRollingNoCluster
Tests run: 1, Failures: 0, Errors: 0, Skipped: 0, Time elapsed: 2.58 sec
Forking command line: /bin/sh -c cd <https://builds.apache.org/job/HBase-0.94-security/ws/trunk>
&& /home/jenkins/tools/java/jdk1.6.0_45-32/jre/bin/java -enableassertions -Xmx1900m
-Djava.security.egd=file:/dev/./urandom -jar <https://builds.apache.org/job/HBase-0.94-security/ws/trunk/target/surefire/surefirebooter7685888593453974892.jar>
<https://builds.apache.org/job/HBase-0.94-security/ws/trunk/target/surefire/surefire3267828296217464368tmp>
<https://builds.apache.org/job/HBase-0.94-security/ws/trunk/target/surefire/surefire_1464140634429419810493tmp>
Running org.apache.hadoop.hbase.regionserver.wal.TestLogRollAbort
Tests run: 1, Failures: 0, Errors: 0, Skipped: 0, Time elapsed: 23.66 sec
Forking command line: /bin/sh -c cd <https://builds.apache.org/job/HBase-0.94-security/ws/trunk>
&& /home/jenkins/tools/java/jdk1.6.0_45-32/jre/bin/java -enableassertions -Xmx1900m
-Djava.security.egd=file:/dev/./urandom -jar <https://builds.apache.org/job/HBase-0.94-security/ws/trunk/target/surefire/surefirebooter4134010225822099590.jar>
<https://builds.apache.org/job/HBase-0.94-security/ws/trunk/target/surefire/surefire415007867064043814tmp>
<https://builds.apache.org/job/HBase-0.94-security/ws/trunk/target/surefire/surefire_1472393499971937003668tmp>
Running org.apache.hadoop.hbase.regionserver.wal.TestWALReplay
Tests run: 8, Failures: 0, Errors: 0, Skipped: 0, Time elapsed: 63.727 sec
Running org.apache.hadoop.hbase.regionserver.wal.TestWALReplayCompressed
Tests run: 8, Failures: 0, Errors: 0, Skipped: 0, Time elapsed: 61.949 sec
Forking command line: /bin/sh -c cd <https://builds.apache.org/job/HBase-0.94-security/ws/trunk>
&& /home/jenkins/tools/java/jdk1.6.0_45-32/jre/bin/java -enableassertions -Xmx1900m
-Djava.security.egd=file:/dev/./urandom -jar <https://builds.apache.org/job/HBase-0.94-security/ws/trunk/target/surefire/surefirebooter2788479893854856641.jar>
<https://builds.apache.org/job/HBase-0.94-security/ws/trunk/target/surefire/surefire4752634180870433445tmp>
<https://builds.apache.org/job/HBase-0.94-security/ws/trunk/target/surefire/surefire_1486420836731197203614tmp>
Running org.apache.hadoop.hbase.regionserver.wal.TestDurability
Tests run: 1, Failures: 0, Errors: 0, Skipped: 0, Time elapsed: 5.586 sec
Forking command line: /bin/sh -c cd <https://builds.apache.org/job/HBase-0.94-security/ws/trunk>
&& /home/jenkins/tools/java/jdk1.6.0_45-32/jre/bin/java -enableassertions -Xmx1900m
-Djava.security.egd=file:/dev/./urandom -jar <https://builds.apache.org/job/HBase-0.94-security/ws/trunk/target/surefire/surefirebooter6626153693563741853.jar>
<https://builds.apache.org/job/HBase-0.94-security/ws/trunk/target/surefire/surefire702091798871312643tmp>
<https://builds.apache.org/job/HBase-0.94-security/ws/trunk/target/surefire/surefire_1493566508189016983652tmp>
Running org.apache.hadoop.hbase.regionserver.TestStoreScanner
Tests run: 16, Failures: 0, Errors: 0, Skipped: 0, Time elapsed: 0.051 sec
Forking command line: /bin/sh -c cd <https://builds.apache.org/job/HBase-0.94-security/ws/trunk>
&& /home/jenkins/tools/java/jdk1.6.0_45-32/jre/bin/java -enableassertions -Xmx1900m
-Djava.security.egd=file:/dev/./urandom -jar <https://builds.apache.org/job/HBase-0.94-security/ws/trunk/target/surefire/surefirebooter8215271507528251266.jar>
<https://builds.apache.org/job/HBase-0.94-security/ws/trunk/target/surefire/surefire1710826791333863561tmp>
<https://builds.apache.org/job/HBase-0.94-security/ws/trunk/target/surefire/surefire_150794764497936798363tmp>
Running org.apache.hadoop.hbase.regionserver.TestMXBean
Tests run: 1, Failures: 0, Errors: 0, Skipped: 0, Time elapsed: 13.866 sec
Forking command line: /bin/sh -c cd <https://builds.apache.org/job/HBase-0.94-security/ws/trunk>
&& /home/jenkins/tools/java/jdk1.6.0_45-32/jre/bin/java -enableassertions -Xmx1900m
-Djava.security.egd=file:/dev/./urandom -jar <https://builds.apache.org/job/HBase-0.94-security/ws/trunk/target/surefire/surefirebooter4319839568719389657.jar>
<https://builds.apache.org/job/HBase-0.94-security/ws/trunk/target/surefire/surefire8145955748659006367tmp>
<https://builds.apache.org/job/HBase-0.94-security/ws/trunk/target/surefire/surefire_1515315920354872684910tmp>
Running org.apache.hadoop.hbase.regionserver.TestRpcMetrics
Tests run: 1, Failures: 0, Errors: 0, Skipped: 0, Time elapsed: 1.384 sec
Forking command line: /bin/sh -c cd <https://builds.apache.org/job/HBase-0.94-security/ws/trunk>
&& /home/jenkins/tools/java/jdk1.6.0_45-32/jre/bin/java -enableassertions -Xmx1900m
-Djava.security.egd=file:/dev/./urandom -jar <https://builds.apache.org/job/HBase-0.94-security/ws/trunk/target/surefire/surefirebooter557570755327322301.jar>
<https://builds.apache.org/job/HBase-0.94-security/ws/trunk/target/surefire/surefire1699297388039652658tmp>
<https://builds.apache.org/job/HBase-0.94-security/ws/trunk/target/surefire/surefire_1527933917190812172094tmp>
Forking command line: /bin/sh -c cd <https://builds.apache.org/job/HBase-0.94-security/ws/trunk>
&& /home/jenkins/tools/java/jdk1.6.0_45-32/jre/bin/java -enableassertions -Xmx1900m
-Djava.security.egd=file:/dev/./urandom -jar <https://builds.apache.org/job/HBase-0.94-security/ws/trunk/target/surefire/surefirebooter4852645911459952785.jar>
<https://builds.apache.org/job/HBase-0.94-security/ws/trunk/target/surefire/surefire7533637748759456908tmp>
<https://builds.apache.org/job/HBase-0.94-security/ws/trunk/target/surefire/surefire_1533700389870705331398tmp>
Running org.apache.hadoop.hbase.regionserver.TestMultiColumnScanner
Tests run: 12, Failures: 0, Errors: 0, Skipped: 0, Time elapsed: 39.393 sec
Forking command line: /bin/sh -c cd <https://builds.apache.org/job/HBase-0.94-security/ws/trunk>
&& /home/jenkins/tools/java/jdk1.6.0_45-32/jre/bin/java -enableassertions -Xmx1900m
-Djava.security.egd=file:/dev/./urandom -jar <https://builds.apache.org/job/HBase-0.94-security/ws/trunk/target/surefire/surefirebooter2818495193444088365.jar>
<https://builds.apache.org/job/HBase-0.94-security/ws/trunk/target/surefire/surefire7396940745155016367tmp>
<https://builds.apache.org/job/HBase-0.94-security/ws/trunk/target/surefire/surefire_1547803658314804918690tmp>
Running org.apache.hadoop.hbase.TestClusterBootOrder
Tests run: 2, Failures: 0, Errors: 0, Skipped: 0, Time elapsed: 40.453 sec
Forking command line: /bin/sh -c cd <https://builds.apache.org/job/HBase-0.94-security/ws/trunk>
&& /home/jenkins/tools/java/jdk1.6.0_45-32/jre/bin/java -enableassertions -Xmx1900m
-Djava.security.egd=file:/dev/./urandom -jar <https://builds.apache.org/job/HBase-0.94-security/ws/trunk/target/surefire/surefirebooter8518294872055918838.jar>
<https://builds.apache.org/job/HBase-0.94-security/ws/trunk/target/surefire/surefire1554495320300972242tmp>
<https://builds.apache.org/job/HBase-0.94-security/ws/trunk/target/surefire/surefire_1551862826061489696384tmp>
Running org.apache.hadoop.hbase.TestDrainingServer
Tests run: 2, Failures: 0, Errors: 0, Skipped: 0, Time elapsed: 29.425 sec
Forking command line: /bin/sh -c cd <https://builds.apache.org/job/HBase-0.94-security/ws/trunk>
&& /home/jenkins/tools/java/jdk1.6.0_45-32/jre/bin/java -enableassertions -Xmx1900m
-Djava.security.egd=file:/dev/./urandom -jar <https://builds.apache.org/job/HBase-0.94-security/ws/trunk/target/surefire/surefirebooter6755068364069357824.jar>
<https://builds.apache.org/job/HBase-0.94-security/ws/trunk/target/surefire/surefire8734142362236147270tmp>
<https://builds.apache.org/job/HBase-0.94-security/ws/trunk/target/surefire/surefire_1566002277520757512550tmp>
Running org.apache.hadoop.hbase.backup.TestHFileArchiving
Tests run: 5, Failures: 0, Errors: 0, Skipped: 0, Time elapsed: 157.149 sec
Forking command line: /bin/sh -c cd <https://builds.apache.org/job/HBase-0.94-security/ws/trunk>
&& /home/jenkins/tools/java/jdk1.6.0_45-32/jre/bin/java -enableassertions -Xmx1900m
-Djava.security.egd=file:/dev/./urandom -jar <https://builds.apache.org/job/HBase-0.94-security/ws/trunk/target/surefire/surefirebooter411919943253587861.jar>
<https://builds.apache.org/job/HBase-0.94-security/ws/trunk/target/surefire/surefire6316621133690498427tmp>
<https://builds.apache.org/job/HBase-0.94-security/ws/trunk/target/surefire/surefire_1573960424170761176879tmp>
Running org.apache.hadoop.hbase.mapreduce.TestImportExport
Tests run: 4, Failures: 0, Errors: 0, Skipped: 0, Time elapsed: 132.766 sec
Forking command line: /bin/sh -c cd <https://builds.apache.org/job/HBase-0.94-security/ws/trunk>
&& /home/jenkins/tools/java/jdk1.6.0_45-32/jre/bin/java -enableassertions -Xmx1900m
-Djava.security.egd=file:/dev/./urandom -jar <https://builds.apache.org/job/HBase-0.94-security/ws/trunk/target/surefire/surefirebooter7759398714663688473.jar>
<https://builds.apache.org/job/HBase-0.94-security/ws/trunk/target/surefire/surefire4259120675643948666tmp>
<https://builds.apache.org/job/HBase-0.94-security/ws/trunk/target/surefire/surefire_158261921257543280773tmp>
Running org.apache.hadoop.hbase.mapreduce.TestHLogRecordReader
Tests run: 2, Failures: 0, Errors: 0, Skipped: 0, Time elapsed: 8.864 sec
Running org.apache.hadoop.hbase.mapreduce.TestImportTsv
Tests run: 13, Failures: 0, Errors: 0, Skipped: 0, Time elapsed: 276.376 sec

Results :

Failed tests:   testRetrying(org.apache.hadoop.hbase.catalog.TestMetaReaderEditor): reader:
count=2, t=null

Tests in error: 
  testGetRegionsCatalogTables(org.apache.hadoop.hbase.catalog.TestMetaReaderEditor): Failed
after attempts=10, exceptions:(..)
  testTableExists(org.apache.hadoop.hbase.catalog.TestMetaReaderEditor): Connection refused
  testGetRegion(org.apache.hadoop.hbase.catalog.TestMetaReaderEditor): Connection refused
  testScanMetaForTable(org.apache.hadoop.hbase.catalog.TestMetaReaderEditor)

Tests run: 911, Failures: 1, Errors: 4, Skipped: 2

[INFO] ------------------------------------------------------------------------
[INFO] BUILD FAILURE
[INFO] ------------------------------------------------------------------------
[INFO] Total time: 49:32.845s
[INFO] Finished at: Wed Nov 27 04:01:02 UTC 2013
[INFO] Final Memory: 48M/546M
[INFO] ------------------------------------------------------------------------
[ERROR] Failed to execute goal org.apache.maven.plugins:maven-surefire-plugin:2.12-TRUNK-HBASE-2:test
(secondPartTestsExecution) on project hbase: There are test failures.
[ERROR] 
[ERROR] Please refer to <https://builds.apache.org/job/HBase-0.94-security/ws/trunk/target/surefire-reports>
for the individual test results.
[ERROR] -> [Help 1]
org.apache.maven.lifecycle.LifecycleExecutionException: Failed to execute goal org.apache.maven.plugins:maven-surefire-plugin:2.12-TRUNK-HBASE-2:test
(secondPartTestsExecution) on project hbase: There are test failures.

Please refer to <https://builds.apache.org/job/HBase-0.94-security/ws/trunk/target/surefire-reports>
for the individual test results.
	at org.apache.maven.lifecycle.internal.MojoExecutor.execute(MojoExecutor.java:213)
	at org.apache.maven.lifecycle.internal.MojoExecutor.execute(MojoExecutor.java:153)
	at org.apache.maven.lifecycle.internal.MojoExecutor.execute(MojoExecutor.java:145)
	at org.apache.maven.lifecycle.internal.MojoExecutor.executeForkedExecutions(MojoExecutor.java:365)
	at org.apache.maven.lifecycle.internal.MojoExecutor.execute(MojoExecutor.java:199)
	at org.apache.maven.lifecycle.internal.MojoExecutor.execute(MojoExecutor.java:153)
	at org.apache.maven.lifecycle.internal.MojoExecutor.execute(MojoExecutor.java:145)
	at org.apache.maven.lifecycle.internal.LifecycleModuleBuilder.buildProject(LifecycleModuleBuilder.java:84)
	at org.apache.maven.lifecycle.internal.LifecycleModuleBuilder.buildProject(LifecycleModuleBuilder.java:59)
	at org.apache.maven.lifecycle.internal.LifecycleStarter.singleThreadedBuild(LifecycleStarter.java:183)
	at org.apache.maven.lifecycle.internal.LifecycleStarter.execute(LifecycleStarter.java:161)
	at org.apache.maven.DefaultMaven.doExecute(DefaultMaven.java:320)
	at org.apache.maven.DefaultMaven.execute(DefaultMaven.java:156)
	at org.apache.maven.cli.MavenCli.execute(MavenCli.java:537)
	at org.apache.maven.cli.MavenCli.doMain(MavenCli.java:196)
	at org.apache.maven.cli.MavenCli.main(MavenCli.java:141)
	at sun.reflect.NativeMethodAccessorImpl.invoke0(Native Method)
	at sun.reflect.NativeMethodAccessorImpl.invoke(NativeMethodAccessorImpl.java:39)
	at sun.reflect.DelegatingMethodAccessorImpl.invoke(DelegatingMethodAccessorImpl.java:25)
	at java.lang.reflect.Method.invoke(Method.java:597)
	at org.codehaus.plexus.classworlds.launcher.Launcher.launchEnhanced(Launcher.java:290)
	at org.codehaus.plexus.classworlds.launcher.Launcher.launch(Launcher.java:230)
	at org.codehaus.plexus.classworlds.launcher.Launcher.mainWithExitCode(Launcher.java:409)
	at org.codehaus.plexus.classworlds.launcher.Launcher.main(Launcher.java:352)
Caused by: org.apache.maven.plugin.MojoFailureException: There are test failures.

Please refer to <https://builds.apache.org/job/HBase-0.94-security/ws/trunk/target/surefire-reports>
for the individual test results.
	at org.apache.maven.plugin.surefire.SurefireHelper.reportExecution(SurefireHelper.java:87)
	at org.apache.maven.plugin.surefire.SurefirePlugin.writeSummary(SurefirePlugin.java:651)
	at org.apache.maven.plugin.surefire.SurefirePlugin.handleSummary(SurefirePlugin.java:625)
	at org.apache.maven.plugin.surefire.AbstractSurefireMojo.executeAfterPreconditionsChecked(AbstractSurefireMojo.java:137)
	at org.apache.maven.plugin.surefire.AbstractSurefireMojo.execute(AbstractSurefireMojo.java:98)
	at org.apache.maven.plugin.DefaultBuildPluginManager.executeMojo(DefaultBuildPluginManager.java:101)
	at org.apache.maven.lifecycle.internal.MojoExecutor.execute(MojoExecutor.java:209)
	... 23 more
[ERROR] 
[ERROR] 
[ERROR] For more information about the errors and possible solutions, please read the following
articles:
[ERROR] [Help 1] http://cwiki.apache.org/confluence/display/MAVEN/MojoFailureException
Build step 'Invoke top-level Maven targets' marked build as failure
Archiving artifacts
Updating HBASE-10026
Updating HBASE-10015
Recording test results

Mime
View raw message