hbase-builds mailing list archives

Site index · List index
Message view « Date » · « Thread »
Top « Date » · « Thread »
From Apache Jenkins Server <jenk...@builds.apache.org>
Subject Build failed in Jenkins: hbase-0.96 #175
Date Fri, 01 Nov 2013 01:52:58 GMT
See <https://builds.apache.org/job/hbase-0.96/175/changes>

Changes:

[stack] HBASE-9867 Save on array copies with a subclass of LiteralByteString

[tedyu] HBASE-8559 increase unit-test coverage of package org.apache.hadoop.hbase.coprocessor

------------------------------------------
[...truncated 3027 lines...]
Tests run: 2, Failures: 0, Errors: 0, Skipped: 0, Time elapsed: 0.02 sec
Running org.apache.hadoop.hbase.util.TestThreads
Tests run: 1, Failures: 0, Errors: 0, Skipped: 0, Time elapsed: 3.014 sec
Running org.apache.hadoop.hbase.util.TestBytes
Tests run: 27, Failures: 0, Errors: 0, Skipped: 0, Time elapsed: 1.64 sec
Running org.apache.hadoop.hbase.TestHBaseConfiguration
Tests run: 1, Failures: 0, Errors: 0, Skipped: 0, Time elapsed: 0.092 sec
Running org.apache.hadoop.hbase.types.TestStructNullExtension
Tests run: 2, Failures: 0, Errors: 0, Skipped: 0, Time elapsed: 0.026 sec
Running org.apache.hadoop.hbase.types.TestStruct
Tests run: 2, Failures: 0, Errors: 0, Skipped: 0, Time elapsed: 0.023 sec
Running org.apache.hadoop.hbase.types.TestRawString
Tests run: 1, Failures: 0, Errors: 0, Skipped: 0, Time elapsed: 0.011 sec
Running org.apache.hadoop.hbase.types.TestOrderedBlob
Tests run: 1, Failures: 0, Errors: 0, Skipped: 0, Time elapsed: 0.011 sec
Running org.apache.hadoop.hbase.types.TestOrderedBlobVar
Tests run: 1, Failures: 0, Errors: 0, Skipped: 0, Time elapsed: 0.011 sec
Running org.apache.hadoop.hbase.types.TestOrderedString
Tests run: 1, Failures: 0, Errors: 0, Skipped: 0, Time elapsed: 0.011 sec
Running org.apache.hadoop.hbase.types.TestFixedLengthWrapper
Tests run: 4, Failures: 0, Errors: 0, Skipped: 0, Time elapsed: 0.043 sec
Running org.apache.hadoop.hbase.types.TestUnion2
Tests run: 2, Failures: 0, Errors: 0, Skipped: 0, Time elapsed: 0.027 sec
Running org.apache.hadoop.hbase.types.TestTerminatedWrapper
Tests run: 8, Failures: 0, Errors: 0, Skipped: 0, Time elapsed: 0.091 sec
Running org.apache.hadoop.hbase.codec.TestKeyValueCodec
Tests run: 3, Failures: 0, Errors: 0, Skipped: 0, Time elapsed: 0.05 sec
Running org.apache.hadoop.hbase.codec.TestCellCodec
Tests run: 3, Failures: 0, Errors: 0, Skipped: 0, Time elapsed: 0.044 sec
Running org.apache.hadoop.hbase.TestKeyValue
Tests run: 16, Failures: 0, Errors: 0, Skipped: 0, Time elapsed: 0.168 sec
Running org.apache.hadoop.hbase.TestClassFinder
Tests run: 11, Failures: 0, Errors: 0, Skipped: 0, Time elapsed: 12.183 sec

Results :

Tests run: 132, Failures: 0, Errors: 0, Skipped: 0

[INFO] 
[INFO] --- maven-surefire-plugin:2.12-TRUNK-HBASE-2:test (secondPartTestsExecution) @ hbase-common
---
[INFO] Tests are skipped.
[INFO] 
[INFO] --- maven-source-plugin:2.2.1:jar-no-fork (attach-sources) @ hbase-common ---
[INFO] Building jar: <https://builds.apache.org/job/hbase-0.96/ws/0.96/hbase-common/target/hbase-common-0.96.1-SNAPSHOT-sources.jar>
[INFO] 
[INFO] --- maven-jar-plugin:2.4:test-jar (default) @ hbase-common ---
[INFO] Building jar: <https://builds.apache.org/job/hbase-0.96/ws/0.96/hbase-common/target/hbase-common-0.96.1-SNAPSHOT-tests.jar>
[INFO] 
[INFO] --- maven-jar-plugin:2.4:jar (default-jar) @ hbase-common ---
[INFO] Building jar: <https://builds.apache.org/job/hbase-0.96/ws/0.96/hbase-common/target/hbase-common-0.96.1-SNAPSHOT.jar>
[INFO] 
[INFO] --- maven-install-plugin:2.3.1:install (default-install) @ hbase-common ---
[INFO] Installing <https://builds.apache.org/job/hbase-0.96/ws/0.96/hbase-common/target/hbase-common-0.96.1-SNAPSHOT.jar>
to /home/jenkins/.m2/repository/org/apache/hbase/hbase-common/0.96.1-SNAPSHOT/hbase-common-0.96.1-SNAPSHOT.jar
[INFO] Installing <https://builds.apache.org/job/hbase-0.96/ws/0.96/hbase-common/pom.xml>
to /home/jenkins/.m2/repository/org/apache/hbase/hbase-common/0.96.1-SNAPSHOT/hbase-common-0.96.1-SNAPSHOT.pom
[INFO] Installing <https://builds.apache.org/job/hbase-0.96/ws/0.96/hbase-common/target/hbase-common-0.96.1-SNAPSHOT-sources.jar>
to /home/jenkins/.m2/repository/org/apache/hbase/hbase-common/0.96.1-SNAPSHOT/hbase-common-0.96.1-SNAPSHOT-sources.jar
[INFO] Installing <https://builds.apache.org/job/hbase-0.96/ws/0.96/hbase-common/target/hbase-common-0.96.1-SNAPSHOT-tests.jar>
to /home/jenkins/.m2/repository/org/apache/hbase/hbase-common/0.96.1-SNAPSHOT/hbase-common-0.96.1-SNAPSHOT-tests.jar
[INFO]                                                                         
[INFO] ------------------------------------------------------------------------
[INFO] Building HBase - Protocol 0.96.1-SNAPSHOT
[INFO] ------------------------------------------------------------------------
[INFO] 
[INFO] --- maven-remote-resources-plugin:1.4:process (default) @ hbase-protocol ---
[INFO] 
[INFO] --- maven-resources-plugin:2.6:resources (default-resources) @ hbase-protocol ---
[INFO] Using 'UTF-8' encoding to copy filtered resources.
[INFO] skip non existing resourceDirectory <https://builds.apache.org/job/hbase-0.96/ws/0.96/hbase-protocol/src/main/resources>
[INFO] Copying 3 resources
[INFO] 
[INFO] --- maven-compiler-plugin:2.5.1:compile (default-compile) @ hbase-protocol ---
[INFO] Compiling 26 source files to <https://builds.apache.org/job/hbase-0.96/ws/0.96/hbase-protocol/target/classes>
[INFO] 
[INFO] --- maven-resources-plugin:2.6:testResources (default-testResources) @ hbase-protocol
---
[INFO] Using 'UTF-8' encoding to copy filtered resources.
[INFO] skip non existing resourceDirectory <https://builds.apache.org/job/hbase-0.96/ws/0.96/hbase-protocol/src/test/resources>
[INFO] Copying 3 resources
[INFO] 
[INFO] --- maven-compiler-plugin:2.5.1:testCompile (default-testCompile) @ hbase-protocol
---
[INFO] No sources to compile
[INFO] 
[INFO] --- maven-surefire-plugin:2.12-TRUNK-HBASE-2:test (default-test) @ hbase-protocol ---
[INFO] Surefire report directory: <https://builds.apache.org/job/hbase-0.96/ws/0.96/hbase-protocol/target/surefire-reports>
[INFO] Using configured provider org.apache.maven.surefire.junitcore.JUnitCoreProvider

-------------------------------------------------------
 T E S T S
-------------------------------------------------------

Results :

Tests run: 0, Failures: 0, Errors: 0, Skipped: 0

[INFO] 
[INFO] --- maven-surefire-plugin:2.12-TRUNK-HBASE-2:test (secondPartTestsExecution) @ hbase-protocol
---
[INFO] Tests are skipped.
[INFO] 
[INFO] --- maven-source-plugin:2.2.1:jar-no-fork (attach-sources) @ hbase-protocol ---
[INFO] Building jar: <https://builds.apache.org/job/hbase-0.96/ws/0.96/hbase-protocol/target/hbase-protocol-0.96.1-SNAPSHOT-sources.jar>
[INFO] 
[INFO] --- maven-jar-plugin:2.4:test-jar (default) @ hbase-protocol ---
[INFO] Building jar: <https://builds.apache.org/job/hbase-0.96/ws/0.96/hbase-protocol/target/hbase-protocol-0.96.1-SNAPSHOT-tests.jar>
[INFO] 
[INFO] --- maven-jar-plugin:2.4:jar (default-jar) @ hbase-protocol ---
[INFO] Building jar: <https://builds.apache.org/job/hbase-0.96/ws/0.96/hbase-protocol/target/hbase-protocol-0.96.1-SNAPSHOT.jar>
[INFO] 
[INFO] --- maven-install-plugin:2.3.1:install (default-install) @ hbase-protocol ---
[INFO] Installing <https://builds.apache.org/job/hbase-0.96/ws/0.96/hbase-protocol/target/hbase-protocol-0.96.1-SNAPSHOT.jar>
to /home/jenkins/.m2/repository/org/apache/hbase/hbase-protocol/0.96.1-SNAPSHOT/hbase-protocol-0.96.1-SNAPSHOT.jar
[INFO] Installing <https://builds.apache.org/job/hbase-0.96/ws/0.96/hbase-protocol/pom.xml>
to /home/jenkins/.m2/repository/org/apache/hbase/hbase-protocol/0.96.1-SNAPSHOT/hbase-protocol-0.96.1-SNAPSHOT.pom
[INFO] Installing <https://builds.apache.org/job/hbase-0.96/ws/0.96/hbase-protocol/target/hbase-protocol-0.96.1-SNAPSHOT-sources.jar>
to /home/jenkins/.m2/repository/org/apache/hbase/hbase-protocol/0.96.1-SNAPSHOT/hbase-protocol-0.96.1-SNAPSHOT-sources.jar
[INFO] Installing <https://builds.apache.org/job/hbase-0.96/ws/0.96/hbase-protocol/target/hbase-protocol-0.96.1-SNAPSHOT-tests.jar>
to /home/jenkins/.m2/repository/org/apache/hbase/hbase-protocol/0.96.1-SNAPSHOT/hbase-protocol-0.96.1-SNAPSHOT-tests.jar
[INFO]                                                                         
[INFO] ------------------------------------------------------------------------
[INFO] Building HBase - Client 0.96.1-SNAPSHOT
[INFO] ------------------------------------------------------------------------
[INFO] 
[INFO] --- maven-remote-resources-plugin:1.4:process (default) @ hbase-client ---
[INFO] 
[INFO] --- maven-resources-plugin:2.6:resources (default-resources) @ hbase-client ---
[INFO] Using 'UTF-8' encoding to copy filtered resources.
[INFO] skip non existing resourceDirectory <https://builds.apache.org/job/hbase-0.96/ws/0.96/hbase-client/src/main/resources>
[INFO] Copying 3 resources
[INFO] 
[INFO] --- maven-compiler-plugin:2.5.1:compile (default-compile) @ hbase-client ---
[INFO] Compiling 245 source files to <https://builds.apache.org/job/hbase-0.96/ws/0.96/hbase-client/target/classes>
[INFO] 
[INFO] --- maven-resources-plugin:2.6:testResources (default-testResources) @ hbase-client
---
[INFO] Using 'UTF-8' encoding to copy filtered resources.
[INFO] Copying 2 resources
[INFO] Copying 3 resources
[INFO] 
[INFO] --- maven-compiler-plugin:2.5.1:testCompile (default-testCompile) @ hbase-client ---
[INFO] Compiling 12 source files to <https://builds.apache.org/job/hbase-0.96/ws/0.96/hbase-client/target/test-classes>
[INFO] 
[INFO] --- maven-surefire-plugin:2.12-TRUNK-HBASE-2:test (default-test) @ hbase-client ---
[INFO] Surefire report directory: <https://builds.apache.org/job/hbase-0.96/ws/0.96/hbase-client/target/surefire-reports>
[INFO] Using configured provider org.apache.maven.surefire.junitcore.JUnitCoreProvider

-------------------------------------------------------
 T E S T S
-------------------------------------------------------
Running org.apache.hadoop.hbase.client.TestClientNoCluster
Tests run: 5, Failures: 0, Errors: 0, Skipped: 1, Time elapsed: 0.963 sec
Running org.apache.hadoop.hbase.client.TestPutWriteToWal
Tests run: 4, Failures: 0, Errors: 0, Skipped: 0, Time elapsed: 0.003 sec
Running org.apache.hadoop.hbase.client.TestSnapshotFromAdmin
Tests run: 2, Failures: 0, Errors: 0, Skipped: 0, Time elapsed: 3.859 sec
Running org.apache.hadoop.hbase.client.TestAttributes
Tests run: 7, Failures: 0, Errors: 0, Skipped: 0, Time elapsed: 0.003 sec
Running org.apache.hadoop.hbase.client.TestOperation
Tests run: 1, Failures: 0, Errors: 0, Skipped: 0, Time elapsed: 0.082 sec
Running org.apache.hadoop.hbase.client.TestPutDotHas
Tests run: 4, Failures: 0, Errors: 0, Skipped: 0, Time elapsed: 0 sec
Running org.apache.hadoop.hbase.client.TestGet
Tests run: 4, Failures: 0, Errors: 0, Skipped: 0, Time elapsed: 0.025 sec
Running org.apache.hadoop.hbase.client.TestIncrement
Tests run: 1, Failures: 0, Errors: 0, Skipped: 0, Time elapsed: 0.001 sec
Running org.apache.hadoop.hbase.client.TestScan
Tests run: 3, Failures: 0, Errors: 0, Skipped: 0, Time elapsed: 0.001 sec
Running org.apache.hadoop.hbase.ipc.TestPayloadCarryingRpcController
Tests run: 1, Failures: 0, Errors: 0, Skipped: 0, Time elapsed: 0.003 sec
Running org.apache.hadoop.hbase.client.TestAsyncProcess
Tests run: 18, Failures: 2, Errors: 0, Skipped: 0, Time elapsed: 29.218 sec <<< FAILURE!
Running org.apache.hadoop.hbase.ipc.TestIPCUtil
Tests run: 1, Failures: 0, Errors: 0, Skipped: 0, Time elapsed: 29.218 sec

Results :

Failed tests:   testWithNoClearOnFail(org.apache.hadoop.hbase.client.TestAsyncProcess): expected:<1>
but was:<0>
  doHTableFailedPutWithoutBuffer(org.apache.hadoop.hbase.client.TestAsyncProcess)

Tests run: 51, Failures: 2, Errors: 0, Skipped: 1

[INFO] ------------------------------------------------------------------------
[INFO] Reactor Summary:
[INFO] 
[INFO] HBase ............................................. SUCCESS [4.771s]
[INFO] HBase - Common .................................... SUCCESS [22.342s]
[INFO] HBase - Protocol .................................. SUCCESS [9.415s]
[INFO] HBase - Client .................................... FAILURE [31.937s]
[INFO] HBase - Hadoop Compatibility ...................... SKIPPED
[INFO] HBase - Hadoop One Compatibility .................. SKIPPED
[INFO] HBase - Prefix Tree ............................... SKIPPED
[INFO] HBase - Server .................................... SKIPPED
[INFO] HBase - Testing Util .............................. SKIPPED
[INFO] HBase - Thrift .................................... SKIPPED
[INFO] HBase - Shell ..................................... SKIPPED
[INFO] HBase - Integration Tests ......................... SKIPPED
[INFO] HBase - Examples .................................. SKIPPED
[INFO] HBase - Assembly .................................. SKIPPED
[INFO] ------------------------------------------------------------------------
[INFO] BUILD FAILURE
[INFO] ------------------------------------------------------------------------
[INFO] Total time: 1:09.242s
[INFO] Finished at: Fri Nov 01 01:52:49 UTC 2013
[INFO] Final Memory: 45M/618M
[INFO] ------------------------------------------------------------------------
[ERROR] Failed to execute goal org.apache.maven.plugins:maven-surefire-plugin:2.12-TRUNK-HBASE-2:test
(default-test) on project hbase-client: There are test failures.
[ERROR] 
[ERROR] Please refer to <https://builds.apache.org/job/hbase-0.96/ws/0.96/hbase-client/target/surefire-reports>
for the individual test results.
[ERROR] -> [Help 1]
[ERROR] 
[ERROR] To see the full stack trace of the errors, re-run Maven with the -e switch.
[ERROR] Re-run Maven using the -X switch to enable full debug logging.
[ERROR] 
[ERROR] For more information about the errors and possible solutions, please read the following
articles:
[ERROR] [Help 1] http://cwiki.apache.org/confluence/display/MAVEN/MojoFailureException
[ERROR] 
[ERROR] After correcting the problems, you can resume the build with the command
[ERROR]   mvn <goals> -rf :hbase-client
Build step 'Invoke top-level Maven targets' marked build as failure
Performing Post build task...
Match found for :.* : True
Logical operation result is TRUE
Running script  :   ZOMBIE_TESTS_COUNT=`jps | grep surefirebooter | wc -l`
  if [[ $ZOMBIE_TESTS_COUNT != 0 ]] ; then
    #It seems sometimes the tests are not dying immediately. Let's give them 10s
    echo "Suspicious java process found - waiting 10s to see if there are just slow to stop"
    sleep 10
    ZOMBIE_TESTS_COUNT=`jps | grep surefirebooter | wc -l`
    if [[ $ZOMBIE_TESTS_COUNT != 0 ]] ; then
      echo "There are $ZOMBIE_TESTS_COUNT zombie tests, they should have been killed by surefire
but survived"
      echo "************ BEGIN zombies jstack extract"
      ZB_STACK=`jps | grep surefirebooter | cut -d ' ' -f 1 | xargs -n 1 jstack | grep ".test"
| grep "\.java"`
      jps | grep surefirebooter | cut -d ' ' -f 1 | xargs -n 1 jstack
      echo "************ END  zombies jstack extract"
      JIRA_COMMENT="$JIRA_COMMENT

     {color:red}-1 core zombie tests{color}.  There are ${ZOMBIE_TESTS_COUNT} zombie test(s):
${ZB_STACK}"
      BAD=1
      jps | grep surefirebooter | cut -d ' ' -f 1 | xargs kill -9
    else
      echo "We're ok: there is no zombie test, but some tests took some time to stop"
    fi
  else
    echo "We're ok: there is no zombie test"
  fi
[hbase-0.96] $ /bin/bash -xe /tmp/hudson1042519890682348025.sh
++ jps
++ grep surefirebooter
++ wc -l
+ ZOMBIE_TESTS_COUNT=0
+ [[ 0 != 0 ]]
+ echo 'We'\''re ok: there is no zombie test'
We're ok: there is no zombie test
POST BUILD TASK : SUCCESS
END OF POST BUILD TASK : 0
Archiving artifacts
Recording test results
Updating HBASE-8559
Updating HBASE-9867

Mime
View raw message