hbase-builds mailing list archives

Site index · List index
Message view « Date » · « Thread »
Top « Date » · « Thread »
From Apache Jenkins Server <jenk...@builds.apache.org>
Subject Build failed in Jenkins: HBase-0.92-security #151
Date Sun, 05 Jan 2014 02:41:13 GMT
See <https://builds.apache.org/job/HBase-0.92-security/151/>

------------------------------------------
[...truncated 7836 lines...]
Tests run: 61, Failures: 0, Errors: 0, Skipped: 0, Time elapsed: 45.895 sec
Forking command line: /bin/sh -c cd <https://builds.apache.org/job/HBase-0.92-security/ws/trunk> && /home/jenkins/tools/java/jdk1.6.0_45-32/jre/bin/java -enableassertions -Xmx1400m -Djava.security.egd=file:/dev/./urandom -jar <https://builds.apache.org/job/HBase-0.92-security/ws/trunk/target/surefire/surefirebooter2772479930350401520.jar> <https://builds.apache.org/job/HBase-0.92-security/ws/trunk/target/surefire/surefire8180161694772197934tmp> <https://builds.apache.org/job/HBase-0.92-security/ws/trunk/target/surefire/surefire1583575614799483784tmp>
Running org.apache.hadoop.hbase.regionserver.TestMasterAddressManager
Tests run: 1, Failures: 0, Errors: 0, Skipped: 0, Time elapsed: 1.279 sec
Forking command line: /bin/sh -c cd <https://builds.apache.org/job/HBase-0.92-security/ws/trunk> && /home/jenkins/tools/java/jdk1.6.0_45-32/jre/bin/java -enableassertions -Xmx1400m -Djava.security.egd=file:/dev/./urandom -jar <https://builds.apache.org/job/HBase-0.92-security/ws/trunk/target/surefire/surefirebooter3765322620911412909.jar> <https://builds.apache.org/job/HBase-0.92-security/ws/trunk/target/surefire/surefire3674887799342033920tmp> <https://builds.apache.org/job/HBase-0.92-security/ws/trunk/target/surefire/surefire239929770283913751tmp>
Running org.apache.hadoop.hbase.regionserver.TestCompoundBloomFilter
Tests run: 3, Failures: 0, Errors: 0, Skipped: 0, Time elapsed: 21.536 sec
Forking command line: /bin/sh -c cd <https://builds.apache.org/job/HBase-0.92-security/ws/trunk> && /home/jenkins/tools/java/jdk1.6.0_45-32/jre/bin/java -enableassertions -Xmx1400m -Djava.security.egd=file:/dev/./urandom -jar <https://builds.apache.org/job/HBase-0.92-security/ws/trunk/target/surefire/surefirebooter7527951248497153043.jar> <https://builds.apache.org/job/HBase-0.92-security/ws/trunk/target/surefire/surefire5007662549203056091tmp> <https://builds.apache.org/job/HBase-0.92-security/ws/trunk/target/surefire/surefire7889179606725364381tmp>
Running org.apache.hadoop.hbase.regionserver.TestSplitLogWorker
Tests run: 5, Failures: 0, Errors: 0, Skipped: 0, Time elapsed: 5.087 sec
Forking command line: /bin/sh -c cd <https://builds.apache.org/job/HBase-0.92-security/ws/trunk> && /home/jenkins/tools/java/jdk1.6.0_45-32/jre/bin/java -enableassertions -Xmx1400m -Djava.security.egd=file:/dev/./urandom -jar <https://builds.apache.org/job/HBase-0.92-security/ws/trunk/target/surefire/surefirebooter4613970275578335367.jar> <https://builds.apache.org/job/HBase-0.92-security/ws/trunk/target/surefire/surefire3677749517094757195tmp> <https://builds.apache.org/job/HBase-0.92-security/ws/trunk/target/surefire/surefire2609042707441649405tmp>
Running org.apache.hadoop.hbase.regionserver.TestServerCustomProtocol
Tests run: 7, Failures: 0, Errors: 0, Skipped: 0, Time elapsed: 28.884 sec
Forking command line: /bin/sh -c cd <https://builds.apache.org/job/HBase-0.92-security/ws/trunk> && /home/jenkins/tools/java/jdk1.6.0_45-32/jre/bin/java -enableassertions -Xmx1400m -Djava.security.egd=file:/dev/./urandom -jar <https://builds.apache.org/job/HBase-0.92-security/ws/trunk/target/surefire/surefirebooter5962555301709957935.jar> <https://builds.apache.org/job/HBase-0.92-security/ws/trunk/target/surefire/surefire2987933422835883889tmp> <https://builds.apache.org/job/HBase-0.92-security/ws/trunk/target/surefire/surefire5201438753373293097tmp>
Running org.apache.hadoop.hbase.regionserver.TestScanWithBloomError
Tests run: 3, Failures: 0, Errors: 0, Skipped: 0, Time elapsed: 1.079 sec
Forking command line: /bin/sh -c cd <https://builds.apache.org/job/HBase-0.92-security/ws/trunk> && /home/jenkins/tools/java/jdk1.6.0_45-32/jre/bin/java -enableassertions -Xmx1400m -Djava.security.egd=file:/dev/./urandom -jar <https://builds.apache.org/job/HBase-0.92-security/ws/trunk/target/surefire/surefirebooter1850559146885766691.jar> <https://builds.apache.org/job/HBase-0.92-security/ws/trunk/target/surefire/surefire6451028030807806500tmp> <https://builds.apache.org/job/HBase-0.92-security/ws/trunk/target/surefire/surefire4261743633250102775tmp>
Running org.apache.hadoop.hbase.regionserver.TestStoreFileBlockCacheSummary
Tests run: 1, Failures: 0, Errors: 0, Skipped: 0, Time elapsed: 28.566 sec
Forking command line: /bin/sh -c cd <https://builds.apache.org/job/HBase-0.92-security/ws/trunk> && /home/jenkins/tools/java/jdk1.6.0_45-32/jre/bin/java -enableassertions -Xmx1400m -Djava.security.egd=file:/dev/./urandom -jar <https://builds.apache.org/job/HBase-0.92-security/ws/trunk/target/surefire/surefirebooter3861478587152718557.jar> <https://builds.apache.org/job/HBase-0.92-security/ws/trunk/target/surefire/surefire2249508330504845333tmp> <https://builds.apache.org/job/HBase-0.92-security/ws/trunk/target/surefire/surefire284588852563688397tmp>
Running org.apache.hadoop.hbase.regionserver.TestStore
Tests run: 11, Failures: 0, Errors: 0, Skipped: 0, Time elapsed: 1.826 sec
Forking command line: /bin/sh -c cd <https://builds.apache.org/job/HBase-0.92-security/ws/trunk> && /home/jenkins/tools/java/jdk1.6.0_45-32/jre/bin/java -enableassertions -Xmx1400m -Djava.security.egd=file:/dev/./urandom -jar <https://builds.apache.org/job/HBase-0.92-security/ws/trunk/target/surefire/surefirebooter1891755609105597672.jar> <https://builds.apache.org/job/HBase-0.92-security/ws/trunk/target/surefire/surefire373935417492438020tmp> <https://builds.apache.org/job/HBase-0.92-security/ws/trunk/target/surefire/surefire3073233369801169304tmp>
Running org.apache.hadoop.hbase.regionserver.TestBlocksRead
Tests run: 3, Failures: 0, Errors: 0, Skipped: 0, Time elapsed: 1.064 sec
Forking command line: /bin/sh -c cd <https://builds.apache.org/job/HBase-0.92-security/ws/trunk> && /home/jenkins/tools/java/jdk1.6.0_45-32/jre/bin/java -enableassertions -Xmx1400m -Djava.security.egd=file:/dev/./urandom -jar <https://builds.apache.org/job/HBase-0.92-security/ws/trunk/target/surefire/surefirebooter4426566482748503046.jar> <https://builds.apache.org/job/HBase-0.92-security/ws/trunk/target/surefire/surefire2606640642325784925tmp> <https://builds.apache.org/job/HBase-0.92-security/ws/trunk/target/surefire/surefire2542856974086027454tmp>
Running org.apache.hadoop.hbase.regionserver.TestRSKilledWhenMasterInitializing
Tests run: 1, Failures: 0, Errors: 0, Skipped: 0, Time elapsed: 59.457 sec
Forking command line: /bin/sh -c cd <https://builds.apache.org/job/HBase-0.92-security/ws/trunk> && /home/jenkins/tools/java/jdk1.6.0_45-32/jre/bin/java -enableassertions -Xmx1400m -Djava.security.egd=file:/dev/./urandom -jar <https://builds.apache.org/job/HBase-0.92-security/ws/trunk/target/surefire/surefirebooter1812761593996714680.jar> <https://builds.apache.org/job/HBase-0.92-security/ws/trunk/target/surefire/surefire5986464456844773352tmp> <https://builds.apache.org/job/HBase-0.92-security/ws/trunk/target/surefire/surefire3850548204482608352tmp>
Running org.apache.hadoop.hbase.regionserver.TestFSErrorsExposed
Tests run: 3, Failures: 0, Errors: 0, Skipped: 0, Time elapsed: 41.305 sec
Forking command line: /bin/sh -c cd <https://builds.apache.org/job/HBase-0.92-security/ws/trunk> && /home/jenkins/tools/java/jdk1.6.0_45-32/jre/bin/java -enableassertions -Xmx1400m -Djava.security.egd=file:/dev/./urandom -jar <https://builds.apache.org/job/HBase-0.92-security/ws/trunk/target/surefire/surefirebooter5777837451061865839.jar> <https://builds.apache.org/job/HBase-0.92-security/ws/trunk/target/surefire/surefire528915165980180082tmp> <https://builds.apache.org/job/HBase-0.92-security/ws/trunk/target/surefire/surefire2797105367679368469tmp>
Running org.apache.hadoop.hbase.regionserver.handler.TestCloseRegionHandler
Tests run: 3, Failures: 0, Errors: 0, Skipped: 0, Time elapsed: 2.101 sec
Forking command line: /bin/sh -c cd <https://builds.apache.org/job/HBase-0.92-security/ws/trunk> && /home/jenkins/tools/java/jdk1.6.0_45-32/jre/bin/java -enableassertions -Xmx1400m -Djava.security.egd=file:/dev/./urandom -jar <https://builds.apache.org/job/HBase-0.92-security/ws/trunk/target/surefire/surefirebooter5814133893525357091.jar> <https://builds.apache.org/job/HBase-0.92-security/ws/trunk/target/surefire/surefire1904592684783363083tmp> <https://builds.apache.org/job/HBase-0.92-security/ws/trunk/target/surefire/surefire6795585991550683345tmp>
Running org.apache.hadoop.hbase.regionserver.handler.TestOpenRegionHandler
Tests run: 3, Failures: 0, Errors: 0, Skipped: 0, Time elapsed: 1.827 sec
Forking command line: /bin/sh -c cd <https://builds.apache.org/job/HBase-0.92-security/ws/trunk> && /home/jenkins/tools/java/jdk1.6.0_45-32/jre/bin/java -enableassertions -Xmx1400m -Djava.security.egd=file:/dev/./urandom -jar <https://builds.apache.org/job/HBase-0.92-security/ws/trunk/target/surefire/surefirebooter6973702368612775053.jar> <https://builds.apache.org/job/HBase-0.92-security/ws/trunk/target/surefire/surefire7525362385533812103tmp> <https://builds.apache.org/job/HBase-0.92-security/ws/trunk/target/surefire/surefire7485748191496004355tmp>
Running org.apache.hadoop.hbase.regionserver.TestScanDeleteTracker
Tests run: 6, Failures: 0, Errors: 0, Skipped: 0, Time elapsed: 0.611 sec
Forking command line: /bin/sh -c cd <https://builds.apache.org/job/HBase-0.92-security/ws/trunk> && /home/jenkins/tools/java/jdk1.6.0_45-32/jre/bin/java -enableassertions -Xmx1400m -Djava.security.egd=file:/dev/./urandom -jar <https://builds.apache.org/job/HBase-0.92-security/ws/trunk/target/surefire/surefirebooter6516340893477080088.jar> <https://builds.apache.org/job/HBase-0.92-security/ws/trunk/target/surefire/surefire2329577004045666922tmp> <https://builds.apache.org/job/HBase-0.92-security/ws/trunk/target/surefire/surefire3648175365931749056tmp>
Running org.apache.hadoop.hbase.regionserver.TestSplitTransactionOnCluster
Tests run: 8, Failures: 0, Errors: 0, Skipped: 0, Time elapsed: 144.48 sec
Forking command line: /bin/sh -c cd <https://builds.apache.org/job/HBase-0.92-security/ws/trunk> && /home/jenkins/tools/java/jdk1.6.0_45-32/jre/bin/java -enableassertions -Xmx1400m -Djava.security.egd=file:/dev/./urandom -jar <https://builds.apache.org/job/HBase-0.92-security/ws/trunk/target/surefire/surefirebooter8807983898302628513.jar> <https://builds.apache.org/job/HBase-0.92-security/ws/trunk/target/surefire/surefire5676518856994615904tmp> <https://builds.apache.org/job/HBase-0.92-security/ws/trunk/target/surefire/surefire2184540132267910163tmp>
Running org.apache.hadoop.hbase.regionserver.TestHRegionServerBulkLoad
Tests run: 1, Failures: 0, Errors: 0, Skipped: 0, Time elapsed: 61.384 sec
Forking command line: /bin/sh -c cd <https://builds.apache.org/job/HBase-0.92-security/ws/trunk> && /home/jenkins/tools/java/jdk1.6.0_45-32/jre/bin/java -enableassertions -Xmx1400m -Djava.security.egd=file:/dev/./urandom -jar <https://builds.apache.org/job/HBase-0.92-security/ws/trunk/target/surefire/surefirebooter2186585745285395444.jar> <https://builds.apache.org/job/HBase-0.92-security/ws/trunk/target/surefire/surefire5572839637392744742tmp> <https://builds.apache.org/job/HBase-0.92-security/ws/trunk/target/surefire/surefire4609516481645669431tmp>
Running org.apache.hadoop.hbase.regionserver.TestSplitTransaction
Tests run: 7, Failures: 0, Errors: 0, Skipped: 0, Time elapsed: 4.053 sec
Forking command line: /bin/sh -c cd <https://builds.apache.org/job/HBase-0.92-security/ws/trunk> && /home/jenkins/tools/java/jdk1.6.0_45-32/jre/bin/java -enableassertions -Xmx1400m -Djava.security.egd=file:/dev/./urandom -jar <https://builds.apache.org/job/HBase-0.92-security/ws/trunk/target/surefire/surefirebooter7994299849091909810.jar> <https://builds.apache.org/job/HBase-0.92-security/ws/trunk/target/surefire/surefire3534779355710271276tmp> <https://builds.apache.org/job/HBase-0.92-security/ws/trunk/target/surefire/surefire9016898008842747065tmp>
Running org.apache.hadoop.hbase.regionserver.TestReadWriteConsistencyControl
Tests run: 1, Failures: 0, Errors: 0, Skipped: 0, Time elapsed: 10.107 sec
Forking command line: /bin/sh -c cd <https://builds.apache.org/job/HBase-0.92-security/ws/trunk> && /home/jenkins/tools/java/jdk1.6.0_45-32/jre/bin/java -enableassertions -Xmx1400m -Djava.security.egd=file:/dev/./urandom -jar <https://builds.apache.org/job/HBase-0.92-security/ws/trunk/target/surefire/surefirebooter4265320865790005616.jar> <https://builds.apache.org/job/HBase-0.92-security/ws/trunk/target/surefire/surefire2641973691090110208tmp> <https://builds.apache.org/job/HBase-0.92-security/ws/trunk/target/surefire/surefire1427997028744780528tmp>
Running org.apache.hadoop.hbase.regionserver.TestKeyValueHeap
Tests run: 3, Failures: 0, Errors: 0, Skipped: 0, Time elapsed: 0.516 sec
Forking command line: /bin/sh -c cd <https://builds.apache.org/job/HBase-0.92-security/ws/trunk> && /home/jenkins/tools/java/jdk1.6.0_45-32/jre/bin/java -enableassertions -Xmx1400m -Djava.security.egd=file:/dev/./urandom -jar <https://builds.apache.org/job/HBase-0.92-security/ws/trunk/target/surefire/surefirebooter3304589824000957964.jar> <https://builds.apache.org/job/HBase-0.92-security/ws/trunk/target/surefire/surefire1012150711463719310tmp> <https://builds.apache.org/job/HBase-0.92-security/ws/trunk/target/surefire/surefire6296476231262776504tmp>
Running org.apache.hadoop.hbase.regionserver.TestCompactSelection
Tests run: 1, Failures: 0, Errors: 0, Skipped: 0, Time elapsed: 0.686 sec
Forking command line: /bin/sh -c cd <https://builds.apache.org/job/HBase-0.92-security/ws/trunk> && /home/jenkins/tools/java/jdk1.6.0_45-32/jre/bin/java -enableassertions -Xmx1400m -Djava.security.egd=file:/dev/./urandom -jar <https://builds.apache.org/job/HBase-0.92-security/ws/trunk/target/surefire/surefirebooter5957671761340915107.jar> <https://builds.apache.org/job/HBase-0.92-security/ws/trunk/target/surefire/surefire6652844953669151148tmp> <https://builds.apache.org/job/HBase-0.92-security/ws/trunk/target/surefire/surefire430989001696058909tmp>
Running org.apache.hadoop.hbase.regionserver.TestMinVersions
Tests run: 6, Failures: 0, Errors: 0, Skipped: 0, Time elapsed: 1.254 sec
Forking command line: /bin/sh -c cd <https://builds.apache.org/job/HBase-0.92-security/ws/trunk> && /home/jenkins/tools/java/jdk1.6.0_45-32/jre/bin/java -enableassertions -Xmx1400m -Djava.security.egd=file:/dev/./urandom -jar <https://builds.apache.org/job/HBase-0.92-security/ws/trunk/target/surefire/surefirebooter3063619042401257776.jar> <https://builds.apache.org/job/HBase-0.92-security/ws/trunk/target/surefire/surefire2045049108489359458tmp> <https://builds.apache.org/job/HBase-0.92-security/ws/trunk/target/surefire/surefire8344251590358992848tmp>
Running org.apache.hadoop.hbase.regionserver.TestWideScanner
Tests run: 1, Failures: 0, Errors: 0, Skipped: 0, Time elapsed: 1.934 sec
Forking command line: /bin/sh -c cd <https://builds.apache.org/job/HBase-0.92-security/ws/trunk> && /home/jenkins/tools/java/jdk1.6.0_45-32/jre/bin/java -enableassertions -Xmx1400m -Djava.security.egd=file:/dev/./urandom -jar <https://builds.apache.org/job/HBase-0.92-security/ws/trunk/target/surefire/surefirebooter4994196357904751688.jar> <https://builds.apache.org/job/HBase-0.92-security/ws/trunk/target/surefire/surefire4387153766618068825tmp> <https://builds.apache.org/job/HBase-0.92-security/ws/trunk/target/surefire/surefire339642654743280800tmp>
Running org.apache.hadoop.hbase.regionserver.TestColumnSeeking
Tests run: 2, Failures: 0, Errors: 0, Skipped: 0, Time elapsed: 4.419 sec
Forking command line: /bin/sh -c cd <https://builds.apache.org/job/HBase-0.92-security/ws/trunk> && /home/jenkins/tools/java/jdk1.6.0_45-32/jre/bin/java -enableassertions -Xmx1400m -Djava.security.egd=file:/dev/./urandom -jar <https://builds.apache.org/job/HBase-0.92-security/ws/trunk/target/surefire/surefirebooter2050603702586470841.jar> <https://builds.apache.org/job/HBase-0.92-security/ws/trunk/target/surefire/surefire5904810713651962526tmp> <https://builds.apache.org/job/HBase-0.92-security/ws/trunk/target/surefire/surefire5016371867048320035tmp>
Running org.apache.hadoop.hbase.regionserver.TestGetClosestAtOrBefore
Tests run: 3, Failures: 0, Errors: 0, Skipped: 0, Time elapsed: 1.247 sec
Forking command line: /bin/sh -c cd <https://builds.apache.org/job/HBase-0.92-security/ws/trunk> && /home/jenkins/tools/java/jdk1.6.0_45-32/jre/bin/java -enableassertions -Xmx1400m -Djava.security.egd=file:/dev/./urandom -jar <https://builds.apache.org/job/HBase-0.92-security/ws/trunk/target/surefire/surefirebooter2442546233231020854.jar> <https://builds.apache.org/job/HBase-0.92-security/ws/trunk/target/surefire/surefire6931276970698718203tmp> <https://builds.apache.org/job/HBase-0.92-security/ws/trunk/target/surefire/surefire1871378779743585212tmp>
Running org.apache.hadoop.hbase.regionserver.TestExplicitColumnTracker
Tests run: 4, Failures: 0, Errors: 0, Skipped: 0, Time elapsed: 0.88 sec
Forking command line: /bin/sh -c cd <https://builds.apache.org/job/HBase-0.92-security/ws/trunk> && /home/jenkins/tools/java/jdk1.6.0_45-32/jre/bin/java -enableassertions -Xmx1400m -Djava.security.egd=file:/dev/./urandom -jar <https://builds.apache.org/job/HBase-0.92-security/ws/trunk/target/surefire/surefirebooter7807813509715538542.jar> <https://builds.apache.org/job/HBase-0.92-security/ws/trunk/target/surefire/surefire4748045230105826803tmp> <https://builds.apache.org/job/HBase-0.92-security/ws/trunk/target/surefire/surefire2093630747909337335tmp>
Running org.apache.hadoop.hbase.regionserver.TestMemStoreLAB
Tests run: 3, Failures: 0, Errors: 0, Skipped: 0, Time elapsed: 1.426 sec
Forking command line: /bin/sh -c cd <https://builds.apache.org/job/HBase-0.92-security/ws/trunk> && /home/jenkins/tools/java/jdk1.6.0_45-32/jre/bin/java -enableassertions -Xmx1400m -Djava.security.egd=file:/dev/./urandom -jar <https://builds.apache.org/job/HBase-0.92-security/ws/trunk/target/surefire/surefirebooter1730118839359891334.jar> <https://builds.apache.org/job/HBase-0.92-security/ws/trunk/target/surefire/surefire2642201312680987006tmp> <https://builds.apache.org/job/HBase-0.92-security/ws/trunk/target/surefire/surefire241072837940054160tmp>
Running org.apache.hadoop.hbase.regionserver.TestKeyValueScanFixture
Tests run: 1, Failures: 0, Errors: 0, Skipped: 0, Time elapsed: 0.116 sec
Forking command line: /bin/sh -c cd <https://builds.apache.org/job/HBase-0.92-security/ws/trunk> && /home/jenkins/tools/java/jdk1.6.0_45-32/jre/bin/java -enableassertions -Xmx1400m -Djava.security.egd=file:/dev/./urandom -jar <https://builds.apache.org/job/HBase-0.92-security/ws/trunk/target/surefire/surefirebooter5136086584494195138.jar> <https://builds.apache.org/job/HBase-0.92-security/ws/trunk/target/surefire/surefire3462302410852654658tmp> <https://builds.apache.org/job/HBase-0.92-security/ws/trunk/target/surefire/surefire7142749628660539541tmp>
Running org.apache.hadoop.hbase.regionserver.TestCacheOnWriteInSchema
Tests run: 3, Failures: 0, Errors: 0, Skipped: 0, Time elapsed: 1.87 sec
Forking command line: /bin/sh -c cd <https://builds.apache.org/job/HBase-0.92-security/ws/trunk> && /home/jenkins/tools/java/jdk1.6.0_45-32/jre/bin/java -enableassertions -Xmx1400m -Djava.security.egd=file:/dev/./urandom -jar <https://builds.apache.org/job/HBase-0.92-security/ws/trunk/target/surefire/surefirebooter792962800538022025.jar> <https://builds.apache.org/job/HBase-0.92-security/ws/trunk/target/surefire/surefire363106208212219539tmp> <https://builds.apache.org/job/HBase-0.92-security/ws/trunk/target/surefire/surefire5420523824618301249tmp>
Running org.apache.hadoop.hbase.regionserver.wal.TestLogRollAbort
Tests run: 1, Failures: 0, Errors: 0, Skipped: 0, Time elapsed: 171.504 sec
Forking command line: /bin/sh -c cd <https://builds.apache.org/job/HBase-0.92-security/ws/trunk> && /home/jenkins/tools/java/jdk1.6.0_45-32/jre/bin/java -enableassertions -Xmx1400m -Djava.security.egd=file:/dev/./urandom -jar <https://builds.apache.org/job/HBase-0.92-security/ws/trunk/target/surefire/surefirebooter4884090257214981366.jar> <https://builds.apache.org/job/HBase-0.92-security/ws/trunk/target/surefire/surefire6996972777772644987tmp> <https://builds.apache.org/job/HBase-0.92-security/ws/trunk/target/surefire/surefire2125688256571842974tmp>
Running org.apache.hadoop.hbase.regionserver.wal.TestWALActionsListener
Tests run: 1, Failures: 0, Errors: 0, Skipped: 0, Time elapsed: 0.773 sec
Forking command line: /bin/sh -c cd <https://builds.apache.org/job/HBase-0.92-security/ws/trunk> && /home/jenkins/tools/java/jdk1.6.0_45-32/jre/bin/java -enableassertions -Xmx1400m -Djava.security.egd=file:/dev/./urandom -jar <https://builds.apache.org/job/HBase-0.92-security/ws/trunk/target/surefire/surefirebooter7654346307047481435.jar> <https://builds.apache.org/job/HBase-0.92-security/ws/trunk/target/surefire/surefire6656204424970681972tmp> <https://builds.apache.org/job/HBase-0.92-security/ws/trunk/target/surefire/surefire8697918051254290969tmp>
Running org.apache.hadoop.hbase.regionserver.wal.TestLogRolling
Tests run: 3, Failures: 0, Errors: 0, Skipped: 0, Time elapsed: 569.221 sec
Forking command line: /bin/sh -c cd <https://builds.apache.org/job/HBase-0.92-security/ws/trunk> && /home/jenkins/tools/java/jdk1.6.0_45-32/jre/bin/java -enableassertions -Xmx1400m -Djava.security.egd=file:/dev/./urandom -jar <https://builds.apache.org/job/HBase-0.92-security/ws/trunk/target/surefire/surefirebooter6866041484722920467.jar> <https://builds.apache.org/job/HBase-0.92-security/ws/trunk/target/surefire/surefire8711234571907851133tmp> <https://builds.apache.org/job/HBase-0.92-security/ws/trunk/target/surefire/surefire6785942485719589839tmp>
Running org.apache.hadoop.hbase.regionserver.wal.TestHLog
Tests run: 9, Failures: 0, Errors: 0, Skipped: 0, Time elapsed: 91.311 sec
Forking command line: /bin/sh -c cd <https://builds.apache.org/job/HBase-0.92-security/ws/trunk> && /home/jenkins/tools/java/jdk1.6.0_45-32/jre/bin/java -enableassertions -Xmx1400m -Djava.security.egd=file:/dev/./urandom -jar <https://builds.apache.org/job/HBase-0.92-security/ws/trunk/target/surefire/surefirebooter2659150211562529337.jar> <https://builds.apache.org/job/HBase-0.92-security/ws/trunk/target/surefire/surefire3022146688972729250tmp> <https://builds.apache.org/job/HBase-0.92-security/ws/trunk/target/surefire/surefire1101284248532891451tmp>
Running org.apache.hadoop.hbase.regionserver.wal.TestHLogSplit
Tests run: 30, Failures: 0, Errors: 0, Skipped: 1, Time elapsed: 325.245 sec
Forking command line: /bin/sh -c cd <https://builds.apache.org/job/HBase-0.92-security/ws/trunk> && /home/jenkins/tools/java/jdk1.6.0_45-32/jre/bin/java -enableassertions -Xmx1400m -Djava.security.egd=file:/dev/./urandom -jar <https://builds.apache.org/job/HBase-0.92-security/ws/trunk/target/surefire/surefirebooter4851654127918188903.jar> <https://builds.apache.org/job/HBase-0.92-security/ws/trunk/target/surefire/surefire8211721513478292489tmp> <https://builds.apache.org/job/HBase-0.92-security/ws/trunk/target/surefire/surefire7310662027975731827tmp>
Running org.apache.hadoop.hbase.regionserver.wal.TestWALReplay
Tests run: 5, Failures: 0, Errors: 0, Skipped: 0, Time elapsed: 70.426 sec
Forking command line: /bin/sh -c cd <https://builds.apache.org/job/HBase-0.92-security/ws/trunk> && /home/jenkins/tools/java/jdk1.6.0_45-32/jre/bin/java -enableassertions -Xmx1400m -Djava.security.egd=file:/dev/./urandom -jar <https://builds.apache.org/job/HBase-0.92-security/ws/trunk/target/surefire/surefirebooter5339314265553971654.jar> <https://builds.apache.org/job/HBase-0.92-security/ws/trunk/target/surefire/surefire4467512216977091442tmp> <https://builds.apache.org/job/HBase-0.92-security/ws/trunk/target/surefire/surefire3207099599136345023tmp>
Running org.apache.hadoop.hbase.regionserver.wal.TestHLogMethods
Tests run: 3, Failures: 0, Errors: 0, Skipped: 0, Time elapsed: 0.868 sec
Forking command line: /bin/sh -c cd <https://builds.apache.org/job/HBase-0.92-security/ws/trunk> && /home/jenkins/tools/java/jdk1.6.0_45-32/jre/bin/java -enableassertions -Xmx1400m -Djava.security.egd=file:/dev/./urandom -jar <https://builds.apache.org/job/HBase-0.92-security/ws/trunk/target/surefire/surefirebooter635521559096239358.jar> <https://builds.apache.org/job/HBase-0.92-security/ws/trunk/target/surefire/surefire8152476933296250730tmp> <https://builds.apache.org/job/HBase-0.92-security/ws/trunk/target/surefire/surefire4657976573317934947tmp>
Running org.apache.hadoop.hbase.regionserver.TestRSStatusServlet
Tests run: 2, Failures: 0, Errors: 0, Skipped: 0, Time elapsed: 0.753 sec
Forking command line: /bin/sh -c cd <https://builds.apache.org/job/HBase-0.92-security/ws/trunk> && /home/jenkins/tools/java/jdk1.6.0_45-32/jre/bin/java -enableassertions -Xmx1400m -Djava.security.egd=file:/dev/./urandom -jar <https://builds.apache.org/job/HBase-0.92-security/ws/trunk/target/surefire/surefirebooter3525715423543586829.jar> <https://builds.apache.org/job/HBase-0.92-security/ws/trunk/target/surefire/surefire4770057865078575181tmp> <https://builds.apache.org/job/HBase-0.92-security/ws/trunk/target/surefire/surefire5073263560282567835tmp>
Running org.apache.hadoop.hbase.regionserver.TestStoreScanner
Tests run: 14, Failures: 0, Errors: 0, Skipped: 0, Time elapsed: 0.145 sec
Forking command line: /bin/sh -c cd <https://builds.apache.org/job/HBase-0.92-security/ws/trunk> && /home/jenkins/tools/java/jdk1.6.0_45-32/jre/bin/java -enableassertions -Xmx1400m -Djava.security.egd=file:/dev/./urandom -jar <https://builds.apache.org/job/HBase-0.92-security/ws/trunk/target/surefire/surefirebooter7254154343950544005.jar> <https://builds.apache.org/job/HBase-0.92-security/ws/trunk/target/surefire/surefire5806091815336619893tmp> <https://builds.apache.org/job/HBase-0.92-security/ws/trunk/target/surefire/surefire5931108209807875622tmp>
Running org.apache.hadoop.hbase.regionserver.TestResettingCounters
Tests run: 1, Failures: 0, Errors: 0, Skipped: 0, Time elapsed: 0.791 sec
Forking command line: /bin/sh -c cd <https://builds.apache.org/job/HBase-0.92-security/ws/trunk> && /home/jenkins/tools/java/jdk1.6.0_45-32/jre/bin/java -enableassertions -Xmx1400m -Djava.security.egd=file:/dev/./urandom -jar <https://builds.apache.org/job/HBase-0.92-security/ws/trunk/target/surefire/surefirebooter7003889074880344281.jar> <https://builds.apache.org/job/HBase-0.92-security/ws/trunk/target/surefire/surefire5030525256986978128tmp> <https://builds.apache.org/job/HBase-0.92-security/ws/trunk/target/surefire/surefire2804687508902750214tmp>
Running org.apache.hadoop.hbase.regionserver.TestStoreFile
Tests run: 8, Failures: 0, Errors: 0, Skipped: 0, Time elapsed: 1.769 sec
Forking command line: /bin/sh -c cd <https://builds.apache.org/job/HBase-0.92-security/ws/trunk> && /home/jenkins/tools/java/jdk1.6.0_45-32/jre/bin/java -enableassertions -Xmx1400m -Djava.security.egd=file:/dev/./urandom -jar <https://builds.apache.org/job/HBase-0.92-security/ws/trunk/target/surefire/surefirebooter8619447545542335373.jar> <https://builds.apache.org/job/HBase-0.92-security/ws/trunk/target/surefire/surefire1667146703391094060tmp> <https://builds.apache.org/job/HBase-0.92-security/ws/trunk/target/surefire/surefire6358766361737625651tmp>
Running org.apache.hadoop.hbase.regionserver.TestEndToEndSplitTransaction
Tests run: 2, Failures: 0, Errors: 0, Skipped: 0, Time elapsed: 98.272 sec
Forking command line: /bin/sh -c cd <https://builds.apache.org/job/HBase-0.92-security/ws/trunk> && /home/jenkins/tools/java/jdk1.6.0_45-32/jre/bin/java -enableassertions -Xmx1400m -Djava.security.egd=file:/dev/./urandom -jar <https://builds.apache.org/job/HBase-0.92-security/ws/trunk/target/surefire/surefirebooter1063526877324941150.jar> <https://builds.apache.org/job/HBase-0.92-security/ws/trunk/target/surefire/surefire8518837158649901632tmp> <https://builds.apache.org/job/HBase-0.92-security/ws/trunk/target/surefire/surefire8263310304925162942tmp>
Running org.apache.hadoop.hbase.regionserver.TestScanWildcardColumnTracker
Tests run: 2, Failures: 0, Errors: 0, Skipped: 0, Time elapsed: 0.464 sec
Forking command line: /bin/sh -c cd <https://builds.apache.org/job/HBase-0.92-security/ws/trunk> && /home/jenkins/tools/java/jdk1.6.0_45-32/jre/bin/java -enableassertions -Xmx1400m -Djava.security.egd=file:/dev/./urandom -jar <https://builds.apache.org/job/HBase-0.92-security/ws/trunk/target/surefire/surefirebooter1852994136328298225.jar> <https://builds.apache.org/job/HBase-0.92-security/ws/trunk/target/surefire/surefire5967680498014795367tmp> <https://builds.apache.org/job/HBase-0.92-security/ws/trunk/target/surefire/surefire3701836672425873904tmp>
Running org.apache.hadoop.hbase.regionserver.TestCompaction
Tests run: 12, Failures: 0, Errors: 0, Skipped: 0, Time elapsed: 19.968 sec
Forking command line: /bin/sh -c cd <https://builds.apache.org/job/HBase-0.92-security/ws/trunk> && /home/jenkins/tools/java/jdk1.6.0_45-32/jre/bin/java -enableassertions -Xmx1400m -Djava.security.egd=file:/dev/./urandom -jar <https://builds.apache.org/job/HBase-0.92-security/ws/trunk/target/surefire/surefirebooter1050452580054286668.jar> <https://builds.apache.org/job/HBase-0.92-security/ws/trunk/target/surefire/surefire45229508511445814tmp> <https://builds.apache.org/job/HBase-0.92-security/ws/trunk/target/surefire/surefire8972385559282525096tmp>
Running org.apache.hadoop.hbase.regionserver.TestMXBean
Tests run: 1, Failures: 0, Errors: 0, Skipped: 0, Time elapsed: 35.531 sec
Forking command line: /bin/sh -c cd <https://builds.apache.org/job/HBase-0.92-security/ws/trunk> && /home/jenkins/tools/java/jdk1.6.0_45-32/jre/bin/java -enableassertions -Xmx1400m -Djava.security.egd=file:/dev/./urandom -jar <https://builds.apache.org/job/HBase-0.92-security/ws/trunk/target/surefire/surefirebooter1183329297029222745.jar> <https://builds.apache.org/job/HBase-0.92-security/ws/trunk/target/surefire/surefire1147574880790955116tmp> <https://builds.apache.org/job/HBase-0.92-security/ws/trunk/target/surefire/surefire1881185780469688278tmp>
Running org.apache.hadoop.hbase.regionserver.TestQueryMatcher
Tests run: 4, Failures: 0, Errors: 0, Skipped: 0, Time elapsed: 0.574 sec
Forking command line: /bin/sh -c cd <https://builds.apache.org/job/HBase-0.92-security/ws/trunk> && /home/jenkins/tools/java/jdk1.6.0_45-32/jre/bin/java -enableassertions -Xmx1400m -Djava.security.egd=file:/dev/./urandom -jar <https://builds.apache.org/job/HBase-0.92-security/ws/trunk/target/surefire/surefirebooter4373494880295173195.jar> <https://builds.apache.org/job/HBase-0.92-security/ws/trunk/target/surefire/surefire625952513329359316tmp> <https://builds.apache.org/job/HBase-0.92-security/ws/trunk/target/surefire/surefire8674024056258383547tmp>
Running org.apache.hadoop.hbase.regionserver.TestRpcMetrics
Tests run: 1, Failures: 0, Errors: 0, Skipped: 0, Time elapsed: 1.95 sec
Forking command line: /bin/sh -c cd <https://builds.apache.org/job/HBase-0.92-security/ws/trunk> && /home/jenkins/tools/java/jdk1.6.0_45-32/jre/bin/java -enableassertions -Xmx1400m -Djava.security.egd=file:/dev/./urandom -jar <https://builds.apache.org/job/HBase-0.92-security/ws/trunk/target/surefire/surefirebooter8348059775093640167.jar> <https://builds.apache.org/job/HBase-0.92-security/ws/trunk/target/surefire/surefire5093678343134016229tmp> <https://builds.apache.org/job/HBase-0.92-security/ws/trunk/target/surefire/surefire2848568196564091575tmp>
Running org.apache.hadoop.hbase.regionserver.TestScanner
Tests run: 7, Failures: 0, Errors: 0, Skipped: 0, Time elapsed: 5.147 sec
Forking command line: /bin/sh -c cd <https://builds.apache.org/job/HBase-0.92-security/ws/trunk> && /home/jenkins/tools/java/jdk1.6.0_45-32/jre/bin/java -enableassertions -Xmx1400m -Djava.security.egd=file:/dev/./urandom -jar <https://builds.apache.org/job/HBase-0.92-security/ws/trunk/target/surefire/surefirebooter6969265734986537901.jar> <https://builds.apache.org/job/HBase-0.92-security/ws/trunk/target/surefire/surefire3987303470556192924tmp> <https://builds.apache.org/job/HBase-0.92-security/ws/trunk/target/surefire/surefire1789291720618713510tmp>
Running org.apache.hadoop.hbase.regionserver.TestMultiColumnScanner
Tests run: 6, Failures: 0, Errors: 0, Skipped: 0, Time elapsed: 19.544 sec
Forking command line: /bin/sh -c cd <https://builds.apache.org/job/HBase-0.92-security/ws/trunk> && /home/jenkins/tools/java/jdk1.6.0_45-32/jre/bin/java -enableassertions -Xmx1400m -Djava.security.egd=file:/dev/./urandom -jar <https://builds.apache.org/job/HBase-0.92-security/ws/trunk/target/surefire/surefirebooter739512646504811837.jar> <https://builds.apache.org/job/HBase-0.92-security/ws/trunk/target/surefire/surefire8290737645908150068tmp> <https://builds.apache.org/job/HBase-0.92-security/ws/trunk/target/surefire/surefire2300570215113611560tmp>
Running org.apache.hadoop.hbase.regionserver.TestRegionSplitPolicy
Tests run: 3, Failures: 0, Errors: 0, Skipped: 0, Time elapsed: 0.716 sec
Forking command line: /bin/sh -c cd <https://builds.apache.org/job/HBase-0.92-security/ws/trunk> && /home/jenkins/tools/java/jdk1.6.0_45-32/jre/bin/java -enableassertions -Xmx1400m -Djava.security.egd=file:/dev/./urandom -jar <https://builds.apache.org/job/HBase-0.92-security/ws/trunk/target/surefire/surefirebooter2484138679853984274.jar> <https://builds.apache.org/job/HBase-0.92-security/ws/trunk/target/surefire/surefire3770240379948237668tmp> <https://builds.apache.org/job/HBase-0.92-security/ws/trunk/target/surefire/surefire5428493170911977022tmp>
Running org.apache.hadoop.hbase.regionserver.TestKeyValueSkipListSet
Tests run: 4, Failures: 0, Errors: 0, Skipped: 0, Time elapsed: 0.121 sec
Forking command line: /bin/sh -c cd <https://builds.apache.org/job/HBase-0.92-security/ws/trunk> && /home/jenkins/tools/java/jdk1.6.0_45-32/jre/bin/java -enableassertions -Xmx1400m -Djava.security.egd=file:/dev/./urandom -jar <https://builds.apache.org/job/HBase-0.92-security/ws/trunk/target/surefire/surefirebooter1261366553312166577.jar> <https://builds.apache.org/job/HBase-0.92-security/ws/trunk/target/surefire/surefire9019599119017755042tmp> <https://builds.apache.org/job/HBase-0.92-security/ws/trunk/target/surefire/surefire879058973545470800tmp>
Running org.apache.hadoop.hbase.mapred.TestTableMapReduce
Tests run: 1, Failures: 0, Errors: 0, Skipped: 0, Time elapsed: 115.1 sec
Forking command line: /bin/sh -c cd <https://builds.apache.org/job/HBase-0.92-security/ws/trunk> && /home/jenkins/tools/java/jdk1.6.0_45-32/jre/bin/java -enableassertions -Xmx1400m -Djava.security.egd=file:/dev/./urandom -jar <https://builds.apache.org/job/HBase-0.92-security/ws/trunk/target/surefire/surefirebooter5047080694329515082.jar> <https://builds.apache.org/job/HBase-0.92-security/ws/trunk/target/surefire/surefire1272476680858855296tmp> <https://builds.apache.org/job/HBase-0.92-security/ws/trunk/target/surefire/surefire1561342295683268648tmp>
Running org.apache.hadoop.hbase.mapred.TestTableInputFormat
Tests run: 10, Failures: 0, Errors: 0, Skipped: 0, Time elapsed: 99.362 sec
Forking command line: /bin/sh -c cd <https://builds.apache.org/job/HBase-0.92-security/ws/trunk> && /home/jenkins/tools/java/jdk1.6.0_45-32/jre/bin/java -enableassertions -Xmx1400m -Djava.security.egd=file:/dev/./urandom -jar <https://builds.apache.org/job/HBase-0.92-security/ws/trunk/target/surefire/surefirebooter7223577179323915620.jar> <https://builds.apache.org/job/HBase-0.92-security/ws/trunk/target/surefire/surefire4777590295572502107tmp> <https://builds.apache.org/job/HBase-0.92-security/ws/trunk/target/surefire/surefire8355325958329908708tmp>
Running org.apache.hadoop.hbase.TestClusterBootOrder
Tests run: 2, Failures: 0, Errors: 0, Skipped: 0, Time elapsed: 62.754 sec
Forking command line: /bin/sh -c cd <https://builds.apache.org/job/HBase-0.92-security/ws/trunk> && /home/jenkins/tools/java/jdk1.6.0_45-32/jre/bin/java -enableassertions -Xmx1400m -Djava.security.egd=file:/dev/./urandom -jar <https://builds.apache.org/job/HBase-0.92-security/ws/trunk/target/surefire/surefirebooter8761322583079255291.jar> <https://builds.apache.org/job/HBase-0.92-security/ws/trunk/target/surefire/surefire1292875163766788207tmp> <https://builds.apache.org/job/HBase-0.92-security/ws/trunk/target/surefire/surefire3369473694128328019tmp>
Running org.apache.hadoop.hbase.TestDrainingServer
Tests run: 2, Failures: 0, Errors: 0, Skipped: 0, Time elapsed: 62.346 sec
Forking command line: /bin/sh -c cd <https://builds.apache.org/job/HBase-0.92-security/ws/trunk> && /home/jenkins/tools/java/jdk1.6.0_45-32/jre/bin/java -enableassertions -Xmx1400m -Djava.security.egd=file:/dev/./urandom -jar <https://builds.apache.org/job/HBase-0.92-security/ws/trunk/target/surefire/surefirebooter8489583015449353683.jar> <https://builds.apache.org/job/HBase-0.92-security/ws/trunk/target/surefire/surefire4916513765278173415tmp> <https://builds.apache.org/job/HBase-0.92-security/ws/trunk/target/surefire/surefire8503048449862271897tmp>
Running org.apache.hadoop.hbase.TestFSTableDescriptorForceCreation
Tests run: 3, Failures: 0, Errors: 0, Skipped: 0, Time elapsed: 0.566 sec
Forking command line: /bin/sh -c cd <https://builds.apache.org/job/HBase-0.92-security/ws/trunk> && /home/jenkins/tools/java/jdk1.6.0_45-32/jre/bin/java -enableassertions -Xmx1400m -Djava.security.egd=file:/dev/./urandom -jar <https://builds.apache.org/job/HBase-0.92-security/ws/trunk/target/surefire/surefirebooter8922028768514129285.jar> <https://builds.apache.org/job/HBase-0.92-security/ws/trunk/target/surefire/surefire312146093939793258tmp> <https://builds.apache.org/job/HBase-0.92-security/ws/trunk/target/surefire/surefire7020091755415713991tmp>
Running org.apache.hadoop.hbase.executor.TestExecutorService
Tests run: 1, Failures: 0, Errors: 0, Skipped: 0, Time elapsed: 2.503 sec
Forking command line: /bin/sh -c cd <https://builds.apache.org/job/HBase-0.92-security/ws/trunk> && /home/jenkins/tools/java/jdk1.6.0_45-32/jre/bin/java -enableassertions -Xmx1400m -Djava.security.egd=file:/dev/./urandom -jar <https://builds.apache.org/job/HBase-0.92-security/ws/trunk/target/surefire/surefirebooter1596610159002294017.jar> <https://builds.apache.org/job/HBase-0.92-security/ws/trunk/target/surefire/surefire2422156216183536648tmp> <https://builds.apache.org/job/HBase-0.92-security/ws/trunk/target/surefire/surefire8724330898070653911tmp>
Running org.apache.hadoop.hbase.mapreduce.TestTimeRangeMapRed
Tests run: 1, Failures: 0, Errors: 0, Skipped: 0, Time elapsed: 59.965 sec
Forking command line: /bin/sh -c cd <https://builds.apache.org/job/HBase-0.92-security/ws/trunk> && /home/jenkins/tools/java/jdk1.6.0_45-32/jre/bin/java -enableassertions -Xmx1400m -Djava.security.egd=file:/dev/./urandom -jar <https://builds.apache.org/job/HBase-0.92-security/ws/trunk/target/surefire/surefirebooter1736540887925004292.jar> <https://builds.apache.org/job/HBase-0.92-security/ws/trunk/target/surefire/surefire7012036697846133693tmp> <https://builds.apache.org/job/HBase-0.92-security/ws/trunk/target/surefire/surefire7772938612692367856tmp>
Running org.apache.hadoop.hbase.mapreduce.TestHFileOutputFormat
Tests run: 8, Failures: 0, Errors: 0, Skipped: 0, Time elapsed: 313.328 sec
Forking command line: /bin/sh -c cd <https://builds.apache.org/job/HBase-0.92-security/ws/trunk> && /home/jenkins/tools/java/jdk1.6.0_45-32/jre/bin/java -enableassertions -Xmx1400m -Djava.security.egd=file:/dev/./urandom -jar <https://builds.apache.org/job/HBase-0.92-security/ws/trunk/target/surefire/surefirebooter489086097843867742.jar> <https://builds.apache.org/job/HBase-0.92-security/ws/trunk/target/surefire/surefire4298828911680522488tmp> <https://builds.apache.org/job/HBase-0.92-security/ws/trunk/target/surefire/surefire1020219565503102973tmp>
Running org.apache.hadoop.hbase.mapreduce.TestImportTsv
Tests run: 8, Failures: 0, Errors: 0, Skipped: 0, Time elapsed: 118.994 sec
Forking command line: /bin/sh -c cd <https://builds.apache.org/job/HBase-0.92-security/ws/trunk> && /home/jenkins/tools/java/jdk1.6.0_45-32/jre/bin/java -enableassertions -Xmx1400m -Djava.security.egd=file:/dev/./urandom -jar <https://builds.apache.org/job/HBase-0.92-security/ws/trunk/target/surefire/surefirebooter3816189857830384523.jar> <https://builds.apache.org/job/HBase-0.92-security/ws/trunk/target/surefire/surefire3357987420246438257tmp> <https://builds.apache.org/job/HBase-0.92-security/ws/trunk/target/surefire/surefire5459708784033555513tmp>
Running org.apache.hadoop.hbase.mapreduce.TestTableInputFormatScan
Tests run: 1, Failures: 0, Errors: 1, Skipped: 0, Time elapsed: 43.685 sec <<< FAILURE!
Forking command line: /bin/sh -c cd <https://builds.apache.org/job/HBase-0.92-security/ws/trunk> && /home/jenkins/tools/java/jdk1.6.0_45-32/jre/bin/java -enableassertions -Xmx1400m -Djava.security.egd=file:/dev/./urandom -jar <https://builds.apache.org/job/HBase-0.92-security/ws/trunk/target/surefire/surefirebooter2066530176650976308.jar> <https://builds.apache.org/job/HBase-0.92-security/ws/trunk/target/surefire/surefire4351435922287783825tmp> <https://builds.apache.org/job/HBase-0.92-security/ws/trunk/target/surefire/surefire2766332329436266411tmp>
Running org.apache.hadoop.hbase.mapreduce.TestLoadIncrementalHFilesSplitRecovery
Tests run: 4, Failures: 0, Errors: 0, Skipped: 0, Time elapsed: 99.944 sec
Forking command line: /bin/sh -c cd <https://builds.apache.org/job/HBase-0.92-security/ws/trunk> && /home/jenkins/tools/java/jdk1.6.0_45-32/jre/bin/java -enableassertions -Xmx1400m -Djava.security.egd=file:/dev/./urandom -jar <https://builds.apache.org/job/HBase-0.92-security/ws/trunk/target/surefire/surefirebooter7201317593142695378.jar> <https://builds.apache.org/job/HBase-0.92-security/ws/trunk/target/surefire/surefire7520768818750954569tmp> <https://builds.apache.org/job/HBase-0.92-security/ws/trunk/target/surefire/surefire1062832929224437239tmp>
Running org.apache.hadoop.hbase.mapreduce.TestTableSplit
Tests run: 1, Failures: 0, Errors: 0, Skipped: 0, Time elapsed: 0.138 sec
Forking command line: /bin/sh -c cd <https://builds.apache.org/job/HBase-0.92-security/ws/trunk> && /home/jenkins/tools/java/jdk1.6.0_45-32/jre/bin/java -enableassertions -Xmx1400m -Djava.security.egd=file:/dev/./urandom -jar <https://builds.apache.org/job/HBase-0.92-security/ws/trunk/target/surefire/surefirebooter3382106399112329809.jar> <https://builds.apache.org/job/HBase-0.92-security/ws/trunk/target/surefire/surefire5706938950481260347tmp> <https://builds.apache.org/job/HBase-0.92-security/ws/trunk/target/surefire/surefire7468430343624216833tmp>
Running org.apache.hadoop.hbase.mapreduce.TestSimpleTotalOrderPartitioner
Tests run: 1, Failures: 0, Errors: 0, Skipped: 0, Time elapsed: 0.428 sec
Forking command line: /bin/sh -c cd <https://builds.apache.org/job/HBase-0.92-security/ws/trunk> && /home/jenkins/tools/java/jdk1.6.0_45-32/jre/bin/java -enableassertions -Xmx1400m -Djava.security.egd=file:/dev/./urandom -jar <https://builds.apache.org/job/HBase-0.92-security/ws/trunk/target/surefire/surefirebooter2219833876459760147.jar> <https://builds.apache.org/job/HBase-0.92-security/ws/trunk/target/surefire/surefire61431487328290687tmp> <https://builds.apache.org/job/HBase-0.92-security/ws/trunk/target/surefire/surefire852074364528403421tmp>
Running org.apache.hadoop.hbase.mapreduce.TestTableMapReduce
Tests run: 1, Failures: 0, Errors: 0, Skipped: 0, Time elapsed: 143.912 sec
Forking command line: /bin/sh -c cd <https://builds.apache.org/job/HBase-0.92-security/ws/trunk> && /home/jenkins/tools/java/jdk1.6.0_45-32/jre/bin/java -enableassertions -Xmx1400m -Djava.security.egd=file:/dev/./urandom -jar <https://builds.apache.org/job/HBase-0.92-security/ws/trunk/target/surefire/surefirebooter4543187393400137333.jar> <https://builds.apache.org/job/HBase-0.92-security/ws/trunk/target/surefire/surefire283007647736169564tmp> <https://builds.apache.org/job/HBase-0.92-security/ws/trunk/target/surefire/surefire439715632442932959tmp>
Running org.apache.hadoop.hbase.mapreduce.TestLoadIncrementalHFiles
Tests run: 6, Failures: 0, Errors: 0, Skipped: 0, Time elapsed: 61.279 sec
Forking command line: /bin/sh -c cd <https://builds.apache.org/job/HBase-0.92-security/ws/trunk> && /home/jenkins/tools/java/jdk1.6.0_45-32/jre/bin/java -enableassertions -Xmx1400m -Djava.security.egd=file:/dev/./urandom -jar <https://builds.apache.org/job/HBase-0.92-security/ws/trunk/target/surefire/surefirebooter2598264660605059143.jar> <https://builds.apache.org/job/HBase-0.92-security/ws/trunk/target/surefire/surefire4725308523577173618tmp> <https://builds.apache.org/job/HBase-0.92-security/ws/trunk/target/surefire/surefire8005148494728390414tmp>
Running org.apache.hadoop.hbase.TestHRegionLocation
Tests run: 3, Failures: 0, Errors: 0, Skipped: 0, Time elapsed: 0.153 sec

Results :

Failed tests:   testOrphanTaskAcquisition(org.apache.hadoop.hbase.master.TestSplitLogManager)
  testUnassignedTimeout(org.apache.hadoop.hbase.master.TestSplitLogManager)

Tests in error: 
  testWorkerAbort(org.apache.hadoop.hbase.master.TestDistributedLogSplitting): test timed out after 300000 milliseconds
  org.apache.hadoop.hbase.mapreduce.TestTableInputFormatScan: org.apache.hadoop.hbase.PleaseHoldException: Master is initializing

Tests run: 1180, Failures: 2, Errors: 1, Skipped: 9

[INFO] ------------------------------------------------------------------------
[INFO] BUILD FAILURE
[INFO] ------------------------------------------------------------------------
[INFO] Total time: 2:40:00.460s
[INFO] Finished at: Sun Jan 05 02:40:48 UTC 2014
[INFO] Final Memory: 38M/446M
[INFO] ------------------------------------------------------------------------
[ERROR] Failed to execute goal org.apache.maven.plugins:maven-surefire-plugin:2.10:test (default-test) on project hbase: Failure or timeout -> [Help 1]
org.apache.maven.lifecycle.LifecycleExecutionException: Failed to execute goal org.apache.maven.plugins:maven-surefire-plugin:2.10:test (default-test) on project hbase: Failure or timeout
	at org.apache.maven.lifecycle.internal.MojoExecutor.execute(MojoExecutor.java:217)
	at org.apache.maven.lifecycle.internal.MojoExecutor.execute(MojoExecutor.java:153)
	at org.apache.maven.lifecycle.internal.MojoExecutor.execute(MojoExecutor.java:145)
	at org.apache.maven.lifecycle.internal.LifecycleModuleBuilder.buildProject(LifecycleModuleBuilder.java:84)
	at org.apache.maven.lifecycle.internal.LifecycleModuleBuilder.buildProject(LifecycleModuleBuilder.java:59)
	at org.apache.maven.lifecycle.internal.LifecycleStarter.singleThreadedBuild(LifecycleStarter.java:183)
	at org.apache.maven.lifecycle.internal.LifecycleStarter.execute(LifecycleStarter.java:161)
	at org.apache.maven.DefaultMaven.doExecute(DefaultMaven.java:320)
	at org.apache.maven.DefaultMaven.execute(DefaultMaven.java:156)
	at org.apache.maven.cli.MavenCli.execute(MavenCli.java:537)
	at org.apache.maven.cli.MavenCli.doMain(MavenCli.java:196)
	at org.apache.maven.cli.MavenCli.main(MavenCli.java:141)
	at sun.reflect.NativeMethodAccessorImpl.invoke0(Native Method)
	at sun.reflect.NativeMethodAccessorImpl.invoke(NativeMethodAccessorImpl.java:39)
	at sun.reflect.DelegatingMethodAccessorImpl.invoke(DelegatingMethodAccessorImpl.java:25)
	at java.lang.reflect.Method.invoke(Method.java:597)
	at org.codehaus.plexus.classworlds.launcher.Launcher.launchEnhanced(Launcher.java:290)
	at org.codehaus.plexus.classworlds.launcher.Launcher.launch(Launcher.java:230)
	at org.codehaus.plexus.classworlds.launcher.Launcher.mainWithExitCode(Launcher.java:409)
	at org.codehaus.plexus.classworlds.launcher.Launcher.main(Launcher.java:352)
Caused by: org.apache.maven.plugin.MojoExecutionException: Failure or timeout
	at org.apache.maven.plugin.surefire.SurefirePlugin.assertNoFailureOrTimeout(SurefirePlugin.java:633)
	at org.apache.maven.plugin.surefire.SurefirePlugin.handleSummary(SurefirePlugin.java:614)
	at org.apache.maven.plugin.surefire.AbstractSurefireMojo.executeAfterPreconditionsChecked(AbstractSurefireMojo.java:137)
	at org.apache.maven.plugin.surefire.AbstractSurefireMojo.execute(AbstractSurefireMojo.java:98)
	at org.apache.maven.plugin.DefaultBuildPluginManager.executeMojo(DefaultBuildPluginManager.java:101)
	at org.apache.maven.lifecycle.internal.MojoExecutor.execute(MojoExecutor.java:209)
	... 19 more
[ERROR] 
[ERROR] 
[ERROR] For more information about the errors and possible solutions, please read the following articles:
[ERROR] [Help 1] http://cwiki.apache.org/confluence/display/MAVEN/MojoExecutionException
Build step 'Invoke top-level Maven targets' marked build as failure
Archiving artifacts
Recording test results

Mime
View raw message