hbase-builds mailing list archives

Site index · List index
Message view « Date » · « Thread »
Top « Date » · « Thread »
From Apache Jenkins Server <jenk...@builds.apache.org>
Subject Build failed in Jenkins: HBase-TRUNK-on-Hadoop-1.1 #102
Date Sat, 01 Mar 2014 01:10:52 GMT
See <https://builds.apache.org/job/HBase-TRUNK-on-Hadoop-1.1/102/changes>

Changes:

[tedyu] HBASE-10627 A logic mistake in HRegionServer isHealthy (Shaohui)

[tedyu] HBASE-10638 Improve error message when there is no region server available for move

[mbertozzi] HBASE-10631 Avoid extra seek on FileLink open

------------------------------------------
[...truncated 4625 lines...]
Running org.apache.hadoop.hbase.rest.TestTableResource
Tests run: 8, Failures: 0, Errors: 0, Skipped: 0, Time elapsed: 34.652 sec
Running org.apache.hadoop.hbase.rest.client.TestRemoteTable
Tests run: 9, Failures: 0, Errors: 0, Skipped: 0, Time elapsed: 52.336 sec
Running org.apache.hadoop.hbase.rest.TestMultiRowResource
Tests run: 3, Failures: 0, Errors: 0, Skipped: 0, Time elapsed: 20.283 sec
Running org.apache.hadoop.hbase.rest.TestGzipFilter
Tests run: 2, Failures: 0, Errors: 0, Skipped: 0, Time elapsed: 21.46 sec
Running org.apache.hadoop.hbase.rest.TestGetAndPutResource
Tests run: 18, Failures: 0, Errors: 0, Skipped: 0, Time elapsed: 72.967 sec
Running org.apache.hadoop.hbase.rest.TestResourceFilter
Tests run: 1, Failures: 0, Errors: 0, Skipped: 0, Time elapsed: 17.695 sec
Running org.apache.hadoop.hbase.rest.TestDeleteRow
Tests run: 2, Failures: 0, Errors: 0, Skipped: 0, Time elapsed: 24.413 sec
Running org.apache.hadoop.hbase.rest.TestTableScan
Tests run: 6, Failures: 0, Errors: 0, Skipped: 0, Time elapsed: 38.155 sec
Running org.apache.hadoop.hbase.rest.TestVersionResource
Tests run: 7, Failures: 0, Errors: 0, Skipped: 0, Time elapsed: 16.372 sec
Running org.apache.hadoop.hbase.rest.TestScannerResource
Tests run: 5, Failures: 0, Errors: 0, Skipped: 0, Time elapsed: 34.276 sec
Running org.apache.hadoop.hbase.rest.TestStatusResource
Tests run: 2, Failures: 0, Errors: 0, Skipped: 0, Time elapsed: 17.801 sec
Running org.apache.hadoop.hbase.rest.TestScannersWithLabels
Tests run: 2, Failures: 0, Errors: 0, Skipped: 0, Time elapsed: 21.861 sec
Running org.apache.hadoop.hbase.rest.TestScannersWithFilters
Tests run: 10, Failures: 0, Errors: 0, Skipped: 0, Time elapsed: 23.893 sec
Running org.apache.hadoop.hbase.trace.TestHTraceHooks
Tests run: 1, Failures: 0, Errors: 0, Skipped: 0, Time elapsed: 18.424 sec
Running org.apache.hadoop.hbase.io.hfile.TestHFileSeek
Tests run: 1, Failures: 0, Errors: 0, Skipped: 0, Time elapsed: 3.837 sec
Running org.apache.hadoop.hbase.io.hfile.TestHFileBlockIndex
Tests run: 10, Failures: 0, Errors: 0, Skipped: 0, Time elapsed: 10.194 sec
Running org.apache.hadoop.hbase.io.hfile.TestForceCacheImportantBlocks
Tests run: 2, Failures: 0, Errors: 0, Skipped: 0, Time elapsed: 30.751 sec
Running org.apache.hadoop.hbase.io.hfile.TestCacheOnWrite
Tests run: 36, Failures: 0, Errors: 0, Skipped: 0, Time elapsed: 81.097 sec
Running org.apache.hadoop.hbase.io.hfile.TestScannerSelectionUsingTTL
Tests run: 6, Failures: 0, Errors: 0, Skipped: 0, Time elapsed: 62.922 sec
Running org.apache.hadoop.hbase.io.hfile.slab.TestSlabCache
Tests run: 7, Failures: 0, Errors: 0, Skipped: 0, Time elapsed: 18.208 sec
Running org.apache.hadoop.hbase.io.hfile.slab.TestSingleSizeCache
Tests run: 5, Failures: 0, Errors: 0, Skipped: 0, Time elapsed: 25.634 sec
Running org.apache.hadoop.hbase.io.TestFileLink
Tests run: 3, Failures: 0, Errors: 0, Skipped: 0, Time elapsed: 23.205 sec
Running org.apache.hadoop.hbase.io.hfile.TestHFileBlock
Tests run: 28, Failures: 0, Errors: 0, Skipped: 0, Time elapsed: 99.772 sec
Running org.apache.hadoop.hbase.io.encoding.TestChangingEncoding
Tests run: 3, Failures: 0, Errors: 0, Skipped: 0, Time elapsed: 120.532 sec
Running org.apache.hadoop.hbase.io.encoding.TestEncodedSeekers
Tests run: 40, Failures: 0, Errors: 0, Skipped: 0, Time elapsed: 181.023 sec
Running org.apache.hadoop.hbase.io.encoding.TestBufferedDataBlockEncoder
Tests run: 1, Failures: 0, Errors: 0, Skipped: 0, Time elapsed: 19.614 sec
Running org.apache.hadoop.hbase.io.encoding.TestLoadAndSwitchEncodeOnDisk
Tests run: 1, Failures: 0, Errors: 0, Skipped: 0, Time elapsed: 30.293 sec
Running org.apache.hadoop.hbase.TestRegionRebalancing
Tests run: 2, Failures: 0, Errors: 0, Skipped: 0, Time elapsed: 53.072 sec
Running org.apache.hadoop.hbase.io.encoding.TestDataBlockEncoders
Tests run: 24, Failures: 0, Errors: 0, Skipped: 0, Time elapsed: 194.877 sec
Running org.apache.hadoop.hbase.mapred.TestTableInputFormat
Tests run: 10, Failures: 0, Errors: 0, Skipped: 0, Time elapsed: 40.715 sec
Running org.apache.hadoop.hbase.mapred.TestTableMapReduceUtil
Tests run: 4, Failures: 0, Errors: 0, Skipped: 0, Time elapsed: 149.325 sec
Running org.apache.hadoop.hbase.replication.TestReplicationTrackerZKImpl
Tests run: 4, Failures: 0, Errors: 0, Skipped: 2, Time elapsed: 1.49 sec
Running org.apache.hadoop.hbase.replication.TestReplicationDisableInactivePeer
Tests run: 1, Failures: 0, Errors: 0, Skipped: 0, Time elapsed: 66.236 sec
Running org.apache.hadoop.hbase.mapred.TestTableMapReduce
Tests run: 2, Failures: 0, Errors: 0, Skipped: 0, Time elapsed: 180.384 sec
Running org.apache.hadoop.hbase.replication.TestReplicationKillMasterRSCompressed
Tests run: 1, Failures: 0, Errors: 0, Skipped: 0, Time elapsed: 68.063 sec
Running org.apache.hadoop.hbase.replication.TestPerTableCFReplication
Tests run: 2, Failures: 0, Errors: 0, Skipped: 0, Time elapsed: 79.835 sec
Running org.apache.hadoop.hbase.replication.regionserver.TestReplicationSink
Tests run: 5, Failures: 0, Errors: 0, Skipped: 0, Time elapsed: 19.989 sec
Running org.apache.hadoop.hbase.replication.regionserver.TestReplicationSourceManager
Tests run: 3, Failures: 0, Errors: 0, Skipped: 0, Time elapsed: 2.97 sec
Running org.apache.hadoop.hbase.replication.TestReplicationSource
Tests run: 1, Failures: 0, Errors: 0, Skipped: 0, Time elapsed: 5.523 sec
Running org.apache.hadoop.hbase.replication.TestReplicationChangingPeerRegionservers
Tests run: 1, Failures: 0, Errors: 0, Skipped: 0, Time elapsed: 43.224 sec
Running org.apache.hadoop.hbase.replication.regionserver.TestReplicationHLogReaderManager
Tests run: 8, Failures: 0, Errors: 0, Skipped: 0, Time elapsed: 232.774 sec
Running org.apache.hadoop.hbase.replication.TestReplicationSyncUpTool
Tests run: 1, Failures: 0, Errors: 0, Skipped: 0, Time elapsed: 115.935 sec
Running org.apache.hadoop.hbase.replication.TestReplicationKillMasterRS
Tests run: 1, Failures: 0, Errors: 0, Skipped: 0, Time elapsed: 80.168 sec
Running org.apache.hadoop.hbase.replication.TestMultiSlaveReplication
Tests run: 1, Failures: 0, Errors: 0, Skipped: 0, Time elapsed: 56.339 sec
Running org.apache.hadoop.hbase.replication.TestReplicationWithTags
Tests run: 1, Failures: 0, Errors: 0, Skipped: 0, Time elapsed: 43.442 sec
Running org.apache.hadoop.hbase.replication.TestReplicationStateZKImpl
Tests run: 6, Failures: 0, Errors: 0, Skipped: 0, Time elapsed: 5.663 sec
Running org.apache.hadoop.hbase.replication.TestReplicationKillSlaveRS
Tests run: 1, Failures: 0, Errors: 0, Skipped: 0, Time elapsed: 65.754 sec
Running org.apache.hadoop.hbase.replication.TestReplicationSmallTests
Tests run: 9, Failures: 0, Errors: 0, Skipped: 0, Time elapsed: 95.738 sec
Running org.apache.hadoop.hbase.util.TestMergeTool
Tests run: 1, Failures: 0, Errors: 0, Skipped: 0, Time elapsed: 46.452 sec
Running org.apache.hadoop.hbase.util.TestFSTableDescriptors
Tests run: 12, Failures: 0, Errors: 0, Skipped: 0, Time elapsed: 1.53 sec
Running org.apache.hadoop.hbase.replication.TestMasterReplication
Tests run: 3, Failures: 0, Errors: 0, Skipped: 0, Time elapsed: 136.052 sec
Running org.apache.hadoop.hbase.util.TestHBaseFsckEncryption
Tests run: 1, Failures: 0, Errors: 0, Skipped: 0, Time elapsed: 19.285 sec
Running org.apache.hadoop.hbase.util.TestIdLock
Tests run: 1, Failures: 0, Errors: 0, Skipped: 0, Time elapsed: 15.395 sec
Running org.apache.hadoop.hbase.util.TestMergeTable
Tests run: 1, Failures: 0, Errors: 0, Skipped: 0, Time elapsed: 36.389 sec
Running org.apache.hadoop.hbase.util.TestMiniClusterLoadSequential
Tests run: 4, Failures: 0, Errors: 0, Skipped: 0, Time elapsed: 86.372 sec
Running org.apache.hadoop.hbase.util.TestMiniClusterLoadParallel
Tests run: 4, Failures: 0, Errors: 0, Skipped: 0, Time elapsed: 81.29 sec
Running org.apache.hadoop.hbase.util.TestFSUtils
Tests run: 7, Failures: 0, Errors: 0, Skipped: 0, Time elapsed: 48.069 sec
Running org.apache.hadoop.hbase.util.TestRegionSplitter
Tests run: 5, Failures: 0, Errors: 0, Skipped: 0, Time elapsed: 24.693 sec
Running org.apache.hadoop.hbase.util.TestProcessBasedCluster
Tests run: 1, Failures: 0, Errors: 0, Skipped: 0, Time elapsed: 0.603 sec
Running org.apache.hadoop.hbase.util.TestMiniClusterLoadEncoded
Tests run: 5, Failures: 0, Errors: 0, Skipped: 0, Time elapsed: 95.468 sec
Running org.apache.hadoop.hbase.util.TestCoprocessorScanPolicy
Tests run: 4, Failures: 0, Errors: 0, Skipped: 0, Time elapsed: 31.332 sec
Running org.apache.hadoop.hbase.util.TestFSVisitor
Tests run: 3, Failures: 0, Errors: 0, Skipped: 0, Time elapsed: 1.956 sec
Running org.apache.hadoop.hbase.util.hbck.TestOfflineMetaRebuildBase
Tests run: 1, Failures: 0, Errors: 0, Skipped: 0, Time elapsed: 30.283 sec
Running org.apache.hadoop.hbase.util.hbck.TestOfflineMetaRebuildOverlap
Tests run: 1, Failures: 0, Errors: 0, Skipped: 0, Time elapsed: 30.529 sec
Running org.apache.hadoop.hbase.util.hbck.TestOfflineMetaRebuildHole
Tests run: 1, Failures: 0, Errors: 0, Skipped: 0, Time elapsed: 33.469 sec
Running org.apache.hadoop.hbase.util.TestDefaultEnvironmentEdge
Tests run: 1, Failures: 0, Errors: 0, Skipped: 0, Time elapsed: 0.353 sec
Running org.apache.hadoop.hbase.util.TestFSHDFSUtils
Tests run: 2, Failures: 0, Errors: 0, Skipped: 0, Time elapsed: 4.075 sec
Running org.apache.hadoop.hbase.util.TestHBaseFsck
Tests run: 40, Failures: 8, Errors: 0, Skipped: 1, Time elapsed: 361.098 sec <<<
FAILURE!
Running org.apache.hadoop.hbase.migration.TestUpgradeTo96
Tests run: 5, Failures: 0, Errors: 0, Skipped: 0, Time elapsed: 34.379 sec
Running org.apache.hadoop.hbase.TestNamespace
Tests run: 9, Failures: 0, Errors: 0, Skipped: 1, Time elapsed: 30.271 sec
Running org.apache.hadoop.hbase.migration.TestNamespaceUpgrade
Tests run: 5, Failures: 0, Errors: 0, Skipped: 0, Time elapsed: 95.352 sec
Running org.apache.hadoop.hbase.TestInfoServers
Tests run: 3, Failures: 0, Errors: 0, Skipped: 0, Time elapsed: 17.878 sec

Results :

Failed tests:   testExportFileSystemState(org.apache.hadoop.hbase.snapshot.TestSecureExportSnapshot):
expected:<0> but was:<1>
  testConsecutiveExports(org.apache.hadoop.hbase.snapshot.TestSecureExportSnapshot): expected:<0>
but was:<1>
  testSnapshotWithRefsExportFileSystemState(org.apache.hadoop.hbase.snapshot.TestSecureExportSnapshot):
expected:<0> but was:<1>
  testExportRetry(org.apache.hadoop.hbase.snapshot.TestSecureExportSnapshot): expected:<0>
but was:<1>
  testOverlapAndOrphan(org.apache.hadoop.hbase.util.TestHBaseFsck): expected:<[NOT_IN_META_OR_DEPLOYED,
HOLE_IN_REGION_CHAIN, ORPHAN_HDFS_REGION]> but was:<[NOT_IN_META_OR_DEPLOYED, SERVER_DOES_NOT_MATCH_META,
HOLE_IN_REGION_CHAIN, ORPHAN_HDFS_REGION]>
  testRegionHole(org.apache.hadoop.hbase.util.TestHBaseFsck): expected:<[HOLE_IN_REGION_CHAIN]>
but was:<[SERVER_DOES_NOT_MATCH_META, HOLE_IN_REGION_CHAIN]>
  testTableWithNoRegions(org.apache.hadoop.hbase.util.TestHBaseFsck): expected:<[NOT_IN_HDFS]>
but was:<[NOT_IN_HDFS, SERVER_DOES_NOT_MATCH_META]>
  testNotInHdfs(org.apache.hadoop.hbase.util.TestHBaseFsck): expected:<[NOT_IN_HDFS]>
but was:<[NOT_IN_HDFS, SERVER_DOES_NOT_MATCH_META]>
  testNotInMetaOrDeployedHole(org.apache.hadoop.hbase.util.TestHBaseFsck): expected:<[NOT_IN_META_OR_DEPLOYED,
HOLE_IN_REGION_CHAIN]> but was:<[NOT_IN_META_OR_DEPLOYED, SERVER_DOES_NOT_MATCH_META,
HOLE_IN_REGION_CHAIN]>
  testDegenerateRegions(org.apache.hadoop.hbase.util.TestHBaseFsck): expected:<[]> but
was:<[SERVER_DOES_NOT_MATCH_META]>
  testMissingFirstRegion(org.apache.hadoop.hbase.util.TestHBaseFsck): expected:<[FIRST_REGION_STARTKEY_NOT_EMPTY]>
but was:<[SERVER_DOES_NOT_MATCH_META, FIRST_REGION_STARTKEY_NOT_EMPTY]>
  testHbckThreadpooling(org.apache.hadoop.hbase.util.TestHBaseFsck): expected:<[]> but
was:<[SERVER_DOES_NOT_MATCH_META]>

Tests in error: 
  testHBase3583(org.apache.hadoop.hbase.coprocessor.TestRegionObserverInterface): callTimeout=60000,
callDuration=72120: row 'testHBase3583,,00000000000000' on table 'hbase:meta
  testHBase3758(org.apache.hadoop.hbase.coprocessor.TestRegionObserverInterface): org.apache.hadoop.hbase.NotAllMetaRegionsOnlineException:
Timed out; 10000ms
  testCompactionOverride(org.apache.hadoop.hbase.coprocessor.TestRegionObserverInterface):
callTimeout=60000, callDuration=70087: row 'TestCompactionOverride,,' on table 'hbase:meta
  testRowMutation(org.apache.hadoop.hbase.coprocessor.TestRegionObserverInterface): org.apache.hadoop.hbase.NotAllMetaRegionsOnlineException:
Timed out; 10000ms
  testRegionObserver(org.apache.hadoop.hbase.coprocessor.TestRegionObserverInterface): org.apache.hadoop.hbase.NotAllMetaRegionsOnlineException:
Timed out; 10000ms
  testIncrementHook(org.apache.hadoop.hbase.coprocessor.TestRegionObserverInterface): org.apache.hadoop.hbase.NotAllMetaRegionsOnlineException:
Timed out; 10000ms

Tests run: 1846, Failures: 12, Errors: 6, Skipped: 25

[INFO] ------------------------------------------------------------------------
[INFO] Reactor Summary:
[INFO] 
[INFO] HBase ............................................. SUCCESS [8.090s]
[INFO] HBase - Common .................................... SUCCESS [28.293s]
[INFO] HBase - Protocol .................................. SUCCESS [9.370s]
[INFO] HBase - Client .................................... SUCCESS [37.595s]
[INFO] HBase - Hadoop Compatibility ...................... SUCCESS [5.576s]
[INFO] HBase - Hadoop One Compatibility .................. SUCCESS [1.774s]
[INFO] HBase - Prefix Tree ............................... SUCCESS [3.560s]
[INFO] HBase - Server .................................... FAILURE [2:52:15.483s]
[INFO] HBase - Testing Util .............................. SKIPPED
[INFO] HBase - Thrift .................................... SKIPPED
[INFO] HBase - Shell ..................................... SKIPPED
[INFO] HBase - Integration Tests ......................... SKIPPED
[INFO] HBase - Examples .................................. SKIPPED
[INFO] HBase - Assembly .................................. SKIPPED
[INFO] ------------------------------------------------------------------------
[INFO] BUILD FAILURE
[INFO] ------------------------------------------------------------------------
[INFO] Total time: 2:53:50.548s
[INFO] Finished at: Sat Mar 01 01:10:23 UTC 2014
[INFO] Final Memory: 30M/635M
[INFO] ------------------------------------------------------------------------
[ERROR] Failed to execute goal org.apache.maven.plugins:maven-surefire-plugin:2.12-TRUNK-HBASE-2:test
(secondPartTestsExecution) on project hbase-server: There are test failures.
[ERROR] 
[ERROR] Please refer to /x1/jenkins/jenkins-slave/workspace/HBase-TRUNK-on-Hadoop-1.1/trunk/hbase-server/target/surefire-reports
for the individual test results.
[ERROR] -> [Help 1]
[ERROR] 
[ERROR] To see the full stack trace of the errors, re-run Maven with the -e switch.
[ERROR] Re-run Maven using the -X switch to enable full debug logging.
[ERROR] 
[ERROR] For more information about the errors and possible solutions, please read the following
articles:
[ERROR] [Help 1] http://cwiki.apache.org/confluence/display/MAVEN/MojoFailureException
[ERROR] 
[ERROR] After correcting the problems, you can resume the build with the command
[ERROR]   mvn <goals> -rf :hbase-server
Build step 'Invoke top-level Maven targets' marked build as failure
Performing Post build task...
Match found for :.* : True
Logical operation result is TRUE
Running script  :   ZOMBIE_TESTS_COUNT=`jps | grep surefirebooter | wc -l`
  if [[ $ZOMBIE_TESTS_COUNT != 0 ]] ; then
    #It seems sometimes the tests are not dying immediately. Let's give them 10s
    echo "Suspicious java process found - waiting 10s to see if there are just slow to stop"
    sleep 10
    ZOMBIE_TESTS_COUNT=`jps | grep surefirebooter | wc -l`
    if [[ $ZOMBIE_TESTS_COUNT != 0 ]] ; then
      echo "There are $ZOMBIE_TESTS_COUNT zombie tests, they should have been killed by surefire
but survived"
      echo "************ BEGIN zombies jstack extract"
      ZB_STACK=`jps | grep surefirebooter | cut -d ' ' -f 1 | xargs -n 1 jstack | grep ".test"
| grep "\.java"`
      jps | grep surefirebooter | cut -d ' ' -f 1 | xargs -n 1 jstack
      echo "************ END  zombies jstack extract"
      JIRA_COMMENT="$JIRA_COMMENT

     {color:red}-1 core zombie tests{color}.  There are ${ZOMBIE_TESTS_COUNT} zombie test(s):
${ZB_STACK}"
      BAD=1
      jps | grep surefirebooter | cut -d ' ' -f 1 | xargs kill -9
    else
      echo "We're ok: there is no zombie test, but some tests took some time to stop"
    fi
  else
    echo "We're ok: there is no zombie test"
  fi
[HBase-TRUNK-on-Hadoop-1.1] $ /bin/bash -xe /tmp/hudson1176003945317289175.sh
++ jps
++ grep surefirebooter
++ wc -l
+ ZOMBIE_TESTS_COUNT=0
+ [[ 0 != 0 ]]
+ echo 'We'\''re ok: there is no zombie test'
We're ok: there is no zombie test
POST BUILD TASK : SUCCESS
END OF POST BUILD TASK : 0
Archiving artifacts
Recording test results
Updating HBASE-10627
Updating HBASE-10638
Updating HBASE-10631

Mime
View raw message