hbase-builds mailing list archives

Site index · List index
Message view « Date » · « Thread »
Top « Date » · « Thread »
From Apache Jenkins Server <jenk...@builds.apache.org>
Subject Build failed in Jenkins: HBase-0.94-on-Hadoop-2 #41
Date Wed, 05 Mar 2014 22:18:57 GMT
See <https://builds.apache.org/job/HBase-0.94-on-Hadoop-2/41/changes>

Changes:

[rajeshbabu] HBASE-10669 [hbck tool] Usage is wrong for hbck tool for -sidelineCorruptHfiles
option(Deepak Sharma)

[larsh] HBASE-10594 Speed up TestRestoreSnapshotFromClient.

------------------------------------------
[...truncated 6248 lines...]
Tests run: 1, Failures: 0, Errors: 0, Skipped: 0, Time elapsed: 58.852 sec
Running org.apache.hadoop.hbase.mapreduce.TestLoadIncrementalHFiles
Tests run: 7, Failures: 0, Errors: 0, Skipped: 0, Time elapsed: 68.188 sec
Running org.apache.hadoop.hbase.TestAcidGuarantees
Tests run: 3, Failures: 0, Errors: 0, Skipped: 0, Time elapsed: 145.204 sec
Running org.apache.hadoop.hbase.snapshot.TestSnapshotDescriptionUtils
Tests run: 2, Failures: 0, Errors: 0, Skipped: 0, Time elapsed: 1.331 sec
Running org.apache.hadoop.hbase.mapreduce.TestTableInputFormatScan2
Tests run: 7, Failures: 1, Errors: 0, Skipped: 0, Time elapsed: 292.175 sec <<< FAILURE!
Running org.apache.hadoop.hbase.snapshot.TestExportSnapshot
Tests run: 6, Failures: 0, Errors: 0, Skipped: 0, Time elapsed: 263.062 sec
Running org.apache.hadoop.hbase.snapshot.TestFlushSnapshotFromClient
Tests run: 5, Failures: 0, Errors: 0, Skipped: 0, Time elapsed: 85.154 sec
Running org.apache.hadoop.hbase.catalog.TestMetaReaderEditorNoCluster
Tests run: 1, Failures: 0, Errors: 0, Skipped: 0, Time elapsed: 6.46 sec
Running org.apache.hadoop.hbase.mapreduce.TestImportExport
Tests run: 4, Failures: 0, Errors: 0, Skipped: 0, Time elapsed: 316.045 sec
Running org.apache.hadoop.hbase.thrift2.TestThriftHBaseServiceHandler
Tests run: 19, Failures: 0, Errors: 0, Skipped: 0, Time elapsed: 28.215 sec
Running org.apache.hadoop.hbase.catalog.TestCatalogTracker
Tests run: 10, Failures: 0, Errors: 0, Skipped: 1, Time elapsed: 12.574 sec
Running org.apache.hadoop.hbase.catalog.TestMetaReaderEditor
Tests run: 5, Failures: 0, Errors: 0, Skipped: 0, Time elapsed: 61.293 sec
Running org.apache.hadoop.hbase.client.TestTimestampsFilter
Tests run: 3, Failures: 0, Errors: 0, Skipped: 0, Time elapsed: 38.518 sec
Running org.apache.hadoop.hbase.client.TestFromClientSide3
Tests run: 1, Failures: 0, Errors: 0, Skipped: 0, Time elapsed: 49.743 sec
Running org.apache.hadoop.hbase.client.TestHCM
Tests run: 9, Failures: 0, Errors: 0, Skipped: 0, Time elapsed: 62.327 sec
Running org.apache.hadoop.hbase.snapshot.TestRestoreFlushSnapshotFromClient
Tests run: 5, Failures: 0, Errors: 0, Skipped: 0, Time elapsed: 309.55 sec
Running org.apache.hadoop.hbase.client.TestScannerTimeout
Tests run: 4, Failures: 0, Errors: 0, Skipped: 0, Time elapsed: 73.569 sec
Running org.apache.hadoop.hbase.client.TestShell
Tests run: 1, Failures: 0, Errors: 0, Skipped: 0, Time elapsed: 193.745 sec
Running org.apache.hadoop.hbase.client.TestMetaScanner
Tests run: 2, Failures: 0, Errors: 0, Skipped: 0, Time elapsed: 73.825 sec
Running org.apache.hadoop.hbase.client.TestHTableUtil
Tests run: 2, Failures: 0, Errors: 0, Skipped: 0, Time elapsed: 25.342 sec
Killed
org.apache.maven.surefire.booter.SurefireBooterForkException: Error occurred in starting fork,
check output in log
	at org.apache.maven.plugin.surefire.booterclient.ForkStarter.fork(ForkStarter.java:238)
	at org.apache.maven.plugin.surefire.booterclient.ForkStarter.access$000(ForkStarter.java:64)
	at org.apache.maven.plugin.surefire.booterclient.ForkStarter$ParallelFork.call(ForkStarter.java:303)
	at org.apache.maven.plugin.surefire.booterclient.ForkStarter$ParallelFork.call(ForkStarter.java:285)
	at java.util.concurrent.FutureTask$Sync.innerRun(FutureTask.java:303)
	at java.util.concurrent.FutureTask.run(FutureTask.java:138)
	at java.util.concurrent.ThreadPoolExecutor$Worker.runTask(ThreadPoolExecutor.java:895)
	at java.util.concurrent.ThreadPoolExecutor$Worker.run(ThreadPoolExecutor.java:918)
	at java.lang.Thread.run(Thread.java:662)
Killed
org.apache.maven.surefire.booter.SurefireBooterForkException: Error occurred in starting fork,
check output in log
	at org.apache.maven.plugin.surefire.booterclient.ForkStarter.fork(ForkStarter.java:238)
	at org.apache.maven.plugin.surefire.booterclient.ForkStarter.access$000(ForkStarter.java:64)
	at org.apache.maven.plugin.surefire.booterclient.ForkStarter$ParallelFork.call(ForkStarter.java:303)
	at org.apache.maven.plugin.surefire.booterclient.ForkStarter$ParallelFork.call(ForkStarter.java:285)
	at java.util.concurrent.FutureTask$Sync.innerRun(FutureTask.java:303)
	at java.util.concurrent.FutureTask.run(FutureTask.java:138)
	at java.util.concurrent.ThreadPoolExecutor$Worker.runTask(ThreadPoolExecutor.java:895)
	at java.util.concurrent.ThreadPoolExecutor$Worker.run(ThreadPoolExecutor.java:918)
	at java.lang.Thread.run(Thread.java:662)
Killed
org.apache.maven.surefire.booter.SurefireBooterForkException: Error occurred in starting fork,
check output in log
	at org.apache.maven.plugin.surefire.booterclient.ForkStarter.fork(ForkStarter.java:238)
	at org.apache.maven.plugin.surefire.booterclient.ForkStarter.access$000(ForkStarter.java:64)
	at org.apache.maven.plugin.surefire.booterclient.ForkStarter$ParallelFork.call(ForkStarter.java:303)
	at org.apache.maven.plugin.surefire.booterclient.ForkStarter$ParallelFork.call(ForkStarter.java:285)
	at java.util.concurrent.FutureTask$Sync.innerRun(FutureTask.java:303)
	at java.util.concurrent.FutureTask.run(FutureTask.java:138)
	at java.util.concurrent.ThreadPoolExecutor$Worker.runTask(ThreadPoolExecutor.java:895)
	at java.util.concurrent.ThreadPoolExecutor$Worker.run(ThreadPoolExecutor.java:918)
	at java.lang.Thread.run(Thread.java:662)
Killed
org.apache.maven.surefire.booter.SurefireBooterForkException: Error occurred in starting fork,
check output in log
	at org.apache.maven.plugin.surefire.booterclient.ForkStarter.fork(ForkStarter.java:238)
	at org.apache.maven.plugin.surefire.booterclient.ForkStarter.access$000(ForkStarter.java:64)
	at org.apache.maven.plugin.surefire.booterclient.ForkStarter$ParallelFork.call(ForkStarter.java:303)
	at org.apache.maven.plugin.surefire.booterclient.ForkStarter$ParallelFork.call(ForkStarter.java:285)
	at java.util.concurrent.FutureTask$Sync.innerRun(FutureTask.java:303)
	at java.util.concurrent.FutureTask.run(FutureTask.java:138)
	at java.util.concurrent.ThreadPoolExecutor$Worker.runTask(ThreadPoolExecutor.java:895)
	at java.util.concurrent.ThreadPoolExecutor$Worker.run(ThreadPoolExecutor.java:918)
	at java.lang.Thread.run(Thread.java:662)
No results for java.util.concurrent.FutureTask@971fc2
No results for java.util.concurrent.FutureTask@1a623ea
No results for java.util.concurrent.FutureTask@7ff84b
No results for java.util.concurrent.FutureTask@1861eda
Running org.apache.hadoop.hbase.client.replication.TestReplicationAdmin
Tests run: 1, Failures: 0, Errors: 0, Skipped: 0, Time elapsed: 2.283 sec
Running org.apache.hadoop.hbase.client.TestSnapshotFromClient
Tests run: 3, Failures: 0, Errors: 0, Skipped: 0, Time elapsed: 45.923 sec
Running org.apache.hadoop.hbase.client.TestHTablePool$TestHTableReusablePool
Tests run: 8, Failures: 0, Errors: 0, Skipped: 0, Time elapsed: 12.297 sec
Running org.apache.hadoop.hbase.client.TestMultipleTimestamps
Tests run: 8, Failures: 0, Errors: 0, Skipped: 0, Time elapsed: 56.598 sec
Running org.apache.hadoop.hbase.client.TestHTablePool$TestHTableThreadLocalPool
Tests run: 8, Failures: 0, Errors: 0, Skipped: 0, Time elapsed: 60.915 sec
Running org.apache.hadoop.hbase.client.TestHConnection
Tests run: 2, Failures: 0, Errors: 0, Skipped: 0, Time elapsed: 46.622 sec
Running org.apache.hadoop.hbase.client.TestMultiParallel
Tests run: 11, Failures: 0, Errors: 0, Skipped: 0, Time elapsed: 103.93 sec
Running org.apache.hadoop.hbase.metrics.TestMetricsMBeanBase
Tests run: 3, Failures: 0, Errors: 0, Skipped: 0, Time elapsed: 1.331 sec
Running org.apache.hadoop.hbase.client.TestCoprocessorHConnection
Tests run: 2, Failures: 0, Errors: 0, Skipped: 0, Time elapsed: 21.783 sec
Running org.apache.hadoop.hbase.rest.TestGzipFilter
Tests run: 2, Failures: 0, Errors: 0, Skipped: 0, Time elapsed: 22.92 sec
Running org.apache.hadoop.hbase.constraint.TestConstraint
Tests run: 5, Failures: 0, Errors: 0, Skipped: 0, Time elapsed: 40.014 sec
Running org.apache.hadoop.hbase.rest.TestMultiRowResource
Tests run: 3, Failures: 0, Errors: 0, Skipped: 0, Time elapsed: 24.022 sec
Running org.apache.hadoop.hbase.rest.TestGZIPResponseWrapper
Tests run: 5, Failures: 0, Errors: 0, Skipped: 0, Time elapsed: 0.245 sec
Running org.apache.hadoop.hbase.rest.TestScannersWithFilters
Tests run: 10, Failures: 0, Errors: 0, Skipped: 0, Time elapsed: 33.268 sec
Running org.apache.hadoop.hbase.rest.TestRowResource
Tests run: 12, Failures: 0, Errors: 0, Skipped: 0, Time elapsed: 30.783 sec
Running org.apache.hadoop.hbase.rest.client.TestRemoteAdmin
Tests run: 5, Failures: 0, Errors: 0, Skipped: 0, Time elapsed: 29.587 sec
Running org.apache.hadoop.hbase.rest.TestVersionResource
Tests run: 7, Failures: 0, Errors: 0, Skipped: 0, Time elapsed: 22.003 sec
Running org.apache.hadoop.hbase.rest.client.TestRemoteTable
Tests run: 9, Failures: 0, Errors: 0, Skipped: 0, Time elapsed: 70.012 sec
Running org.apache.hadoop.hbase.rest.TestScannerResource
Tests run: 5, Failures: 0, Errors: 0, Skipped: 0, Time elapsed: 36.385 sec
Running org.apache.hadoop.hbase.rest.TestStatusResource
Tests run: 2, Failures: 0, Errors: 0, Skipped: 0, Time elapsed: 17.421 sec
Running org.apache.hadoop.hbase.client.TestCloneSnapshotFromClient
Tests run: 3, Failures: 0, Errors: 0, Skipped: 0, Time elapsed: 230.888 sec
Running org.apache.hadoop.hbase.rest.TestTableResource
Tests run: 8, Failures: 0, Errors: 0, Skipped: 0, Time elapsed: 29.855 sec
Running org.apache.hadoop.hbase.rest.TestSchemaResource
Tests run: 2, Failures: 0, Errors: 0, Skipped: 0, Time elapsed: 26.017 sec
Running org.apache.hadoop.hbase.io.encoding.TestLoadAndSwitchEncodeOnDisk
Tests run: 1, Failures: 0, Errors: 0, Skipped: 0, Time elapsed: 29.887 sec
Running org.apache.hadoop.hbase.thrift.TestThriftServer
Tests run: 1, Failures: 0, Errors: 0, Skipped: 0, Time elapsed: 55.412 sec
Running org.apache.hadoop.hbase.client.TestAdmin
Tests run: 43, Failures: 0, Errors: 0, Skipped: 0, Time elapsed: 405.221 sec
Running org.apache.hadoop.hbase.io.encoding.TestDataBlockEncoders
Tests run: 12, Failures: 0, Errors: 0, Skipped: 0, Time elapsed: 140.752 sec
Running org.apache.hadoop.hbase.io.hfile.TestHFileSeek
Tests run: 1, Failures: 0, Errors: 0, Skipped: 0, Time elapsed: 4.979 sec
Running org.apache.hadoop.hbase.io.hfile.slab.TestSlabCache
Tests run: 7, Failures: 0, Errors: 0, Skipped: 0, Time elapsed: 22.632 sec
Running org.apache.hadoop.hbase.io.hfile.slab.TestSingleSizeCache
Tests run: 5, Failures: 0, Errors: 0, Skipped: 0, Time elapsed: 29.962 sec
Running org.apache.hadoop.hbase.io.hfile.TestChecksum
Tests run: 3, Failures: 0, Errors: 0, Skipped: 0, Time elapsed: 1.174 sec
Running org.apache.hadoop.hbase.io.hfile.TestHFileBlockIndex
Tests run: 10, Failures: 0, Errors: 0, Skipped: 0, Time elapsed: 9.68 sec
Running org.apache.hadoop.hbase.io.hfile.TestLruBlockCache
Tests run: 16, Failures: 0, Errors: 0, Skipped: 0, Time elapsed: 1.093 sec
Running org.apache.hadoop.hbase.io.encoding.TestUpgradeFromHFileV1ToEncoding
Tests run: 1, Failures: 0, Errors: 0, Skipped: 0, Time elapsed: 106.052 sec
Running org.apache.hadoop.hbase.io.hfile.TestFixedFileTrailer
Tests run: 2, Failures: 0, Errors: 0, Skipped: 0, Time elapsed: 0.871 sec
Running org.apache.hadoop.hbase.io.hfile.TestHFilePerformance
Tests run: 1, Failures: 0, Errors: 0, Skipped: 0, Time elapsed: 5.835 sec
Running org.apache.hadoop.hbase.io.hfile.TestHFileBlockCompatibility
Tests run: 10, Failures: 0, Errors: 0, Skipped: 0, Time elapsed: 1.374 sec
Running org.apache.hadoop.hbase.io.hfile.TestHFileBlock
Tests run: 16, Failures: 0, Errors: 0, Skipped: 0, Time elapsed: 52.178 sec
Running org.apache.hadoop.hbase.io.encoding.TestChangingEncoding
Tests run: 4, Failures: 0, Errors: 0, Skipped: 0, Time elapsed: 288.385 sec
Running org.apache.hadoop.hbase.io.hfile.TestForceCacheImportantBlocks
Tests run: 4, Failures: 0, Errors: 0, Skipped: 0, Time elapsed: 74.05 sec
Running org.apache.hadoop.hbase.io.hfile.TestCacheOnWrite
Tests run: 36, Failures: 0, Errors: 0, Skipped: 0, Time elapsed: 38.381 sec
Running org.apache.hadoop.hbase.io.TestFileLink
Tests run: 3, Failures: 0, Errors: 0, Skipped: 0, Time elapsed: 28.756 sec
Running org.apache.hadoop.hbase.TestClusterBootOrder
Tests run: 2, Failures: 0, Errors: 0, Skipped: 0, Time elapsed: 49.619 sec
Running org.apache.hadoop.hbase.avro.TestAvroServer
Tests run: 3, Failures: 0, Errors: 0, Skipped: 0, Time elapsed: 35.616 sec
Running org.apache.hadoop.hbase.replication.TestMultiSlaveReplication
Tests run: 1, Failures: 0, Errors: 0, Skipped: 0, Time elapsed: 44.646 sec
Running org.apache.hadoop.hbase.replication.regionserver.TestReplicationSourceManager
Tests run: 3, Failures: 0, Errors: 0, Skipped: 0, Time elapsed: 2.888 sec
Running org.apache.hadoop.hbase.thrift.TestThriftServerCmdLine
Tests run: 20, Failures: 0, Errors: 0, Skipped: 0, Time elapsed: 457.85 sec
Running org.apache.hadoop.hbase.replication.regionserver.TestReplicationSink
Tests run: 5, Failures: 0, Errors: 0, Skipped: 0, Time elapsed: 16.18 sec
Running org.apache.hadoop.hbase.replication.TestReplicationDisableInactivePeer
Tests run: 1, Failures: 0, Errors: 0, Skipped: 0, Time elapsed: 97.925 sec
Running org.apache.hadoop.hbase.replication.TestReplicationSource
Tests run: 1, Failures: 0, Errors: 0, Skipped: 0, Time elapsed: 6.121 sec
Running org.apache.hadoop.hbase.replication.TestReplicationZookeeper
Tests run: 1, Failures: 0, Errors: 0, Skipped: 0, Time elapsed: 0.941 sec
Running org.apache.hadoop.hbase.replication.TestReplicationSyncUpTool
Tests run: 1, Failures: 0, Errors: 0, Skipped: 0, Time elapsed: 129.802 sec
Running org.apache.hadoop.hbase.replication.TestReplicationQueueFailover
Tests run: 1, Failures: 0, Errors: 0, Skipped: 0, Time elapsed: 74.631 sec
Running org.apache.hadoop.hbase.ipc.TestDelayedRpc
Tests run: 4, Failures: 0, Errors: 0, Skipped: 0, Time elapsed: 3.032 sec
Running org.apache.hadoop.hbase.ipc.TestPBOnWritableRpc
Tests run: 1, Failures: 0, Errors: 0, Skipped: 0, Time elapsed: 1.239 sec
Running org.apache.hadoop.hbase.TestZooKeeper
Tests run: 9, Failures: 0, Errors: 0, Skipped: 0, Time elapsed: 34.093 sec
Running org.apache.hadoop.hbase.replication.TestMasterReplication
Tests run: 3, Failures: 0, Errors: 0, Skipped: 0, Time elapsed: 142.222 sec
Running org.apache.hadoop.hbase.replication.TestReplicationQueueFailoverCompressed
Tests run: 1, Failures: 0, Errors: 0, Skipped: 0, Time elapsed: 73.616 sec
Running org.apache.hadoop.hbase.replication.TestReplicationSmallTests
Tests run: 9, Failures: 0, Errors: 0, Skipped: 0, Time elapsed: 151.957 sec
Running org.apache.hadoop.hbase.TestHBaseTestingUtility
Tests run: 7, Failures: 0, Errors: 0, Skipped: 0, Time elapsed: 58.315 sec

Results :

Failed tests:   testMultiRegionTable(org.apache.hadoop.hbase.mapreduce.TestTableMapReduce)
  testScanEmptyToBBA(org.apache.hadoop.hbase.mapreduce.TestTableInputFormatScan1)
  testScanEmptyToOPP(org.apache.hadoop.hbase.mapreduce.TestTableInputFormatScan1)
  testScanEmptyToEmpty(org.apache.hadoop.hbase.mapreduce.TestTableInputFormatScan1)
  testExcludeAllFromMinorCompaction(org.apache.hadoop.hbase.mapreduce.TestHFileOutputFormat)
  testMRIncrementalLoad(org.apache.hadoop.hbase.mapreduce.TestHFileOutputFormat)
  testMRIncrementalLoadWithSplit(org.apache.hadoop.hbase.mapreduce.TestHFileOutputFormat)
  testScanEmptyToAPP(org.apache.hadoop.hbase.mapreduce.TestMultiTableInputFormat)
  testScanYZYToEmpty(org.apache.hadoop.hbase.mapreduce.TestMultiTableInputFormat)
  testScanOPPToEmpty(org.apache.hadoop.hbase.mapreduce.TestMultiTableInputFormat)
  testScanEmptyToEmpty(org.apache.hadoop.hbase.mapreduce.TestMultiTableInputFormat)
  testScanOBBToOPP(org.apache.hadoop.hbase.mapreduce.TestMultiTableInputFormat)
  testMultithreadedTableMapper(org.apache.hadoop.hbase.mapreduce.TestMultithreadedTableMapper)
  testScanOPPToEmpty(org.apache.hadoop.hbase.mapreduce.TestTableInputFormatScan2)

Tests run: 1278, Failures: 14, Errors: 0, Skipped: 7

[INFO] ------------------------------------------------------------------------
[INFO] BUILD FAILURE
[INFO] ------------------------------------------------------------------------
[INFO] Total time: 1:09:55.825s
[INFO] Finished at: Wed Mar 05 22:17:44 UTC 2014
[INFO] Final Memory: 52M/1032M
[INFO] ------------------------------------------------------------------------
[ERROR] Failed to execute goal org.apache.maven.plugins:maven-surefire-plugin:2.12-TRUNK-HBASE-2:test
(secondPartTestsExecution) on project hbase: There are test failures.
[ERROR] 
[ERROR] Please refer to <https://builds.apache.org/job/HBase-0.94-on-Hadoop-2/ws/trunk/target/surefire-reports>
for the individual test results.
[ERROR] -> [Help 1]
[ERROR] 
[ERROR] To see the full stack trace of the errors, re-run Maven with the -e switch.
[ERROR] Re-run Maven using the -X switch to enable full debug logging.
[ERROR] 
[ERROR] For more information about the errors and possible solutions, please read the following
articles:
[ERROR] [Help 1] http://cwiki.apache.org/confluence/display/MAVEN/MojoFailureException
Build step 'Invoke top-level Maven targets' marked build as failure
Archiving artifacts
Updating HBASE-10669
Updating HBASE-10594
Recording test results

Mime
View raw message