hbase-builds mailing list archives

Site index · List index
Message view « Date » · « Thread »
Top « Date » · « Thread »
From Apache Jenkins Server <jenk...@builds.apache.org>
Subject Build failed in Jenkins: HBase-0.98 #196
Date Tue, 04 Mar 2014 01:09:27 GMT
See <https://builds.apache.org/job/HBase-0.98/196/changes>

Changes:

[enis] HBASE-10632 Region lost in limbo after ArrayIndexOutOfBoundsException during assignment

------------------------------------------
[...truncated 4700 lines...]
Tests run: 1, Failures: 0, Errors: 0, Skipped: 0, Time elapsed: 0.355 sec
Running org.apache.hadoop.hbase.util.TestFSHDFSUtils
Tests run: 2, Failures: 0, Errors: 0, Skipped: 0, Time elapsed: 4.183 sec
Running org.apache.hadoop.hbase.migration.TestNamespaceUpgrade
Tests run: 5, Failures: 0, Errors: 0, Skipped: 0, Time elapsed: 43.911 sec
Running org.apache.hadoop.hbase.migration.TestUpgradeTo96
Tests run: 5, Failures: 0, Errors: 0, Skipped: 0, Time elapsed: 14.286 sec
Running org.apache.hadoop.hbase.TestNamespace
Tests run: 9, Failures: 0, Errors: 0, Skipped: 1, Time elapsed: 23.133 sec
Running org.apache.hadoop.hbase.TestInfoServers
Tests run: 3, Failures: 0, Errors: 0, Skipped: 0, Time elapsed: 14.515 sec
Running org.apache.hadoop.hbase.util.TestHBaseFsck
Tests run: 40, Failures: 0, Errors: 0, Skipped: 1, Time elapsed: 380.437 sec

Results :

Tests in error: 
  org.apache.hadoop.hbase.master.TestMasterMetrics: Shutting down

Tests run: 1814, Failures: 0, Errors: 1, Skipped: 24

[INFO] ------------------------------------------------------------------------
[INFO] Reactor Summary:
[INFO] 
[INFO] HBase ............................................. SUCCESS [4.143s]
[INFO] HBase - Common .................................... SUCCESS [32.346s]
[INFO] HBase - Protocol .................................. SUCCESS [16.565s]
[INFO] HBase - Client .................................... SUCCESS [39.343s]
[INFO] HBase - Hadoop Compatibility ...................... SUCCESS [5.866s]
[INFO] HBase - Hadoop Two Compatibility .................. SUCCESS [1.930s]
[INFO] HBase - Prefix Tree ............................... SUCCESS [3.589s]
[INFO] HBase - Server .................................... FAILURE [2:15:15.691s]
[INFO] HBase - Testing Util .............................. SKIPPED
[INFO] HBase - Thrift .................................... SKIPPED
[INFO] HBase - Shell ..................................... SKIPPED
[INFO] HBase - Integration Tests ......................... SKIPPED
[INFO] HBase - Examples .................................. SKIPPED
[INFO] HBase - Assembly .................................. SKIPPED
[INFO] ------------------------------------------------------------------------
[INFO] BUILD FAILURE
[INFO] ------------------------------------------------------------------------
[INFO] Total time: 2:17:00.178s
[INFO] Finished at: Tue Mar 04 01:08:36 UTC 2014
[INFO] Final Memory: 34M/521M
[INFO] ------------------------------------------------------------------------
[ERROR] Failed to execute goal org.apache.maven.plugins:maven-surefire-plugin:2.12-TRUNK-HBASE-2:test
(secondPartTestsExecution) on project hbase-server: There are test failures.
[ERROR] 
[ERROR] Please refer to /x1/jenkins/jenkins-slave/workspace/HBase-0.98/0.98/hbase-server/target/surefire-reports
for the individual test results.
[ERROR] -> [Help 1]
[ERROR] 
[ERROR] To see the full stack trace of the errors, re-run Maven with the -e switch.
[ERROR] Re-run Maven using the -X switch to enable full debug logging.
[ERROR] 
[ERROR] For more information about the errors and possible solutions, please read the following
articles:
[ERROR] [Help 1] http://cwiki.apache.org/confluence/display/MAVEN/MojoFailureException
[ERROR] 
[ERROR] After correcting the problems, you can resume the build with the command
[ERROR]   mvn <goals> -rf :hbase-server
Build step 'Invoke top-level Maven targets' marked build as failure
Performing Post build task...
Match found for :.* : True
Logical operation result is TRUE
Running script  :   ZOMBIE_TESTS_COUNT=`jps | grep surefirebooter | wc -l`
  if [[ $ZOMBIE_TESTS_COUNT != 0 ]] ; then
    #It seems sometimes the tests are not dying immediately. Let's give them 10s
    echo "Suspicious java process found - waiting 10s to see if there are just slow to stop"
    sleep 10   
    ZOMBIE_TESTS_COUNT=`jps | grep surefirebooter | wc -l`
    if [[ $ZOMBIE_TESTS_COUNT != 0 ]] ; then
      echo "There are $ZOMBIE_TESTS_COUNT zombie tests, they should have been killed by surefire
but survived"
      echo "************ BEGIN zombies jstack extract"
      ZB_STACK=`jps | grep surefirebooter | cut -d ' ' -f 1 | xargs -n 1 jstack | grep ".test"
| grep "\.java"`
      jps | grep surefirebooter | cut -d ' ' -f 1 | xargs -n 1 jstack
      echo "************ END  zombies jstack extract"
      JIRA_COMMENT="$JIRA_COMMENT

     {color:red}-1 core zombie tests{color}.  There are ${ZOMBIE_TESTS_COUNT} zombie test(s):
${ZB_STACK}"
      BAD=1
      jps | grep surefirebooter | cut -d ' ' -f 1 | xargs kill -9
    else
      echo "We're ok: there is no zombie test, but some tests took some time to stop"
    fi
  else
    echo "We're ok: there is no zombie test"
  fi
[HBase-0.98] $ /bin/bash -xe /tmp/hudson4007951283501897769.sh
++ jps
++ grep surefirebooter
++ wc -l
+ ZOMBIE_TESTS_COUNT=1
+ [[ 1 != 0 ]]
+ echo 'Suspicious java process found - waiting 10s to see if there are just slow to stop'
Suspicious java process found - waiting 10s to see if there are just slow to stop
+ sleep 10
++ jps
++ grep surefirebooter
++ wc -l
+ ZOMBIE_TESTS_COUNT=1
+ [[ 1 != 0 ]]
+ echo 'There are 1 zombie tests, they should have been killed by surefire but survived'
There are 1 zombie tests, they should have been killed by surefire but survived
+ echo '************ BEGIN zombies jstack extract'
************ BEGIN zombies jstack extract
++ jps
++ cut -d ' ' -f 1
++ grep surefirebooter
++ xargs -n 1 jstack
++ grep .test
++ grep '\.java'
+ ZB_STACK='	at org.apache.archiva.web.test.parent.AbstractSeleniumTest.waitPage(AbstractSeleniumTest.java:454)
	at org.apache.archiva.web.test.parent.AbstractSeleniumTest.goToLoginPage(AbstractSeleniumTest.java:221)
	at org.apache.archiva.web.test.parent.AbstractSeleniumTest.login(AbstractSeleniumTest.java:207)
	at org.apache.archiva.web.test.parent.AbstractSeleniumTest.login(AbstractSeleniumTest.java:200)
	at org.apache.archiva.web.test.parent.AbstractSeleniumTest.initializeArchiva(AbstractSeleniumTest.java:162)
	at org.apache.archiva.web.test.parent.AbstractSeleniumTest.assertAdminCreated(AbstractSeleniumTest.java:128)
	at org.apache.archiva.web.test.parent.AbstractSeleniumTest.open(AbstractSeleniumTest.java:88)
	at org.apache.archiva.web.test.tools.ArchivaSeleniumExecutionRule.apply(ArchivaSeleniumExecutionRule.java:41)'
+ jps
+ grep surefirebooter
+ cut -d ' ' -f 1
+ xargs -n 1 jstack
2014-03-04 01:08:50
Full thread dump Java HotSpot(TM) Server VM (20.45-b01 mixed mode):

"Attach Listener" daemon prio=10 tid=0xac600800 nid=0x30ed waiting on condition [0x00000000]
   java.lang.Thread.State: RUNNABLE

"Low Memory Detector" daemon prio=10 tid=0xaccb8800 nid=0x59d runnable [0x00000000]
   java.lang.Thread.State: RUNNABLE

"C2 CompilerThread1" daemon prio=10 tid=0xaccb6c00 nid=0x59c waiting on condition [0x00000000]
   java.lang.Thread.State: RUNNABLE

"C2 CompilerThread0" daemon prio=10 tid=0xaccb4c00 nid=0x59b waiting on condition [0x00000000]
   java.lang.Thread.State: RUNNABLE

"Signal Dispatcher" daemon prio=10 tid=0xaccb3400 nid=0x59a runnable [0x00000000]
   java.lang.Thread.State: RUNNABLE

"Finalizer" daemon prio=10 tid=0xacca5800 nid=0x599 in Object.wait() [0xaf165000]
   java.lang.Thread.State: WAITING (on object monitor)
	at java.lang.Object.wait(Native Method)
	- waiting on <0xdf368230> (a java.lang.ref.ReferenceQueue$Lock)
	at java.lang.ref.ReferenceQueue.remove(ReferenceQueue.java:118)
	- locked <0xdf368230> (a java.lang.ref.ReferenceQueue$Lock)
	at java.lang.ref.ReferenceQueue.remove(ReferenceQueue.java:134)
	at java.lang.ref.Finalizer$FinalizerThread.run(Finalizer.java:171)

"Reference Handler" daemon prio=10 tid=0xacca4000 nid=0x598 in Object.wait() [0xacb7d000]
   java.lang.Thread.State: WAITING (on object monitor)
	at java.lang.Object.wait(Native Method)
	- waiting on <0xdf364118> (a java.lang.ref.Reference$Lock)
	at java.lang.Object.wait(Object.java:485)
	at java.lang.ref.Reference$ReferenceHandler.run(Reference.java:116)
	- locked <0xdf364118> (a java.lang.ref.Reference$Lock)

"main" prio=10 tid=0xf6705800 nid=0x583 waiting on condition [0xf689c000]
   java.lang.Thread.State: TIMED_WAITING (sleeping)
	at java.lang.Thread.sleep(Native Method)
	at org.apache.archiva.web.test.parent.AbstractSeleniumTest.waitPage(AbstractSeleniumTest.java:454)
	at org.apache.archiva.web.test.parent.AbstractSeleniumTest.goToLoginPage(AbstractSeleniumTest.java:221)
	at org.apache.archiva.web.test.parent.AbstractSeleniumTest.login(AbstractSeleniumTest.java:207)
	at org.apache.archiva.web.test.parent.AbstractSeleniumTest.login(AbstractSeleniumTest.java:200)
	at org.apache.archiva.web.test.parent.AbstractSeleniumTest.initializeArchiva(AbstractSeleniumTest.java:162)
	at org.apache.archiva.web.test.parent.AbstractSeleniumTest.assertAdminCreated(AbstractSeleniumTest.java:128)
	at org.apache.archiva.web.test.parent.AbstractSeleniumTest.open(AbstractSeleniumTest.java:88)
	at org.apache.archiva.web.test.tools.ArchivaSeleniumExecutionRule.apply(ArchivaSeleniumExecutionRule.java:41)
	at org.junit.runners.BlockJUnit4ClassRunner.withMethodRules(BlockJUnit4ClassRunner.java:349)
	at org.junit.runners.BlockJUnit4ClassRunner.withRules(BlockJUnit4ClassRunner.java:339)
	at org.junit.runners.BlockJUnit4ClassRunner.methodBlock(BlockJUnit4ClassRunner.java:256)
	at org.junit.runners.BlockJUnit4ClassRunner.runChild(BlockJUnit4ClassRunner.java:70)
	at org.junit.runners.BlockJUnit4ClassRunner.runChild(BlockJUnit4ClassRunner.java:50)
	at org.junit.runners.ParentRunner$3.run(ParentRunner.java:238)
	at org.junit.runners.ParentRunner$1.schedule(ParentRunner.java:63)
	at org.junit.runners.ParentRunner.runChildren(ParentRunner.java:236)
	at org.junit.runners.ParentRunner.access$000(ParentRunner.java:53)
	at org.junit.runners.ParentRunner$2.evaluate(ParentRunner.java:229)
	at org.junit.runners.ParentRunner.run(ParentRunner.java:309)
	at org.apache.maven.surefire.junit4.JUnit4Provider.execute(JUnit4Provider.java:264)
	at org.apache.maven.surefire.junit4.JUnit4Provider.executeTestSet(JUnit4Provider.java:153)
	at org.apache.maven.surefire.junit4.JUnit4Provider.invoke(JUnit4Provider.java:124)
	at org.apache.maven.surefire.booter.ForkedBooter.invokeProviderInSameClassLoader(ForkedBooter.java:200)
	at org.apache.maven.surefire.booter.ForkedBooter.runSuitesInProcess(ForkedBooter.java:153)
	at org.apache.maven.surefire.booter.ForkedBooter.main(ForkedBooter.java:103)

"VM Thread" prio=10 tid=0xacca0400 nid=0x597 runnable 

"GC task thread#0 (ParallelGC)" prio=10 tid=0xf670cc00 nid=0x584 runnable 

"GC task thread#1 (ParallelGC)" prio=10 tid=0xf670e400 nid=0x585 runnable 

"GC task thread#2 (ParallelGC)" prio=10 tid=0xf670f800 nid=0x586 runnable 

"GC task thread#3 (ParallelGC)" prio=10 tid=0xf6711000 nid=0x587 runnable 

"GC task thread#4 (ParallelGC)" prio=10 tid=0xf6712400 nid=0x588 runnable 

"GC task thread#5 (ParallelGC)" prio=10 tid=0xf6713c00 nid=0x589 runnable 

"GC task thread#6 (ParallelGC)" prio=10 tid=0xf6715000 nid=0x58a runnable 

"GC task thread#7 (ParallelGC)" prio=10 tid=0xf6716800 nid=0x58b runnable 

"GC task thread#8 (ParallelGC)" prio=10 tid=0xf6717c00 nid=0x58c runnable 

"GC task thread#9 (ParallelGC)" prio=10 tid=0xf6719400 nid=0x58d runnable 

"GC task thread#10 (ParallelGC)" prio=10 tid=0xf671a800 nid=0x58e runnable 

"GC task thread#11 (ParallelGC)" prio=10 tid=0xf671c000 nid=0x58f runnable 

"GC task thread#12 (ParallelGC)" prio=10 tid=0xf671d400 nid=0x590 runnable 

"GC task thread#13 (ParallelGC)" prio=10 tid=0xf671ec00 nid=0x591 runnable 

"GC task thread#14 (ParallelGC)" prio=10 tid=0xf6720000 nid=0x593 runnable 

"GC task thread#15 (ParallelGC)" prio=10 tid=0xf6721800 nid=0x594 runnable 

"GC task thread#16 (ParallelGC)" prio=10 tid=0xf6722c00 nid=0x595 runnable 

"GC task thread#17 (ParallelGC)" prio=10 tid=0xf6724400 nid=0x596 runnable 

"VM Periodic Task Thread" prio=10 tid=0xaccba400 nid=0x59e waiting on condition 

JNI global references: 1293

+ echo '************ END  zombies jstack extract'
************ END  zombies jstack extract
+ JIRA_COMMENT='

     {color:red}-1 core zombie tests{color}.  There are 1 zombie test(s): 	at org.apache.archiva.web.test.parent.AbstractSeleniumTest.waitPage(AbstractSeleniumTest.java:454)
	at org.apache.archiva.web.test.parent.AbstractSeleniumTest.goToLoginPage(AbstractSeleniumTest.java:221)
	at org.apache.archiva.web.test.parent.AbstractSeleniumTest.login(AbstractSeleniumTest.java:207)
	at org.apache.archiva.web.test.parent.AbstractSeleniumTest.login(AbstractSeleniumTest.java:200)
	at org.apache.archiva.web.test.parent.AbstractSeleniumTest.initializeArchiva(AbstractSeleniumTest.java:162)
	at org.apache.archiva.web.test.parent.AbstractSeleniumTest.assertAdminCreated(AbstractSeleniumTest.java:128)
	at org.apache.archiva.web.test.parent.AbstractSeleniumTest.open(AbstractSeleniumTest.java:88)
	at org.apache.archiva.web.test.tools.ArchivaSeleniumExecutionRule.apply(ArchivaSeleniumExecutionRule.java:41)'
+ BAD=1
+ jps
+ grep surefirebooter
+ cut -d ' ' -f 1
+ xargs kill -9
POST BUILD TASK : SUCCESS
END OF POST BUILD TASK : 0
Archiving artifacts
Recording test results
Updating HBASE-10632

Mime
View raw message