hbase-builds mailing list archives

Site index · List index
Message view « Date » · « Thread »
Top « Date » · « Thread »
From Apache Jenkins Server <jenk...@builds.apache.org>
Subject Build failed in Jenkins: HBase-0.94-security #428
Date Tue, 04 Mar 2014 11:27:07 GMT
See <https://builds.apache.org/job/HBase-0.94-security/428/changes>

Changes:

[mbertozzi] HBASE-10567 Add overwrite manifest option to ExportSnapshot

[mbertozzi] HBASE-10537 Let the ExportSnapshot mapper fail and retry on error

[mbertozzi] HBASE-9708 Improve Snapshot Name Error Message (Esteban Gutierrez)

------------------------------------------
[...truncated 20680 lines...]
Running org.apache.hadoop.hbase.regionserver.TestParallelPut
Tests run: 2, Failures: 0, Errors: 0, Skipped: 0, Time elapsed: 4.927 sec
Forking command line: /bin/sh -c cd /home/hudson/jenkins-slave/workspace/HBase-0.94-security/trunk
&& /home/hudson/tools/java/jdk1.6.0_45-32/jre/bin/java -enableassertions -Xmx1900m
-Djava.security.egd=file:/dev/./urandom -jar /home/hudson/jenkins-slave/workspace/HBase-0.94-security/trunk/target/surefire/surefirebooter1103021435994813861.jar
/home/hudson/jenkins-slave/workspace/HBase-0.94-security/trunk/target/surefire/surefire7918903103335227118tmp
/home/hudson/jenkins-slave/workspace/HBase-0.94-security/trunk/target/surefire/surefire_975356936864585168994tmp
Running org.apache.hadoop.hbase.regionserver.TestServerCustomProtocol
Tests run: 7, Failures: 0, Errors: 0, Skipped: 0, Time elapsed: 19.953 sec
Forking command line: /bin/sh -c cd /home/hudson/jenkins-slave/workspace/HBase-0.94-security/trunk
&& /home/hudson/tools/java/jdk1.6.0_45-32/jre/bin/java -enableassertions -Xmx1900m
-Djava.security.egd=file:/dev/./urandom -jar /home/hudson/jenkins-slave/workspace/HBase-0.94-security/trunk/target/surefire/surefirebooter7032179755027854067.jar
/home/hudson/jenkins-slave/workspace/HBase-0.94-security/trunk/target/surefire/surefire8762283028157805787tmp
/home/hudson/jenkins-slave/workspace/HBase-0.94-security/trunk/target/surefire/surefire_981890351312137013438tmp
Running org.apache.hadoop.hbase.regionserver.TestRegionServerMetrics
Tests run: 4, Failures: 0, Errors: 0, Skipped: 0, Time elapsed: 96.904 sec
Forking command line: /bin/sh -c cd /home/hudson/jenkins-slave/workspace/HBase-0.94-security/trunk
&& /home/hudson/tools/java/jdk1.6.0_45-32/jre/bin/java -enableassertions -Xmx1900m
-Djava.security.egd=file:/dev/./urandom -jar /home/hudson/jenkins-slave/workspace/HBase-0.94-security/trunk/target/surefire/surefirebooter6735264761725083384.jar
/home/hudson/jenkins-slave/workspace/HBase-0.94-security/trunk/target/surefire/surefire8510868911805455579tmp
/home/hudson/jenkins-slave/workspace/HBase-0.94-security/trunk/target/surefire/surefire_99337123068052927297tmp
Running org.apache.hadoop.hbase.regionserver.TestAtomicOperation
Tests run: 5, Failures: 0, Errors: 0, Skipped: 0, Time elapsed: 16.242 sec
Forking command line: /bin/sh -c cd /home/hudson/jenkins-slave/workspace/HBase-0.94-security/trunk
&& /home/hudson/tools/java/jdk1.6.0_45-32/jre/bin/java -enableassertions -Xmx1900m
-Djava.security.egd=file:/dev/./urandom -jar /home/hudson/jenkins-slave/workspace/HBase-0.94-security/trunk/target/surefire/surefirebooter7453958132116147052.jar
/home/hudson/jenkins-slave/workspace/HBase-0.94-security/trunk/target/surefire/surefire6317511044361792316tmp
/home/hudson/jenkins-slave/workspace/HBase-0.94-security/trunk/target/surefire/surefire_1009121398037589561318tmp
Running org.apache.hadoop.hbase.regionserver.TestBlocksRead
Tests run: 4, Failures: 0, Errors: 0, Skipped: 0, Time elapsed: 1.015 sec
Forking command line: /bin/sh -c cd /home/hudson/jenkins-slave/workspace/HBase-0.94-security/trunk
&& /home/hudson/tools/java/jdk1.6.0_45-32/jre/bin/java -enableassertions -Xmx1900m
-Djava.security.egd=file:/dev/./urandom -jar /home/hudson/jenkins-slave/workspace/HBase-0.94-security/trunk/target/surefire/surefirebooter1002272792496901716.jar
/home/hudson/jenkins-slave/workspace/HBase-0.94-security/trunk/target/surefire/surefire6506704736077878104tmp
/home/hudson/jenkins-slave/workspace/HBase-0.94-security/trunk/target/surefire/surefire_1016598803572225103128tmp
Running org.apache.hadoop.hbase.regionserver.TestMasterAddressManager
Tests run: 1, Failures: 0, Errors: 0, Skipped: 0, Time elapsed: 0.929 sec
Forking command line: /bin/sh -c cd /home/hudson/jenkins-slave/workspace/HBase-0.94-security/trunk
&& /home/hudson/tools/java/jdk1.6.0_45-32/jre/bin/java -enableassertions -Xmx1900m
-Djava.security.egd=file:/dev/./urandom -jar /home/hudson/jenkins-slave/workspace/HBase-0.94-security/trunk/target/surefire/surefirebooter1231615350651831421.jar
/home/hudson/jenkins-slave/workspace/HBase-0.94-security/trunk/target/surefire/surefire8912654995111718634tmp
/home/hudson/jenkins-slave/workspace/HBase-0.94-security/trunk/target/surefire/surefire_1021842604803444207820tmp
Running org.apache.hadoop.hbase.regionserver.TestHRegionOnCluster
Tests run: 1, Failures: 0, Errors: 0, Skipped: 0, Time elapsed: 30.121 sec
Forking command line: /bin/sh -c cd /home/hudson/jenkins-slave/workspace/HBase-0.94-security/trunk
&& /home/hudson/tools/java/jdk1.6.0_45-32/jre/bin/java -enableassertions -Xmx1900m
-Djava.security.egd=file:/dev/./urandom -jar /home/hudson/jenkins-slave/workspace/HBase-0.94-security/trunk/target/surefire/surefirebooter6395319122435776119.jar
/home/hudson/jenkins-slave/workspace/HBase-0.94-security/trunk/target/surefire/surefire4441696637682473703tmp
/home/hudson/jenkins-slave/workspace/HBase-0.94-security/trunk/target/surefire/surefire_1036366888606081796403tmp
Running org.apache.hadoop.hbase.regionserver.wal.TestWALReplayCompressed
Tests run: 8, Failures: 0, Errors: 0, Skipped: 0, Time elapsed: 65.755 sec
Running org.apache.hadoop.hbase.regionserver.wal.TestWALReplay
Tests run: 8, Failures: 0, Errors: 0, Skipped: 0, Time elapsed: 61.48 sec
Forking command line: /bin/sh -c cd /home/hudson/jenkins-slave/workspace/HBase-0.94-security/trunk
&& /home/hudson/tools/java/jdk1.6.0_45-32/jre/bin/java -enableassertions -Xmx1900m
-Djava.security.egd=file:/dev/./urandom -jar /home/hudson/jenkins-slave/workspace/HBase-0.94-security/trunk/target/surefire/surefirebooter6777620689494583554.jar
/home/hudson/jenkins-slave/workspace/HBase-0.94-security/trunk/target/surefire/surefire8731887339360549788tmp
/home/hudson/jenkins-slave/workspace/HBase-0.94-security/trunk/target/surefire/surefire_1043962790406985507309tmp
Running org.apache.hadoop.hbase.regionserver.wal.TestDurability
Tests run: 1, Failures: 0, Errors: 0, Skipped: 0, Time elapsed: 5.3 sec
Forking command line: /bin/sh -c cd /home/hudson/jenkins-slave/workspace/HBase-0.94-security/trunk
&& /home/hudson/tools/java/jdk1.6.0_45-32/jre/bin/java -enableassertions -Xmx1900m
-Djava.security.egd=file:/dev/./urandom -jar /home/hudson/jenkins-slave/workspace/HBase-0.94-security/trunk/target/surefire/surefirebooter1684400422158117672.jar
/home/hudson/jenkins-slave/workspace/HBase-0.94-security/trunk/target/surefire/surefire7749947141605397034tmp
/home/hudson/jenkins-slave/workspace/HBase-0.94-security/trunk/target/surefire/surefire_1057241938602758322889tmp
Running org.apache.hadoop.hbase.regionserver.wal.TestLogRollingNoCluster
Tests run: 1, Failures: 0, Errors: 0, Skipped: 0, Time elapsed: 2.315 sec
Forking command line: /bin/sh -c cd /home/hudson/jenkins-slave/workspace/HBase-0.94-security/trunk
&& /home/hudson/tools/java/jdk1.6.0_45-32/jre/bin/java -enableassertions -Xmx1900m
-Djava.security.egd=file:/dev/./urandom -jar /home/hudson/jenkins-slave/workspace/HBase-0.94-security/trunk/target/surefire/surefirebooter4763309193834936471.jar
/home/hudson/jenkins-slave/workspace/HBase-0.94-security/trunk/target/surefire/surefire5463082468551884359tmp
/home/hudson/jenkins-slave/workspace/HBase-0.94-security/trunk/target/surefire/surefire_1063413210123707132001tmp
Forking command line: /bin/sh -c cd /home/hudson/jenkins-slave/workspace/HBase-0.94-security/trunk
&& /home/hudson/tools/java/jdk1.6.0_45-32/jre/bin/java -enableassertions -Xmx1900m
-Djava.security.egd=file:/dev/./urandom -jar /home/hudson/jenkins-slave/workspace/HBase-0.94-security/trunk/target/surefire/surefirebooter9050287181500406740.jar
/home/hudson/jenkins-slave/workspace/HBase-0.94-security/trunk/target/surefire/surefire4652286375726084365tmp
/home/hudson/jenkins-slave/workspace/HBase-0.94-security/trunk/target/surefire/surefire_1077481188062033627669tmp
Running org.apache.hadoop.hbase.regionserver.wal.TestHLogBench
Tests run: 1, Failures: 0, Errors: 0, Skipped: 0, Time elapsed: 1.374 sec
Forking command line: /bin/sh -c cd /home/hudson/jenkins-slave/workspace/HBase-0.94-security/trunk
&& /home/hudson/tools/java/jdk1.6.0_45-32/jre/bin/java -enableassertions -Xmx1900m
-Djava.security.egd=file:/dev/./urandom -jar /home/hudson/jenkins-slave/workspace/HBase-0.94-security/trunk/target/surefire/surefirebooter406880883085850886.jar
/home/hudson/jenkins-slave/workspace/HBase-0.94-security/trunk/target/surefire/surefire1230276941685576824tmp
/home/hudson/jenkins-slave/workspace/HBase-0.94-security/trunk/target/surefire/surefire_1081723755891527377234tmp
Running org.apache.hadoop.hbase.regionserver.wal.TestLogRollPeriod
Tests run: 2, Failures: 0, Errors: 0, Skipped: 0, Time elapsed: 71.082 sec
Forking command line: /bin/sh -c cd /home/hudson/jenkins-slave/workspace/HBase-0.94-security/trunk
&& /home/hudson/tools/java/jdk1.6.0_45-32/jre/bin/java -enableassertions -Xmx1900m
-Djava.security.egd=file:/dev/./urandom -jar /home/hudson/jenkins-slave/workspace/HBase-0.94-security/trunk/target/surefire/surefirebooter2400634736101908602.jar
/home/hudson/jenkins-slave/workspace/HBase-0.94-security/trunk/target/surefire/surefire3011860052291420410tmp
/home/hudson/jenkins-slave/workspace/HBase-0.94-security/trunk/target/surefire/surefire_1094455185880038074379tmp
Running org.apache.hadoop.hbase.regionserver.TestMXBean
Tests run: 1, Failures: 0, Errors: 0, Skipped: 0, Time elapsed: 13.32 sec
Forking command line: /bin/sh -c cd /home/hudson/jenkins-slave/workspace/HBase-0.94-security/trunk
&& /home/hudson/tools/java/jdk1.6.0_45-32/jre/bin/java -enableassertions -Xmx1900m
-Djava.security.egd=file:/dev/./urandom -jar /home/hudson/jenkins-slave/workspace/HBase-0.94-security/trunk/target/surefire/surefirebooter7316876762163194683.jar
/home/hudson/jenkins-slave/workspace/HBase-0.94-security/trunk/target/surefire/surefire7224849180051154140tmp
/home/hudson/jenkins-slave/workspace/HBase-0.94-security/trunk/target/surefire/surefire_1101011009656176691978tmp
Running org.apache.hadoop.hbase.regionserver.metrics.TestSchemaMetrics
Tests run: 6, Failures: 0, Errors: 0, Skipped: 0, Time elapsed: 14.736 sec
Forking command line: /bin/sh -c cd /home/hudson/jenkins-slave/workspace/HBase-0.94-security/trunk
&& /home/hudson/tools/java/jdk1.6.0_45-32/jre/bin/java -enableassertions -Xmx1900m
-Djava.security.egd=file:/dev/./urandom -jar /home/hudson/jenkins-slave/workspace/HBase-0.94-security/trunk/target/surefire/surefirebooter599229278348975119.jar
/home/hudson/jenkins-slave/workspace/HBase-0.94-security/trunk/target/surefire/surefire1902107958830663358tmp
/home/hudson/jenkins-slave/workspace/HBase-0.94-security/trunk/target/surefire/surefire_1112837301557193488566tmp
Running org.apache.hadoop.hbase.regionserver.TestRpcMetrics
Tests run: 1, Failures: 0, Errors: 0, Skipped: 0, Time elapsed: 1.453 sec
Forking command line: /bin/sh -c cd /home/hudson/jenkins-slave/workspace/HBase-0.94-security/trunk
&& /home/hudson/tools/java/jdk1.6.0_45-32/jre/bin/java -enableassertions -Xmx1900m
-Djava.security.egd=file:/dev/./urandom -jar /home/hudson/jenkins-slave/workspace/HBase-0.94-security/trunk/target/surefire/surefirebooter1373333807199111268.jar
/home/hudson/jenkins-slave/workspace/HBase-0.94-security/trunk/target/surefire/surefire6015005690468131495tmp
/home/hudson/jenkins-slave/workspace/HBase-0.94-security/trunk/target/surefire/surefire_1126175894553147494049tmp
Running org.apache.hadoop.hbase.regionserver.TestStoreScanner
Tests run: 16, Failures: 0, Errors: 0, Skipped: 0, Time elapsed: 0.048 sec
Forking command line: /bin/sh -c cd /home/hudson/jenkins-slave/workspace/HBase-0.94-security/trunk
&& /home/hudson/tools/java/jdk1.6.0_45-32/jre/bin/java -enableassertions -Xmx1900m
-Djava.security.egd=file:/dev/./urandom -jar /home/hudson/jenkins-slave/workspace/HBase-0.94-security/trunk/target/surefire/surefirebooter371877207742843165.jar
/home/hudson/jenkins-slave/workspace/HBase-0.94-security/trunk/target/surefire/surefire2770045161829693349tmp
/home/hudson/jenkins-slave/workspace/HBase-0.94-security/trunk/target/surefire/surefire_1134444211893488376019tmp
Running org.apache.hadoop.hbase.regionserver.TestCacheOnWriteInSchema
Tests run: 3, Failures: 0, Errors: 0, Skipped: 0, Time elapsed: 1.514 sec
Forking command line: /bin/sh -c cd /home/hudson/jenkins-slave/workspace/HBase-0.94-security/trunk
&& /home/hudson/tools/java/jdk1.6.0_45-32/jre/bin/java -enableassertions -Xmx1900m
-Djava.security.egd=file:/dev/./urandom -jar /home/hudson/jenkins-slave/workspace/HBase-0.94-security/trunk/target/surefire/surefirebooter1220646671896685408.jar
/home/hudson/jenkins-slave/workspace/HBase-0.94-security/trunk/target/surefire/surefire4246760415745634300tmp
/home/hudson/jenkins-slave/workspace/HBase-0.94-security/trunk/target/surefire/surefire_1146622727722080977709tmp
Running org.apache.hadoop.hbase.regionserver.wal.TestLogRollAbort
Tests run: 1, Failures: 0, Errors: 0, Skipped: 0, Time elapsed: 152.232 sec
Forking command line: /bin/sh -c cd /home/hudson/jenkins-slave/workspace/HBase-0.94-security/trunk
&& /home/hudson/tools/java/jdk1.6.0_45-32/jre/bin/java -enableassertions -Xmx1900m
-Djava.security.egd=file:/dev/./urandom -jar /home/hudson/jenkins-slave/workspace/HBase-0.94-security/trunk/target/surefire/surefirebooter5274943396708876758.jar
/home/hudson/jenkins-slave/workspace/HBase-0.94-security/trunk/target/surefire/surefire2257224016774603009tmp
/home/hudson/jenkins-slave/workspace/HBase-0.94-security/trunk/target/surefire/surefire_1158531445239547217267tmp
Running org.apache.hadoop.hbase.regionserver.TestSeekOptimizations
Tests run: 6, Failures: 0, Errors: 0, Skipped: 0, Time elapsed: 3.176 sec
Forking command line: /bin/sh -c cd /home/hudson/jenkins-slave/workspace/HBase-0.94-security/trunk
&& /home/hudson/tools/java/jdk1.6.0_45-32/jre/bin/java -enableassertions -Xmx1900m
-Djava.security.egd=file:/dev/./urandom -jar /home/hudson/jenkins-slave/workspace/HBase-0.94-security/trunk/target/surefire/surefirebooter5702276267443512655.jar
/home/hudson/jenkins-slave/workspace/HBase-0.94-security/trunk/target/surefire/surefire629112841615294932tmp
/home/hudson/jenkins-slave/workspace/HBase-0.94-security/trunk/target/surefire/surefire_1168845389739674827311tmp
Running org.apache.hadoop.hbase.regionserver.TestHRegionBusyWait
Tests run: 75, Failures: 0, Errors: 0, Skipped: 0, Time elapsed: 57.908 sec
Forking command line: /bin/sh -c cd /home/hudson/jenkins-slave/workspace/HBase-0.94-security/trunk
&& /home/hudson/tools/java/jdk1.6.0_45-32/jre/bin/java -enableassertions -Xmx1900m
-Djava.security.egd=file:/dev/./urandom -jar /home/hudson/jenkins-slave/workspace/HBase-0.94-security/trunk/target/surefire/surefirebooter2044060170850137808.jar
/home/hudson/jenkins-slave/workspace/HBase-0.94-security/trunk/target/surefire/surefire4503052589063465773tmp
/home/hudson/jenkins-slave/workspace/HBase-0.94-security/trunk/target/surefire/surefire_1177428213452605745862tmp
Running org.apache.hadoop.hbase.regionserver.TestSplitLogWorker
Tests run: 5, Failures: 0, Errors: 0, Skipped: 0, Time elapsed: 17.118 sec
Forking command line: /bin/sh -c cd /home/hudson/jenkins-slave/workspace/HBase-0.94-security/trunk
&& /home/hudson/tools/java/jdk1.6.0_45-32/jre/bin/java -enableassertions -Xmx1900m
-Djava.security.egd=file:/dev/./urandom -jar /home/hudson/jenkins-slave/workspace/HBase-0.94-security/trunk/target/surefire/surefirebooter526527348867311224.jar
/home/hudson/jenkins-slave/workspace/HBase-0.94-security/trunk/target/surefire/surefire5320752146261800426tmp
/home/hudson/jenkins-slave/workspace/HBase-0.94-security/trunk/target/surefire/surefire_1181032846326624807210tmp
Running org.apache.hadoop.hbase.regionserver.TestFSErrorsExposed
Tests run: 3, Failures: 0, Errors: 0, Skipped: 0, Time elapsed: 32.923 sec
Forking command line: /bin/sh -c cd /home/hudson/jenkins-slave/workspace/HBase-0.94-security/trunk
&& /home/hudson/tools/java/jdk1.6.0_45-32/jre/bin/java -enableassertions -Xmx1900m
-Djava.security.egd=file:/dev/./urandom -jar /home/hudson/jenkins-slave/workspace/HBase-0.94-security/trunk/target/surefire/surefirebooter8706580696958017391.jar
/home/hudson/jenkins-slave/workspace/HBase-0.94-security/trunk/target/surefire/surefire721280939767144260tmp
/home/hudson/jenkins-slave/workspace/HBase-0.94-security/trunk/target/surefire/surefire_1195863693443872020188tmp
Running org.apache.hadoop.hbase.regionserver.TestMultiColumnScanner
Tests run: 12, Failures: 0, Errors: 0, Skipped: 0, Time elapsed: 40.962 sec
Forking command line: /bin/sh -c cd /home/hudson/jenkins-slave/workspace/HBase-0.94-security/trunk
&& /home/hudson/tools/java/jdk1.6.0_45-32/jre/bin/java -enableassertions -Xmx1900m
-Djava.security.egd=file:/dev/./urandom -jar /home/hudson/jenkins-slave/workspace/HBase-0.94-security/trunk/target/surefire/surefirebooter6230993555402134938.jar
/home/hudson/jenkins-slave/workspace/HBase-0.94-security/trunk/target/surefire/surefire1861497115378430402tmp
/home/hudson/jenkins-slave/workspace/HBase-0.94-security/trunk/target/surefire/surefire_1206297623800792994976tmp
Running org.apache.hadoop.hbase.regionserver.TestHRegion
Tests run: 74, Failures: 0, Errors: 0, Skipped: 0, Time elapsed: 60.218 sec
Forking command line: /bin/sh -c cd /home/hudson/jenkins-slave/workspace/HBase-0.94-security/trunk
&& /home/hudson/tools/java/jdk1.6.0_45-32/jre/bin/java -enableassertions -Xmx1900m
-Djava.security.egd=file:/dev/./urandom -jar /home/hudson/jenkins-slave/workspace/HBase-0.94-security/trunk/target/surefire/surefirebooter1076344424255108658.jar
/home/hudson/jenkins-slave/workspace/HBase-0.94-security/trunk/target/surefire/surefire5373688737517989555tmp
/home/hudson/jenkins-slave/workspace/HBase-0.94-security/trunk/target/surefire/surefire_1214749498344767136928tmp
Running org.apache.hadoop.hbase.client.replication.TestReplicationAdmin
Tests run: 1, Failures: 0, Errors: 0, Skipped: 0, Time elapsed: 0.953 sec
Forking command line: /bin/sh -c cd /home/hudson/jenkins-slave/workspace/HBase-0.94-security/trunk
&& /home/hudson/tools/java/jdk1.6.0_45-32/jre/bin/java -enableassertions -Xmx1900m
-Djava.security.egd=file:/dev/./urandom -jar /home/hudson/jenkins-slave/workspace/HBase-0.94-security/trunk/target/surefire/surefirebooter598868923943783777.jar
/home/hudson/jenkins-slave/workspace/HBase-0.94-security/trunk/target/surefire/surefire4225249846368846262tmp
/home/hudson/jenkins-slave/workspace/HBase-0.94-security/trunk/target/surefire/surefire_1228174073545841539022tmp
Running org.apache.hadoop.hbase.client.TestHConnection
Tests run: 2, Failures: 0, Errors: 0, Skipped: 0, Time elapsed: 43.554 sec
Forking command line: /bin/sh -c cd /home/hudson/jenkins-slave/workspace/HBase-0.94-security/trunk
&& /home/hudson/tools/java/jdk1.6.0_45-32/jre/bin/java -enableassertions -Xmx1900m
-Djava.security.egd=file:/dev/./urandom -jar /home/hudson/jenkins-slave/workspace/HBase-0.94-security/trunk/target/surefire/surefirebooter1261028342166387882.jar
/home/hudson/jenkins-slave/workspace/HBase-0.94-security/trunk/target/surefire/surefire3923382836273118812tmp
/home/hudson/jenkins-slave/workspace/HBase-0.94-security/trunk/target/surefire/surefire_1235020942055989202401tmp
Running org.apache.hadoop.hbase.client.TestTimestampsFilter
Tests run: 3, Failures: 0, Errors: 0, Skipped: 0, Time elapsed: 24.648 sec
Forking command line: /bin/sh -c cd /home/hudson/jenkins-slave/workspace/HBase-0.94-security/trunk
&& /home/hudson/tools/java/jdk1.6.0_45-32/jre/bin/java -enableassertions -Xmx1900m
-Djava.security.egd=file:/dev/./urandom -jar /home/hudson/jenkins-slave/workspace/HBase-0.94-security/trunk/target/surefire/surefirebooter6310576724909925427.jar
/home/hudson/jenkins-slave/workspace/HBase-0.94-security/trunk/target/surefire/surefire8345540316489839154tmp
/home/hudson/jenkins-slave/workspace/HBase-0.94-security/trunk/target/surefire/surefire_124717608518388744652tmp
Running org.apache.hadoop.hbase.client.TestHCM
Tests run: 9, Failures: 0, Errors: 0, Skipped: 0, Time elapsed: 31.869 sec
Forking command line: /bin/sh -c cd /home/hudson/jenkins-slave/workspace/HBase-0.94-security/trunk
&& /home/hudson/tools/java/jdk1.6.0_45-32/jre/bin/java -enableassertions -Xmx1900m
-Djava.security.egd=file:/dev/./urandom -jar /home/hudson/jenkins-slave/workspace/HBase-0.94-security/trunk/target/surefire/surefirebooter3566622946403461725.jar
/home/hudson/jenkins-slave/workspace/HBase-0.94-security/trunk/target/surefire/surefire5424093877076065679tmp
/home/hudson/jenkins-slave/workspace/HBase-0.94-security/trunk/target/surefire/surefire_1256097225375980487204tmp
Running org.apache.hadoop.hbase.client.TestHTablePool$TestHTableReusablePool
Tests run: 8, Failures: 0, Errors: 0, Skipped: 0, Time elapsed: 5.308 sec
Running org.apache.hadoop.hbase.client.TestHTablePool$TestHTableThreadLocalPool
Tests run: 8, Failures: 0, Errors: 0, Skipped: 0, Time elapsed: 38.661 sec
Forking command line: /bin/sh -c cd /home/hudson/jenkins-slave/workspace/HBase-0.94-security/trunk
&& /home/hudson/tools/java/jdk1.6.0_45-32/jre/bin/java -enableassertions -Xmx1900m
-Djava.security.egd=file:/dev/./urandom -jar /home/hudson/jenkins-slave/workspace/HBase-0.94-security/trunk/target/surefire/surefirebooter706533496242125335.jar
/home/hudson/jenkins-slave/workspace/HBase-0.94-security/trunk/target/surefire/surefire4846808443876989096tmp
/home/hudson/jenkins-slave/workspace/HBase-0.94-security/trunk/target/surefire/surefire_1264662265864510650257tmp
Running org.apache.hadoop.hbase.client.TestHTableUtil
Tests run: 2, Failures: 0, Errors: 0, Skipped: 0, Time elapsed: 18.709 sec
Forking command line: /bin/sh -c cd /home/hudson/jenkins-slave/workspace/HBase-0.94-security/trunk
&& /home/hudson/tools/java/jdk1.6.0_45-32/jre/bin/java -enableassertions -Xmx1900m
-Djava.security.egd=file:/dev/./urandom -jar /home/hudson/jenkins-slave/workspace/HBase-0.94-security/trunk/target/surefire/surefirebooter7751857320274041768.jar
/home/hudson/jenkins-slave/workspace/HBase-0.94-security/trunk/target/surefire/surefire1475470784351069615tmp
/home/hudson/jenkins-slave/workspace/HBase-0.94-security/trunk/target/surefire/surefire_1271955578605035003564tmp
Running org.apache.hadoop.hbase.client.TestCoprocessorHConnection
Tests run: 2, Failures: 0, Errors: 0, Skipped: 0, Time elapsed: 20.365 sec
Forking command line: /bin/sh -c cd /home/hudson/jenkins-slave/workspace/HBase-0.94-security/trunk
&& /home/hudson/tools/java/jdk1.6.0_45-32/jre/bin/java -enableassertions -Xmx1900m
-Djava.security.egd=file:/dev/./urandom -jar /home/hudson/jenkins-slave/workspace/HBase-0.94-security/trunk/target/surefire/surefirebooter4279094029109820059.jar
/home/hudson/jenkins-slave/workspace/HBase-0.94-security/trunk/target/surefire/surefire1395424093706141246tmp
/home/hudson/jenkins-slave/workspace/HBase-0.94-security/trunk/target/surefire/surefire_1285313409564520908622tmp
Running org.apache.hadoop.hbase.client.TestMetaMigrationRemovingHTD
Tests run: 3, Failures: 0, Errors: 0, Skipped: 0, Time elapsed: 27.316 sec
Forking command line: /bin/sh -c cd /home/hudson/jenkins-slave/workspace/HBase-0.94-security/trunk
&& /home/hudson/tools/java/jdk1.6.0_45-32/jre/bin/java -enableassertions -Xmx1900m
-Djava.security.egd=file:/dev/./urandom -jar /home/hudson/jenkins-slave/workspace/HBase-0.94-security/trunk/target/surefire/surefirebooter5112597399854457904.jar
/home/hudson/jenkins-slave/workspace/HBase-0.94-security/trunk/target/surefire/surefire6688292660449549005tmp
/home/hudson/jenkins-slave/workspace/HBase-0.94-security/trunk/target/surefire/surefire_129738140333598997283tmp
Running org.apache.hadoop.hbase.client.TestMetaScanner
Tests run: 2, Failures: 0, Errors: 0, Skipped: 0, Time elapsed: 64.724 sec
Forking command line: /bin/sh -c cd /home/hudson/jenkins-slave/workspace/HBase-0.94-security/trunk
&& /home/hudson/tools/java/jdk1.6.0_45-32/jre/bin/java -enableassertions -Xmx1900m
-Djava.security.egd=file:/dev/./urandom -jar /home/hudson/jenkins-slave/workspace/HBase-0.94-security/trunk/target/surefire/surefirebooter7192427075213151523.jar
/home/hudson/jenkins-slave/workspace/HBase-0.94-security/trunk/target/surefire/surefire5504491321877163934tmp
/home/hudson/jenkins-slave/workspace/HBase-0.94-security/trunk/target/surefire/surefire_1301234962625539080134tmp
Running org.apache.hadoop.hbase.TestMultiVersions
Tests run: 3, Failures: 0, Errors: 0, Skipped: 0, Time elapsed: 27.917 sec
Forking command line: /bin/sh -c cd /home/hudson/jenkins-slave/workspace/HBase-0.94-security/trunk
&& /home/hudson/tools/java/jdk1.6.0_45-32/jre/bin/java -enableassertions -Xmx1900m
-Djava.security.egd=file:/dev/./urandom -jar /home/hudson/jenkins-slave/workspace/HBase-0.94-security/trunk/target/surefire/surefirebooter2372563656487581529.jar
/home/hudson/jenkins-slave/workspace/HBase-0.94-security/trunk/target/surefire/surefire2207962111973750633tmp
/home/hudson/jenkins-slave/workspace/HBase-0.94-security/trunk/target/surefire/surefire_1313635119396313555291tmp
Running org.apache.hadoop.hbase.client.TestMultiParallel
Tests run: 11, Failures: 0, Errors: 0, Skipped: 0, Time elapsed: 63.672 sec
Forking command line: /bin/sh -c cd /home/hudson/jenkins-slave/workspace/HBase-0.94-security/trunk
&& /home/hudson/tools/java/jdk1.6.0_45-32/jre/bin/java -enableassertions -Xmx1900m
-Djava.security.egd=file:/dev/./urandom -jar /home/hudson/jenkins-slave/workspace/HBase-0.94-security/trunk/target/surefire/surefirebooter7991742476707829026.jar
/home/hudson/jenkins-slave/workspace/HBase-0.94-security/trunk/target/surefire/surefire7950566274710604874tmp
/home/hudson/jenkins-slave/workspace/HBase-0.94-security/trunk/target/surefire/surefire_1325921472191937799039tmp
Running org.apache.hadoop.hbase.master.TestActiveMasterManager
Tests run: 2, Failures: 0, Errors: 0, Skipped: 0, Time elapsed: 1.261 sec
Forking command line: /bin/sh -c cd /home/hudson/jenkins-slave/workspace/HBase-0.94-security/trunk
&& /home/hudson/tools/java/jdk1.6.0_45-32/jre/bin/java -enableassertions -Xmx1900m
-Djava.security.egd=file:/dev/./urandom -jar /home/hudson/jenkins-slave/workspace/HBase-0.94-security/trunk/target/surefire/surefirebooter6712600677959053098.jar
/home/hudson/jenkins-slave/workspace/HBase-0.94-security/trunk/target/surefire/surefire779154242186096410tmp
/home/hudson/jenkins-slave/workspace/HBase-0.94-security/trunk/target/surefire/surefire_1338556148342145809564tmp
Running org.apache.hadoop.hbase.master.TestDeadServer
Tests run: 1, Failures: 0, Errors: 0, Skipped: 0, Time elapsed: 0.202 sec
Forking command line: /bin/sh -c cd /home/hudson/jenkins-slave/workspace/HBase-0.94-security/trunk
&& /home/hudson/tools/java/jdk1.6.0_45-32/jre/bin/java -enableassertions -Xmx1900m
-Djava.security.egd=file:/dev/./urandom -jar /home/hudson/jenkins-slave/workspace/HBase-0.94-security/trunk/target/surefire/surefirebooter2646074788548164689.jar
/home/hudson/jenkins-slave/workspace/HBase-0.94-security/trunk/target/surefire/surefire8889316534773871862tmp
/home/hudson/jenkins-slave/workspace/HBase-0.94-security/trunk/target/surefire/surefire_134744615016821783084tmp
Running org.apache.hadoop.hbase.master.TestZKBasedOpenCloseRegion
Tests run: 4, Failures: 0, Errors: 0, Skipped: 0, Time elapsed: 26.911 sec
Forking command line: /bin/sh -c cd /home/hudson/jenkins-slave/workspace/HBase-0.94-security/trunk
&& /home/hudson/tools/java/jdk1.6.0_45-32/jre/bin/java -enableassertions -Xmx1900m
-Djava.security.egd=file:/dev/./urandom -jar /home/hudson/jenkins-slave/workspace/HBase-0.94-security/trunk/target/surefire/surefirebooter6194372116919174899.jar
/home/hudson/jenkins-slave/workspace/HBase-0.94-security/trunk/target/surefire/surefire6789674833859699689tmp
/home/hudson/jenkins-slave/workspace/HBase-0.94-security/trunk/target/surefire/surefire_1357214009167536652545tmp
Running org.apache.hadoop.hbase.thrift.TestThriftServer
Tests run: 1, Failures: 0, Errors: 0, Skipped: 0, Time elapsed: 48.465 sec
Forking command line: /bin/sh -c cd /home/hudson/jenkins-slave/workspace/HBase-0.94-security/trunk
&& /home/hudson/tools/java/jdk1.6.0_45-32/jre/bin/java -enableassertions -Xmx1900m
-Djava.security.egd=file:/dev/./urandom -jar /home/hudson/jenkins-slave/workspace/HBase-0.94-security/trunk/target/surefire/surefirebooter9147754740409013400.jar
/home/hudson/jenkins-slave/workspace/HBase-0.94-security/trunk/target/surefire/surefire8724292094030778584tmp
/home/hudson/jenkins-slave/workspace/HBase-0.94-security/trunk/target/surefire/surefire_1362804429055327290020tmp
Running org.apache.hadoop.hbase.master.TestMasterFileSystem
Tests run: 1, Failures: 0, Errors: 0, Skipped: 0, Time elapsed: 15.938 sec
Forking command line: /bin/sh -c cd /home/hudson/jenkins-slave/workspace/HBase-0.94-security/trunk
&& /home/hudson/tools/java/jdk1.6.0_45-32/jre/bin/java -enableassertions -Xmx1900m
-Djava.security.egd=file:/dev/./urandom -jar /home/hudson/jenkins-slave/workspace/HBase-0.94-security/trunk/target/surefire/surefirebooter737299883238497000.jar
/home/hudson/jenkins-slave/workspace/HBase-0.94-security/trunk/target/surefire/surefire4648399705540810635tmp
/home/hudson/jenkins-slave/workspace/HBase-0.94-security/trunk/target/surefire/surefire_1372666860921963297426tmp
Running org.apache.hadoop.hbase.master.TestMaster
Tests run: 2, Failures: 0, Errors: 0, Skipped: 0, Time elapsed: 18.793 sec
Forking command line: /bin/sh -c cd /home/hudson/jenkins-slave/workspace/HBase-0.94-security/trunk
&& /home/hudson/tools/java/jdk1.6.0_45-32/jre/bin/java -enableassertions -Xmx1900m
-Djava.security.egd=file:/dev/./urandom -jar /home/hudson/jenkins-slave/workspace/HBase-0.94-security/trunk/target/surefire/surefirebooter4288643777823431420.jar
/home/hudson/jenkins-slave/workspace/HBase-0.94-security/trunk/target/surefire/surefire314376989819938547tmp
/home/hudson/jenkins-slave/workspace/HBase-0.94-security/trunk/target/surefire/surefire_1383199655540393641044tmp
Running org.apache.hadoop.hbase.master.handler.TestCreateTableHandler
Tests run: 3, Failures: 0, Errors: 0, Skipped: 0, Time elapsed: 43.611 sec
Forking command line: /bin/sh -c cd /home/hudson/jenkins-slave/workspace/HBase-0.94-security/trunk
&& /home/hudson/tools/java/jdk1.6.0_45-32/jre/bin/java -enableassertions -Xmx1900m
-Djava.security.egd=file:/dev/./urandom -jar /home/hudson/jenkins-slave/workspace/HBase-0.94-security/trunk/target/surefire/surefirebooter2626171948790524581.jar
/home/hudson/jenkins-slave/workspace/HBase-0.94-security/trunk/target/surefire/surefire3264271442920755157tmp
/home/hudson/jenkins-slave/workspace/HBase-0.94-security/trunk/target/surefire/surefire_1394180011275612366395tmp
Running org.apache.hadoop.hbase.master.TestClockSkewDetection
Tests run: 1, Failures: 0, Errors: 0, Skipped: 0, Time elapsed: 0.293 sec
Forking command line: /bin/sh -c cd /home/hudson/jenkins-slave/workspace/HBase-0.94-security/trunk
&& /home/hudson/tools/java/jdk1.6.0_45-32/jre/bin/java -enableassertions -Xmx1900m
-Djava.security.egd=file:/dev/./urandom -jar /home/hudson/jenkins-slave/workspace/HBase-0.94-security/trunk/target/surefire/surefirebooter1335674043235412190.jar
/home/hudson/jenkins-slave/workspace/HBase-0.94-security/trunk/target/surefire/surefire8204541954752924474tmp
/home/hudson/jenkins-slave/workspace/HBase-0.94-security/trunk/target/surefire/surefire_1404706839031864565892tmp
Running org.apache.hadoop.hbase.master.snapshot.TestSnapshotFileCache
Tests run: 4, Failures: 0, Errors: 0, Skipped: 0, Time elapsed: 5.743 sec
Running org.apache.hadoop.hbase.master.TestOpenedRegionHandler
Tests run: 2, Failures: 0, Errors: 0, Skipped: 0, Time elapsed: 17.904 sec
Forking command line: /bin/sh -c cd /home/hudson/jenkins-slave/workspace/HBase-0.94-security/trunk
&& /home/hudson/tools/java/jdk1.6.0_45-32/jre/bin/java -enableassertions -Xmx1900m
-Djava.security.egd=file:/dev/./urandom -jar /home/hudson/jenkins-slave/workspace/HBase-0.94-security/trunk/target/surefire/surefirebooter475677034892727859.jar
/home/hudson/jenkins-slave/workspace/HBase-0.94-security/trunk/target/surefire/surefire3414588667597737767tmp
/home/hudson/jenkins-slave/workspace/HBase-0.94-security/trunk/target/surefire/surefire_1413807335312349434252tmp
Forking command line: /bin/sh -c cd /home/hudson/jenkins-slave/workspace/HBase-0.94-security/trunk
&& /home/hudson/tools/java/jdk1.6.0_45-32/jre/bin/java -enableassertions -Xmx1900m
-Djava.security.egd=file:/dev/./urandom -jar /home/hudson/jenkins-slave/workspace/HBase-0.94-security/trunk/target/surefire/surefirebooter4459969400720117820.jar
/home/hudson/jenkins-slave/workspace/HBase-0.94-security/trunk/target/surefire/surefire2167396041856833507tmp
/home/hudson/jenkins-slave/workspace/HBase-0.94-security/trunk/target/surefire/surefire_1421354526093588846889tmp
Running org.apache.hadoop.hbase.master.TestSplitLogManager
Tests run: 13, Failures: 0, Errors: 0, Skipped: 0, Time elapsed: 84.826 sec
Forking command line: /bin/sh -c cd /home/hudson/jenkins-slave/workspace/HBase-0.94-security/trunk
&& /home/hudson/tools/java/jdk1.6.0_45-32/jre/bin/java -enableassertions -Xmx1900m
-Djava.security.egd=file:/dev/./urandom -jar /home/hudson/jenkins-slave/workspace/HBase-0.94-security/trunk/target/surefire/surefirebooter5597557394357540098.jar
/home/hudson/jenkins-slave/workspace/HBase-0.94-security/trunk/target/surefire/surefire1689723866054301340tmp
/home/hudson/jenkins-slave/workspace/HBase-0.94-security/trunk/target/surefire/surefire_1432174606173394631019tmp
Running org.apache.hadoop.hbase.master.metrics.TestMasterStatistics
Tests run: 2, Failures: 0, Errors: 0, Skipped: 0, Time elapsed: 1.168 sec
Forking command line: /bin/sh -c cd /home/hudson/jenkins-slave/workspace/HBase-0.94-security/trunk
&& /home/hudson/tools/java/jdk1.6.0_45-32/jre/bin/java -enableassertions -Xmx1900m
-Djava.security.egd=file:/dev/./urandom -jar /home/hudson/jenkins-slave/workspace/HBase-0.94-security/trunk/target/surefire/surefirebooter6092981829887332562.jar
/home/hudson/jenkins-slave/workspace/HBase-0.94-security/trunk/target/surefire/surefire3263698135896069749tmp
/home/hudson/jenkins-slave/workspace/HBase-0.94-security/trunk/target/surefire/surefire_14463518908784849836tmp
Running org.apache.hadoop.hbase.master.TestAssignmentManager
Tests run: 15, Failures: 0, Errors: 0, Skipped: 0, Time elapsed: 4.21 sec
Forking command line: /bin/sh -c cd /home/hudson/jenkins-slave/workspace/HBase-0.94-security/trunk
&& /home/hudson/tools/java/jdk1.6.0_45-32/jre/bin/java -enableassertions -Xmx1900m
-Djava.security.egd=file:/dev/./urandom -jar /home/hudson/jenkins-slave/workspace/HBase-0.94-security/trunk/target/surefire/surefirebooter6881807269895000712.jar
/home/hudson/jenkins-slave/workspace/HBase-0.94-security/trunk/target/surefire/surefire5431386339046509568tmp
/home/hudson/jenkins-slave/workspace/HBase-0.94-security/trunk/target/surefire/surefire_1457597890121097752081tmp
Running org.apache.hadoop.hbase.master.TestDefaultLoadBalancer
Tests run: 4, Failures: 0, Errors: 0, Skipped: 0, Time elapsed: 1.434 sec
Forking command line: /bin/sh -c cd /home/hudson/jenkins-slave/workspace/HBase-0.94-security/trunk
&& /home/hudson/tools/java/jdk1.6.0_45-32/jre/bin/java -enableassertions -Xmx1900m
-Djava.security.egd=file:/dev/./urandom -jar /home/hudson/jenkins-slave/workspace/HBase-0.94-security/trunk/target/surefire/surefirebooter7565654833659342997.jar
/home/hudson/jenkins-slave/workspace/HBase-0.94-security/trunk/target/surefire/surefire7580162224161006814tmp
/home/hudson/jenkins-slave/workspace/HBase-0.94-security/trunk/target/surefire/surefire_1465966549371274816384tmp
Running org.apache.hadoop.hbase.master.TestMasterStatusServlet
Tests run: 5, Failures: 0, Errors: 0, Skipped: 0, Time elapsed: 1.018 sec
Forking command line: /bin/sh -c cd /home/hudson/jenkins-slave/workspace/HBase-0.94-security/trunk
&& /home/hudson/tools/java/jdk1.6.0_45-32/jre/bin/java -enableassertions -Xmx1900m
-Djava.security.egd=file:/dev/./urandom -jar /home/hudson/jenkins-slave/workspace/HBase-0.94-security/trunk/target/surefire/surefirebooter5380101957229177813.jar
/home/hudson/jenkins-slave/workspace/HBase-0.94-security/trunk/target/surefire/surefire6916921165989232240tmp
/home/hudson/jenkins-slave/workspace/HBase-0.94-security/trunk/target/surefire/surefire_1473747255431725337754tmp
Running org.apache.hadoop.hbase.master.TestHMasterRPCException
Tests run: 1, Failures: 0, Errors: 0, Skipped: 0, Time elapsed: 1.588 sec
Forking command line: /bin/sh -c cd /home/hudson/jenkins-slave/workspace/HBase-0.94-security/trunk
&& /home/hudson/tools/java/jdk1.6.0_45-32/jre/bin/java -enableassertions -Xmx1900m
-Djava.security.egd=file:/dev/./urandom -jar /home/hudson/jenkins-slave/workspace/HBase-0.94-security/trunk/target/surefire/surefirebooter4595052535190451698.jar
/home/hudson/jenkins-slave/workspace/HBase-0.94-security/trunk/target/surefire/surefire5262546857309633567tmp
/home/hudson/jenkins-slave/workspace/HBase-0.94-security/trunk/target/surefire/surefire_1484840457113659000285tmp
Running org.apache.hadoop.hbase.master.TestMasterZKSessionRecovery
Tests run: 2, Failures: 0, Errors: 0, Skipped: 0, Time elapsed: 38.088 sec
Forking command line: /bin/sh -c cd /home/hudson/jenkins-slave/workspace/HBase-0.94-security/trunk
&& /home/hudson/tools/java/jdk1.6.0_45-32/jre/bin/java -enableassertions -Xmx1900m
-Djava.security.egd=file:/dev/./urandom -jar /home/hudson/jenkins-slave/workspace/HBase-0.94-security/trunk/target/surefire/surefirebooter5228454479785286719.jar
/home/hudson/jenkins-slave/workspace/HBase-0.94-security/trunk/target/surefire/surefire6533165569399762015tmp
/home/hudson/jenkins-slave/workspace/HBase-0.94-security/trunk/target/surefire/surefire_1492479102565002278959tmp
Running org.apache.hadoop.hbase.master.cleaner.TestHFileCleaner
Tests run: 3, Failures: 0, Errors: 0, Skipped: 0, Time elapsed: 8.252 sec
Forking command line: /bin/sh -c cd /home/hudson/jenkins-slave/workspace/HBase-0.94-security/trunk
&& /home/hudson/tools/java/jdk1.6.0_45-32/jre/bin/java -enableassertions -Xmx1900m
-Djava.security.egd=file:/dev/./urandom -jar /home/hudson/jenkins-slave/workspace/HBase-0.94-security/trunk/target/surefire/surefirebooter3036927378389634383.jar
/home/hudson/jenkins-slave/workspace/HBase-0.94-security/trunk/target/surefire/surefire3024842496316016461tmp
/home/hudson/jenkins-slave/workspace/HBase-0.94-security/trunk/target/surefire/surefire_1502971969002467341321tmp
Running org.apache.hadoop.hbase.master.cleaner.TestLogsCleaner
Tests run: 1, Failures: 0, Errors: 0, Skipped: 0, Time elapsed: 3.194 sec
Forking command line: /bin/sh -c cd /home/hudson/jenkins-slave/workspace/HBase-0.94-security/trunk
&& /home/hudson/tools/java/jdk1.6.0_45-32/jre/bin/java -enableassertions -Xmx1900m
-Djava.security.egd=file:/dev/./urandom -jar /home/hudson/jenkins-slave/workspace/HBase-0.94-security/trunk/target/surefire/surefirebooter2586069586251402159.jar
/home/hudson/jenkins-slave/workspace/HBase-0.94-security/trunk/target/surefire/surefire5391019576882434232tmp
/home/hudson/jenkins-slave/workspace/HBase-0.94-security/trunk/target/surefire/surefire_1517227012747585531239tmp
Running org.apache.hadoop.hbase.master.cleaner.TestSnapshotFromMaster
Tests run: 4, Failures: 0, Errors: 0, Skipped: 0, Time elapsed: 35.675 sec
Forking command line: /bin/sh -c cd /home/hudson/jenkins-slave/workspace/HBase-0.94-security/trunk
&& /home/hudson/tools/java/jdk1.6.0_45-32/jre/bin/java -enableassertions -Xmx1900m
-Djava.security.egd=file:/dev/./urandom -jar /home/hudson/jenkins-slave/workspace/HBase-0.94-security/trunk/target/surefire/surefirebooter2355129073189049291.jar
/home/hudson/jenkins-slave/workspace/HBase-0.94-security/trunk/target/surefire/surefire8341003393795694130tmp
/home/hudson/jenkins-slave/workspace/HBase-0.94-security/trunk/target/surefire/surefire_152868141175163997099tmp
Running org.apache.hadoop.hbase.avro.TestAvroServer
Tests run: 3, Failures: 0, Errors: 0, Skipped: 0, Time elapsed: 32.176 sec
Forking command line: /bin/sh -c cd /home/hudson/jenkins-slave/workspace/HBase-0.94-security/trunk
&& /home/hudson/tools/java/jdk1.6.0_45-32/jre/bin/java -enableassertions -Xmx1900m
-Djava.security.egd=file:/dev/./urandom -jar /home/hudson/jenkins-slave/workspace/HBase-0.94-security/trunk/target/surefire/surefirebooter1883958872118653419.jar
/home/hudson/jenkins-slave/workspace/HBase-0.94-security/trunk/target/surefire/surefire5895730664072890129tmp
/home/hudson/jenkins-slave/workspace/HBase-0.94-security/trunk/target/surefire/surefire_1532462197206040922028tmp
Running org.apache.hadoop.hbase.TestAcidGuarantees
Tests run: 3, Failures: 0, Errors: 0, Skipped: 0, Time elapsed: 112.361 sec
Forking command line: /bin/sh -c cd /home/hudson/jenkins-slave/workspace/HBase-0.94-security/trunk
&& /home/hudson/tools/java/jdk1.6.0_45-32/jre/bin/java -enableassertions -Xmx1900m
-Djava.security.egd=file:/dev/./urandom -jar /home/hudson/jenkins-slave/workspace/HBase-0.94-security/trunk/target/surefire/surefirebooter2244154407247994278.jar
/home/hudson/jenkins-slave/workspace/HBase-0.94-security/trunk/target/surefire/surefire7976464987150813946tmp
/home/hudson/jenkins-slave/workspace/HBase-0.94-security/trunk/target/surefire/surefire_1547876533732881211702tmp
Running org.apache.hadoop.hbase.ipc.TestPBOnWritableRpc
Tests run: 1, Failures: 0, Errors: 0, Skipped: 0, Time elapsed: 0.929 sec
Forking command line: /bin/sh -c cd /home/hudson/jenkins-slave/workspace/HBase-0.94-security/trunk
&& /home/hudson/tools/java/jdk1.6.0_45-32/jre/bin/java -enableassertions -Xmx1900m
-Djava.security.egd=file:/dev/./urandom -jar /home/hudson/jenkins-slave/workspace/HBase-0.94-security/trunk/target/surefire/surefirebooter6332562059045617222.jar
/home/hudson/jenkins-slave/workspace/HBase-0.94-security/trunk/target/surefire/surefire9107292701441345726tmp
/home/hudson/jenkins-slave/workspace/HBase-0.94-security/trunk/target/surefire/surefire_1554956235792780714504tmp
Running org.apache.hadoop.hbase.ipc.TestDelayedRpc
Tests run: 4, Failures: 0, Errors: 0, Skipped: 0, Time elapsed: 2.826 sec
Forking command line: /bin/sh -c cd /home/hudson/jenkins-slave/workspace/HBase-0.94-security/trunk
&& /home/hudson/tools/java/jdk1.6.0_45-32/jre/bin/java -enableassertions -Xmx1900m
-Djava.security.egd=file:/dev/./urandom -jar /home/hudson/jenkins-slave/workspace/HBase-0.94-security/trunk/target/surefire/surefirebooter8859885001076800947.jar
/home/hudson/jenkins-slave/workspace/HBase-0.94-security/trunk/target/surefire/surefire7217129478433347281tmp
/home/hudson/jenkins-slave/workspace/HBase-0.94-security/trunk/target/surefire/surefire_1565278451034715571222tmp
Running org.apache.hadoop.hbase.thrift2.TestThriftHBaseServiceHandler
Tests run: 19, Failures: 0, Errors: 0, Skipped: 0, Time elapsed: 17.983 sec
Forking command line: /bin/sh -c cd /home/hudson/jenkins-slave/workspace/HBase-0.94-security/trunk
&& /home/hudson/tools/java/jdk1.6.0_45-32/jre/bin/java -enableassertions -Xmx1900m
-Djava.security.egd=file:/dev/./urandom -jar /home/hudson/jenkins-slave/workspace/HBase-0.94-security/trunk/target/surefire/surefirebooter5408921099103332496.jar
/home/hudson/jenkins-slave/workspace/HBase-0.94-security/trunk/target/surefire/surefire8666096133757649597tmp
/home/hudson/jenkins-slave/workspace/HBase-0.94-security/trunk/target/surefire/surefire_1577314912743617329099tmp
Running org.apache.hadoop.hbase.TestInfoServers
Tests run: 3, Failures: 0, Errors: 0, Skipped: 0, Time elapsed: 15.299 sec
Forking command line: /bin/sh -c cd /home/hudson/jenkins-slave/workspace/HBase-0.94-security/trunk
&& /home/hudson/tools/java/jdk1.6.0_45-32/jre/bin/java -enableassertions -Xmx1900m
-Djava.security.egd=file:/dev/./urandom -jar /home/hudson/jenkins-slave/workspace/HBase-0.94-security/trunk/target/surefire/surefirebooter3518527331204229432.jar
/home/hudson/jenkins-slave/workspace/HBase-0.94-security/trunk/target/surefire/surefire1127011918155510689tmp
/home/hudson/jenkins-slave/workspace/HBase-0.94-security/trunk/target/surefire/surefire_1584535162843468293253tmp
Running org.apache.hadoop.hbase.procedure.TestZKProcedureControllers
Tests run: 4, Failures: 0, Errors: 0, Skipped: 0, Time elapsed: 2.293 sec
Forking command line: /bin/sh -c cd /home/hudson/jenkins-slave/workspace/HBase-0.94-security/trunk
&& /home/hudson/tools/java/jdk1.6.0_45-32/jre/bin/java -enableassertions -Xmx1900m
-Djava.security.egd=file:/dev/./urandom -jar /home/hudson/jenkins-slave/workspace/HBase-0.94-security/trunk/target/surefire/surefirebooter5992299734623489745.jar
/home/hudson/jenkins-slave/workspace/HBase-0.94-security/trunk/target/surefire/surefire8336486181023645684tmp
/home/hudson/jenkins-slave/workspace/HBase-0.94-security/trunk/target/surefire/surefire_1591074568645827201827tmp
Running org.apache.hadoop.hbase.procedure.TestZKProcedure
Tests run: 4, Failures: 0, Errors: 0, Skipped: 0, Time elapsed: 1.945 sec

Results :

Tests run: 916, Failures: 0, Errors: 0, Skipped: 2

[INFO] ------------------------------------------------------------------------
[INFO] BUILD FAILURE
[INFO] ------------------------------------------------------------------------
[INFO] Total time: 57:34.189s
[INFO] Finished at: Tue Mar 04 11:26:39 UTC 2014
[INFO] Final Memory: 67M/627M
[INFO] ------------------------------------------------------------------------
[ERROR] Failed to execute goal org.apache.maven.plugins:maven-surefire-plugin:2.12-TRUNK-HBASE-2:test
(secondPartTestsExecution) on project hbase: Failure or timeout -> [Help 1]
org.apache.maven.lifecycle.LifecycleExecutionException: Failed to execute goal org.apache.maven.plugins:maven-surefire-plugin:2.12-TRUNK-HBASE-2:test
(secondPartTestsExecution) on project hbase: Failure or timeout
	at org.apache.maven.lifecycle.internal.MojoExecutor.execute(MojoExecutor.java:217)
	at org.apache.maven.lifecycle.internal.MojoExecutor.execute(MojoExecutor.java:153)
	at org.apache.maven.lifecycle.internal.MojoExecutor.execute(MojoExecutor.java:145)
	at org.apache.maven.lifecycle.internal.MojoExecutor.executeForkedExecutions(MojoExecutor.java:365)
	at org.apache.maven.lifecycle.internal.MojoExecutor.execute(MojoExecutor.java:199)
	at org.apache.maven.lifecycle.internal.MojoExecutor.execute(MojoExecutor.java:153)
	at org.apache.maven.lifecycle.internal.MojoExecutor.execute(MojoExecutor.java:145)
	at org.apache.maven.lifecycle.internal.LifecycleModuleBuilder.buildProject(LifecycleModuleBuilder.java:84)
	at org.apache.maven.lifecycle.internal.LifecycleModuleBuilder.buildProject(LifecycleModuleBuilder.java:59)
	at org.apache.maven.lifecycle.internal.LifecycleStarter.singleThreadedBuild(LifecycleStarter.java:183)
	at org.apache.maven.lifecycle.internal.LifecycleStarter.execute(LifecycleStarter.java:161)
	at org.apache.maven.DefaultMaven.doExecute(DefaultMaven.java:320)
	at org.apache.maven.DefaultMaven.execute(DefaultMaven.java:156)
	at org.apache.maven.cli.MavenCli.execute(MavenCli.java:537)
	at org.apache.maven.cli.MavenCli.doMain(MavenCli.java:196)
	at org.apache.maven.cli.MavenCli.main(MavenCli.java:141)
	at sun.reflect.NativeMethodAccessorImpl.invoke0(Native Method)
	at sun.reflect.NativeMethodAccessorImpl.invoke(NativeMethodAccessorImpl.java:39)
	at sun.reflect.DelegatingMethodAccessorImpl.invoke(DelegatingMethodAccessorImpl.java:25)
	at java.lang.reflect.Method.invoke(Method.java:597)
	at org.codehaus.plexus.classworlds.launcher.Launcher.launchEnhanced(Launcher.java:290)
	at org.codehaus.plexus.classworlds.launcher.Launcher.launch(Launcher.java:230)
	at org.codehaus.plexus.classworlds.launcher.Launcher.mainWithExitCode(Launcher.java:409)
	at org.codehaus.plexus.classworlds.launcher.Launcher.main(Launcher.java:352)
Caused by: org.apache.maven.plugin.MojoExecutionException: Failure or timeout
	at org.apache.maven.plugin.surefire.SurefirePlugin.assertNoFailureOrTimeout(SurefirePlugin.java:643)
	at org.apache.maven.plugin.surefire.SurefirePlugin.handleSummary(SurefirePlugin.java:624)
	at org.apache.maven.plugin.surefire.AbstractSurefireMojo.executeAfterPreconditionsChecked(AbstractSurefireMojo.java:137)
	at org.apache.maven.plugin.surefire.AbstractSurefireMojo.execute(AbstractSurefireMojo.java:98)
	at org.apache.maven.plugin.DefaultBuildPluginManager.executeMojo(DefaultBuildPluginManager.java:101)
	at org.apache.maven.lifecycle.internal.MojoExecutor.execute(MojoExecutor.java:209)
	... 23 more
[ERROR] 
[ERROR] 
[ERROR] For more information about the errors and possible solutions, please read the following
articles:
[ERROR] [Help 1] http://cwiki.apache.org/confluence/display/MAVEN/MojoExecutionException
Build step 'Invoke top-level Maven targets' marked build as failure
Archiving artifacts
Updating HBASE-10567
Updating HBASE-9708
Updating HBASE-10537
Recording test results

Mime
View raw message