hbase-builds mailing list archives

Site index · List index
Message view « Date » · « Thread »
Top « Date » · « Thread »
From Apache Jenkins Server <jenk...@builds.apache.org>
Subject Build failed in Jenkins: HBase-TRUNK-on-Hadoop-1.1 #108
Date Thu, 06 Mar 2014 03:38:52 GMT
See <https://builds.apache.org/job/HBase-TRUNK-on-Hadoop-1.1/108/changes>

Changes:

[larsh] HBASE-10594 Speed up TestRestoreSnapshotFromClient.

[rajeshbabu] HBASE-10669 [hbck tool] Usage is wrong for hbck tool for -sidelineCorruptHfiles
option(Deepak Sharma)

[tedyu] HBASE-10670 HBaseFsck#connect() should use new connection

[rajeshbabu] HBASE-10677 boundaries check in hbck throwing IllegalArgumentException(Rajesh)

------------------------------------------
[...truncated 4750 lines...]
Tests run: 8, Failures: 0, Errors: 0, Skipped: 0, Time elapsed: 208.76 sec
Running org.apache.hadoop.hbase.replication.TestReplicationSource
Tests run: 1, Failures: 0, Errors: 0, Skipped: 0, Time elapsed: 6.788 sec
Running org.apache.hadoop.hbase.replication.TestReplicationSmallTests
Tests run: 9, Failures: 0, Errors: 0, Skipped: 0, Time elapsed: 103.824 sec
Running org.apache.hadoop.hbase.replication.TestMasterReplication
Tests run: 3, Failures: 0, Errors: 0, Skipped: 0, Time elapsed: 169.544 sec
Running org.apache.hadoop.hbase.replication.TestReplicationWithTags
Tests run: 1, Failures: 0, Errors: 0, Skipped: 0, Time elapsed: 60.076 sec
Running org.apache.hadoop.hbase.ipc.TestDelayedRpc
Tests run: 4, Failures: 0, Errors: 0, Skipped: 0, Time elapsed: 3.32 sec
Running org.apache.hadoop.hbase.ipc.TestProtoBufRpc
Tests run: 1, Failures: 0, Errors: 0, Skipped: 0, Time elapsed: 1.655 sec
Running org.apache.hadoop.hbase.ipc.TestHBaseClient
Tests run: 1, Failures: 0, Errors: 0, Skipped: 0, Time elapsed: 0.311 sec
Running org.apache.hadoop.hbase.replication.TestReplicationKillSlaveRS
Tests run: 1, Failures: 0, Errors: 0, Skipped: 0, Time elapsed: 99.495 sec
Running org.apache.hadoop.hbase.TestHBaseTestingUtility
Tests run: 7, Failures: 0, Errors: 0, Skipped: 0, Time elapsed: 101.815 sec
Running org.apache.hadoop.hbase.TestZooKeeper
Tests run: 10, Failures: 0, Errors: 0, Skipped: 0, Time elapsed: 153.462 sec

Results :

Tests in error: 
  testRecovery(org.apache.hadoop.hbase.coprocessor.TestRegionObserverInterface): Connection
refused
  testHBase3583(org.apache.hadoop.hbase.coprocessor.TestRegionObserverInterface): org.apache.hadoop.hbase.NotAllMetaRegionsOnlineException:
Timed out; 10000ms
  testHBase3758(org.apache.hadoop.hbase.coprocessor.TestRegionObserverInterface): org.apache.hadoop.hbase.NotAllMetaRegionsOnlineException:
Timed out; 10000ms
  testCompactionOverride(org.apache.hadoop.hbase.coprocessor.TestRegionObserverInterface):
callTimeout=60000, callDuration=70261: row 'TestCompactionOverride,,' on table 'hbase:meta
  testRowMutation(org.apache.hadoop.hbase.coprocessor.TestRegionObserverInterface): org.apache.hadoop.hbase.NotAllMetaRegionsOnlineException:
Timed out; 10000ms
  testRegionObserver(org.apache.hadoop.hbase.coprocessor.TestRegionObserverInterface): org.apache.hadoop.hbase.NotAllMetaRegionsOnlineException:
Timed out; 10000ms
  testIncrementHook(org.apache.hadoop.hbase.coprocessor.TestRegionObserverInterface): org.apache.hadoop.hbase.NotAllMetaRegionsOnlineException:
Timed out; 10000ms

Tests run: 1827, Failures: 0, Errors: 7, Skipped: 25

[INFO] ------------------------------------------------------------------------
[INFO] Reactor Summary:
[INFO] 
[INFO] HBase ............................................. SUCCESS [15.417s]
[INFO] HBase - Common .................................... SUCCESS [25.652s]
[INFO] HBase - Protocol .................................. SUCCESS [9.557s]
[INFO] HBase - Client .................................... SUCCESS [38.487s]
[INFO] HBase - Hadoop Compatibility ...................... SUCCESS [5.460s]
[INFO] HBase - Hadoop One Compatibility .................. SUCCESS [2.333s]
[INFO] HBase - Prefix Tree ............................... SUCCESS [4.111s]
[INFO] HBase - Server .................................... FAILURE [3:34:05.398s]
[INFO] HBase - Testing Util .............................. SKIPPED
[INFO] HBase - Thrift .................................... SKIPPED
[INFO] HBase - Shell ..................................... SKIPPED
[INFO] HBase - Integration Tests ......................... SKIPPED
[INFO] HBase - Examples .................................. SKIPPED
[INFO] HBase - Assembly .................................. SKIPPED
[INFO] ------------------------------------------------------------------------
[INFO] BUILD FAILURE
[INFO] ------------------------------------------------------------------------
[INFO] Total time: 3:35:47.213s
[INFO] Finished at: Thu Mar 06 03:37:08 UTC 2014
[INFO] Final Memory: 76M/704M
[INFO] ------------------------------------------------------------------------
[ERROR] Failed to execute goal org.apache.maven.plugins:maven-surefire-plugin:2.12-TRUNK-HBASE-2:test
(secondPartTestsExecution) on project hbase-server: Failure or timeout -> [Help 1]
[ERROR] 
[ERROR] To see the full stack trace of the errors, re-run Maven with the -e switch.
[ERROR] Re-run Maven using the -X switch to enable full debug logging.
[ERROR] 
[ERROR] For more information about the errors and possible solutions, please read the following
articles:
[ERROR] [Help 1] http://cwiki.apache.org/confluence/display/MAVEN/MojoExecutionException
[ERROR] 
[ERROR] After correcting the problems, you can resume the build with the command
[ERROR]   mvn <goals> -rf :hbase-server
Build step 'Invoke top-level Maven targets' marked build as failure
Performing Post build task...
Match found for :.* : True
Logical operation result is TRUE
Running script  :   ZOMBIE_TESTS_COUNT=`jps | grep surefirebooter | wc -l`
  if [[ $ZOMBIE_TESTS_COUNT != 0 ]] ; then
    #It seems sometimes the tests are not dying immediately. Let's give them 10s
    echo "Suspicious java process found - waiting 10s to see if there are just slow to stop"
    sleep 10
    ZOMBIE_TESTS_COUNT=`jps | grep surefirebooter | wc -l`
    if [[ $ZOMBIE_TESTS_COUNT != 0 ]] ; then
      echo "There are $ZOMBIE_TESTS_COUNT zombie tests, they should have been killed by surefire
but survived"
      echo "************ BEGIN zombies jstack extract"
      ZB_STACK=`jps | grep surefirebooter | cut -d ' ' -f 1 | xargs -n 1 jstack | grep ".test"
| grep "\.java"`
      jps | grep surefirebooter | cut -d ' ' -f 1 | xargs -n 1 jstack
      echo "************ END  zombies jstack extract"
      JIRA_COMMENT="$JIRA_COMMENT

     {color:red}-1 core zombie tests{color}.  There are ${ZOMBIE_TESTS_COUNT} zombie test(s):
${ZB_STACK}"
      BAD=1
      jps | grep surefirebooter | cut -d ' ' -f 1 | xargs kill -9
    else
      echo "We're ok: there is no zombie test, but some tests took some time to stop"
    fi
  else
    echo "We're ok: there is no zombie test"
  fi
[HBase-TRUNK-on-Hadoop-1.1] $ /bin/bash -xe /tmp/hudson2561786802120571599.sh
++ jps
++ grep surefirebooter
++ wc -l
+ ZOMBIE_TESTS_COUNT=1
+ [[ 1 != 0 ]]
+ echo 'Suspicious java process found - waiting 10s to see if there are just slow to stop'
Suspicious java process found - waiting 10s to see if there are just slow to stop
+ sleep 10
++ jps
++ grep surefirebooter
++ wc -l
+ ZOMBIE_TESTS_COUNT=1
+ [[ 1 != 0 ]]
+ echo 'There are 1 zombie tests, they should have been killed by surefire but survived'
There are 1 zombie tests, they should have been killed by surefire but survived
+ echo '************ BEGIN zombies jstack extract'
************ BEGIN zombies jstack extract
++ jps
++ grep surefirebooter
++ cut -d ' ' -f 1
++ xargs -n 1 jstack
++ grep .test
++ grep '\.java'
+ ZB_STACK='	at org.apache.archiva.web.test.parent.AbstractSeleniumTest.waitPage(AbstractSeleniumTest.java:454)
	at org.apache.archiva.web.test.parent.AbstractSeleniumTest.clickButtonWithLocator(AbstractSeleniumTest.java:610)
	at org.apache.archiva.web.test.parent.AbstractSeleniumTest.clickButtonWithLocator(AbstractSeleniumTest.java:601)
	at org.apache.archiva.web.test.parent.AbstractSeleniumTest.submitLoginPage(AbstractSeleniumTest.java:269)
	at org.apache.archiva.web.test.parent.AbstractSeleniumTest.login(AbstractSeleniumTest.java:209)
	at org.apache.archiva.web.test.parent.AbstractSeleniumTest.login(AbstractSeleniumTest.java:200)
	at org.apache.archiva.web.test.parent.AbstractSeleniumTest.initializeArchiva(AbstractSeleniumTest.java:162)
	at org.apache.archiva.web.test.parent.AbstractSeleniumTest.assertAdminCreated(AbstractSeleniumTest.java:128)
	at org.apache.archiva.web.test.parent.AbstractSeleniumTest.open(AbstractSeleniumTest.java:88)
	at org.apache.archiva.web.test.tools.ArchivaSeleniumExecutionRule.apply(ArchivaSeleniumExecutionRule.java:41)'
+ jps
+ grep surefirebooter
+ cut -d ' ' -f 1
+ xargs -n 1 jstack
2014-03-06 03:37:22
Full thread dump Java HotSpot(TM) 64-Bit Server VM (24.51-b03 mixed mode):

"Attach Listener" daemon prio=10 tid=0x00007f7a94001000 nid=0x18ee waiting on condition [0x0000000000000000]
   java.lang.Thread.State: RUNNABLE

"Service Thread" daemon prio=10 tid=0x00007f7ad81e5000 nid=0x29bf runnable [0x0000000000000000]
   java.lang.Thread.State: RUNNABLE

"C2 CompilerThread1" daemon prio=10 tid=0x00007f7ad81e2800 nid=0x29be waiting on condition
[0x0000000000000000]
   java.lang.Thread.State: RUNNABLE

"C2 CompilerThread0" daemon prio=10 tid=0x00007f7ad81e0000 nid=0x29bd waiting on condition
[0x0000000000000000]
   java.lang.Thread.State: RUNNABLE

"Signal Dispatcher" daemon prio=10 tid=0x00007f7ad81d5800 nid=0x29bc runnable [0x0000000000000000]
   java.lang.Thread.State: RUNNABLE

"Finalizer" daemon prio=10 tid=0x00007f7ad81c0000 nid=0x29bb in Object.wait() [0x00007f7ab7dfc000]
   java.lang.Thread.State: WAITING (on object monitor)
	at java.lang.Object.wait(Native Method)
	- waiting on <0x00000007ac605568> (a java.lang.ref.ReferenceQueue$Lock)
	at java.lang.ref.ReferenceQueue.remove(ReferenceQueue.java:135)
	- locked <0x00000007ac605568> (a java.lang.ref.ReferenceQueue$Lock)
	at java.lang.ref.ReferenceQueue.remove(ReferenceQueue.java:151)
	at java.lang.ref.Finalizer$FinalizerThread.run(Finalizer.java:189)

"Reference Handler" daemon prio=10 tid=0x00007f7ad81bc000 nid=0x29ba in Object.wait() [0x00007f7ab7efd000]
   java.lang.Thread.State: WAITING (on object monitor)
	at java.lang.Object.wait(Native Method)
	- waiting on <0x00000007ac6050f0> (a java.lang.ref.Reference$Lock)
	at java.lang.Object.wait(Object.java:503)
	at java.lang.ref.Reference$ReferenceHandler.run(Reference.java:133)
	- locked <0x00000007ac6050f0> (a java.lang.ref.Reference$Lock)

"main" prio=10 tid=0x00007f7ad800a000 nid=0x29b0 waiting on condition [0x00007f7ae1abd000]
   java.lang.Thread.State: TIMED_WAITING (sleeping)
	at java.lang.Thread.sleep(Native Method)
	at org.apache.archiva.web.test.parent.AbstractSeleniumTest.waitPage(AbstractSeleniumTest.java:454)
	at org.apache.archiva.web.test.parent.AbstractSeleniumTest.clickButtonWithLocator(AbstractSeleniumTest.java:610)
	at org.apache.archiva.web.test.parent.AbstractSeleniumTest.clickButtonWithLocator(AbstractSeleniumTest.java:601)
	at org.apache.archiva.web.test.parent.AbstractSeleniumTest.submitLoginPage(AbstractSeleniumTest.java:269)
	at org.apache.archiva.web.test.parent.AbstractSeleniumTest.login(AbstractSeleniumTest.java:209)
	at org.apache.archiva.web.test.parent.AbstractSeleniumTest.login(AbstractSeleniumTest.java:200)
	at org.apache.archiva.web.test.parent.AbstractSeleniumTest.initializeArchiva(AbstractSeleniumTest.java:162)
	at org.apache.archiva.web.test.parent.AbstractSeleniumTest.assertAdminCreated(AbstractSeleniumTest.java:128)
	at org.apache.archiva.web.test.parent.AbstractSeleniumTest.open(AbstractSeleniumTest.java:88)
	at org.apache.archiva.web.test.tools.ArchivaSeleniumExecutionRule.apply(ArchivaSeleniumExecutionRule.java:41)
	at org.junit.runners.BlockJUnit4ClassRunner.withMethodRules(BlockJUnit4ClassRunner.java:349)
	at org.junit.runners.BlockJUnit4ClassRunner.withRules(BlockJUnit4ClassRunner.java:339)
	at org.junit.runners.BlockJUnit4ClassRunner.methodBlock(BlockJUnit4ClassRunner.java:256)
	at org.junit.runners.BlockJUnit4ClassRunner.runChild(BlockJUnit4ClassRunner.java:70)
	at org.junit.runners.BlockJUnit4ClassRunner.runChild(BlockJUnit4ClassRunner.java:50)
	at org.junit.runners.ParentRunner$3.run(ParentRunner.java:238)
	at org.junit.runners.ParentRunner$1.schedule(ParentRunner.java:63)
	at org.junit.runners.ParentRunner.runChildren(ParentRunner.java:236)
	at org.junit.runners.ParentRunner.access$000(ParentRunner.java:53)
	at org.junit.runners.ParentRunner$2.evaluate(ParentRunner.java:229)
	at org.junit.runners.ParentRunner.run(ParentRunner.java:309)
	at org.apache.maven.surefire.junit4.JUnit4Provider.execute(JUnit4Provider.java:264)
	at org.apache.maven.surefire.junit4.JUnit4Provider.executeTestSet(JUnit4Provider.java:153)
	at org.apache.maven.surefire.junit4.JUnit4Provider.invoke(JUnit4Provider.java:124)
	at org.apache.maven.surefire.booter.ForkedBooter.invokeProviderInSameClassLoader(ForkedBooter.java:200)
	at org.apache.maven.surefire.booter.ForkedBooter.runSuitesInProcess(ForkedBooter.java:153)
	at org.apache.maven.surefire.booter.ForkedBooter.main(ForkedBooter.java:103)

"VM Thread" prio=10 tid=0x00007f7ad81b9800 nid=0x29b9 runnable 

"GC task thread#0 (ParallelGC)" prio=10 tid=0x00007f7ad8020000 nid=0x29b1 runnable 

"GC task thread#1 (ParallelGC)" prio=10 tid=0x00007f7ad8022000 nid=0x29b2 runnable 

"GC task thread#2 (ParallelGC)" prio=10 tid=0x00007f7ad8024000 nid=0x29b3 runnable 

"GC task thread#3 (ParallelGC)" prio=10 tid=0x00007f7ad8025800 nid=0x29b4 runnable 

"GC task thread#4 (ParallelGC)" prio=10 tid=0x00007f7ad8027800 nid=0x29b5 runnable 

"GC task thread#5 (ParallelGC)" prio=10 tid=0x00007f7ad8029800 nid=0x29b6 runnable 

"GC task thread#6 (ParallelGC)" prio=10 tid=0x00007f7ad802b800 nid=0x29b7 runnable 

"GC task thread#7 (ParallelGC)" prio=10 tid=0x00007f7ad802d000 nid=0x29b8 runnable 

"VM Periodic Task Thread" prio=10 tid=0x00007f7ad81f0000 nid=0x29c0 waiting on condition 

JNI global references: 210

+ echo '************ END  zombies jstack extract'
************ END  zombies jstack extract
+ JIRA_COMMENT='

     {color:red}-1 core zombie tests{color}.  There are 1 zombie test(s): 	at org.apache.archiva.web.test.parent.AbstractSeleniumTest.waitPage(AbstractSeleniumTest.java:454)
	at org.apache.archiva.web.test.parent.AbstractSeleniumTest.clickButtonWithLocator(AbstractSeleniumTest.java:610)
	at org.apache.archiva.web.test.parent.AbstractSeleniumTest.clickButtonWithLocator(AbstractSeleniumTest.java:601)
	at org.apache.archiva.web.test.parent.AbstractSeleniumTest.submitLoginPage(AbstractSeleniumTest.java:269)
	at org.apache.archiva.web.test.parent.AbstractSeleniumTest.login(AbstractSeleniumTest.java:209)
	at org.apache.archiva.web.test.parent.AbstractSeleniumTest.login(AbstractSeleniumTest.java:200)
	at org.apache.archiva.web.test.parent.AbstractSeleniumTest.initializeArchiva(AbstractSeleniumTest.java:162)
	at org.apache.archiva.web.test.parent.AbstractSeleniumTest.assertAdminCreated(AbstractSeleniumTest.java:128)
	at org.apache.archiva.web.test.parent.AbstractSeleniumTest.open(AbstractSeleniumTest.java:88)
	at org.apache.archiva.web.test.tools.ArchivaSeleniumExecutionRule.apply(ArchivaSeleniumExecutionRule.java:41)'
+ BAD=1
+ jps
+ grep surefirebooter
+ cut -d ' ' -f 1
+ xargs kill -9
POST BUILD TASK : SUCCESS
END OF POST BUILD TASK : 0
Archiving artifacts
Recording test results
Updating HBASE-10669
Updating HBASE-10677
Updating HBASE-10670
Updating HBASE-10594

Mime
View raw message