hbase-builds mailing list archives

Site index · List index
Message view « Date » · « Thread »
Top « Date » · « Thread »
From Apache Jenkins Server <jenk...@builds.apache.org>
Subject Build failed in Jenkins: HBase-TRUNK #5616
Date Fri, 03 Oct 2014 20:12:49 GMT
See <https://builds.apache.org/job/HBase-TRUNK/5616/changes>

Changes:

[jxiang] HBASE-12167 NPE in AssignmentManager

------------------------------------------
[...truncated 2080 lines...]
Tests run: 1, Failures: 0, Errors: 0, Skipped: 0, Time elapsed: 7.474 sec - in org.apache.hadoop.hbase.client.TestClientScannerRPCTimeout
Tests run: 79, Failures: 0, Errors: 0, Skipped: 4, Time elapsed: 87.738 sec - in org.apache.hadoop.hbase.client.TestFromClientSideWithCoprocessor
Running org.apache.hadoop.hbase.client.TestClientOperationInterrupt
Running org.apache.hadoop.hbase.client.TestRpcControllerFactory
Tests run: 1, Failures: 0, Errors: 0, Skipped: 0, Time elapsed: 1.914 sec - in org.apache.hadoop.hbase.client.TestRpcControllerFactory
Running org.apache.hadoop.hbase.client.TestScannersFromClientSide
Running org.apache.hadoop.hbase.client.TestCheckAndMutate
Tests run: 5, Failures: 0, Errors: 0, Skipped: 0, Time elapsed: 4.847 sec - in org.apache.hadoop.hbase.client.TestScannersFromClientSide
Tests run: 1, Failures: 0, Errors: 0, Skipped: 0, Time elapsed: 1.879 sec - in org.apache.hadoop.hbase.client.TestCheckAndMutate
Running org.apache.hadoop.hbase.client.TestFromClientSide
Running org.apache.hadoop.hbase.client.TestRestoreSnapshotFromClientWithRegionReplicas
Tests run: 5, Failures: 0, Errors: 0, Skipped: 0, Time elapsed: 56.794 sec - in org.apache.hadoop.hbase.client.TestCloneSnapshotFromClientWithRegionReplicas
Running org.apache.hadoop.hbase.client.TestReplicaWithCluster
Tests run: 1, Failures: 0, Errors: 0, Skipped: 0, Time elapsed: 53.739 sec - in org.apache.hadoop.hbase.client.TestClientOperationInterrupt
Running org.apache.hadoop.hbase.client.TestAdmin
Tests run: 4, Failures: 0, Errors: 0, Skipped: 0, Time elapsed: 20.214 sec - in org.apache.hadoop.hbase.client.TestReplicaWithCluster
Running org.apache.hadoop.hbase.client.TestHTableMultiplexer
Tests run: 1, Failures: 0, Errors: 0, Skipped: 0, Time elapsed: 7.001 sec - in org.apache.hadoop.hbase.client.TestHTableMultiplexer
Running org.apache.hadoop.hbase.client.TestScannerTimeout
Tests run: 5, Failures: 0, Errors: 0, Skipped: 0, Time elapsed: 82.999 sec - in org.apache.hadoop.hbase.client.TestRestoreSnapshotFromClientWithRegionReplicas
Tests run: 21, Failures: 0, Errors: 0, Skipped: 2, Time elapsed: 147.109 sec - in org.apache.hadoop.hbase.client.TestHCM
Tests run: 79, Failures: 0, Errors: 0, Skipped: 4, Time elapsed: 92.144 sec - in org.apache.hadoop.hbase.client.TestFromClientSide
Running org.apache.hadoop.hbase.client.TestTableSnapshotScanner
Running org.apache.hadoop.hbase.client.TestReplicasClient
Running org.apache.hadoop.hbase.client.TestFromClientSide3
Tests run: 4, Failures: 0, Errors: 0, Skipped: 0, Time elapsed: 38.835 sec - in org.apache.hadoop.hbase.client.TestScannerTimeout
Running org.apache.hadoop.hbase.client.TestRestoreSnapshotFromClient
Tests run: 3, Failures: 0, Errors: 0, Skipped: 0, Time elapsed: 31.811 sec - in org.apache.hadoop.hbase.client.TestTableSnapshotScanner
Tests run: 6, Failures: 0, Errors: 0, Skipped: 0, Time elapsed: 28.347 sec - in org.apache.hadoop.hbase.client.TestFromClientSide3
Running org.apache.hadoop.hbase.client.TestSnapshotMetadata
Running org.apache.hadoop.hbase.TestMultiVersions
Tests run: 3, Failures: 0, Errors: 0, Skipped: 0, Time elapsed: 5.014 sec - in org.apache.hadoop.hbase.TestMultiVersions
Tests run: 4, Failures: 0, Errors: 0, Skipped: 0, Time elapsed: 11.637 sec - in org.apache.hadoop.hbase.client.TestSnapshotMetadata
Running org.apache.hadoop.hbase.procedure.TestZKProcedure
Tests run: 4, Failures: 0, Errors: 0, Skipped: 0, Time elapsed: 2.129 sec - in org.apache.hadoop.hbase.procedure.TestZKProcedure
Running org.apache.hadoop.hbase.procedure.TestZKProcedureControllers
Running org.apache.hadoop.hbase.TestHColumnDescriptorDefaultVersions
Tests run: 4, Failures: 0, Errors: 0, Skipped: 0, Time elapsed: 1.905 sec - in org.apache.hadoop.hbase.procedure.TestZKProcedureControllers
Running org.apache.hadoop.hbase.TestNamespace
Tests run: 3, Failures: 0, Errors: 0, Skipped: 0, Time elapsed: 9.976 sec - in org.apache.hadoop.hbase.TestHColumnDescriptorDefaultVersions
Tests run: 9, Failures: 0, Errors: 0, Skipped: 1, Time elapsed: 5.701 sec - in org.apache.hadoop.hbase.TestNamespace
Running org.apache.hadoop.hbase.constraint.TestConstraint
Running org.apache.hadoop.hbase.rest.TestDeleteRow
Tests run: 5, Failures: 0, Errors: 0, Skipped: 0, Time elapsed: 6.515 sec - in org.apache.hadoop.hbase.constraint.TestConstraint
Tests run: 2, Failures: 0, Errors: 0, Skipped: 0, Time elapsed: 5.36 sec - in org.apache.hadoop.hbase.rest.TestDeleteRow
Running org.apache.hadoop.hbase.rest.TestScannersWithLabels
Tests run: 12, Failures: 0, Errors: 0, Skipped: 0, Time elapsed: 97.081 sec - in org.apache.hadoop.hbase.client.TestReplicasClient
Tests run: 2, Failures: 0, Errors: 0, Skipped: 0, Time elapsed: 2.931 sec - in org.apache.hadoop.hbase.rest.TestScannersWithLabels
Tests run: 5, Failures: 0, Errors: 0, Skipped: 0, Time elapsed: 73.639 sec - in org.apache.hadoop.hbase.client.TestRestoreSnapshotFromClient
Running org.apache.hadoop.hbase.rest.TestTableResource
Tests run: 8, Failures: 0, Errors: 0, Skipped: 0, Time elapsed: 3.294 sec - in org.apache.hadoop.hbase.rest.TestTableResource
Running org.apache.hadoop.hbase.rest.TestSchemaResource
Running org.apache.hadoop.hbase.rest.TestGetAndPutResource
Tests run: 2, Failures: 0, Errors: 0, Skipped: 0, Time elapsed: 3.834 sec - in org.apache.hadoop.hbase.rest.TestSchemaResource
Running org.apache.hadoop.hbase.rest.TestStatusResource
Tests run: 2, Failures: 0, Errors: 0, Skipped: 0, Time elapsed: 2.765 sec - in org.apache.hadoop.hbase.rest.TestStatusResource
Running org.apache.hadoop.hbase.rest.TestTableScan
Running org.apache.hadoop.hbase.rest.TestResourceFilter
Tests run: 1, Failures: 0, Errors: 0, Skipped: 0, Time elapsed: 1.481 sec - in org.apache.hadoop.hbase.rest.TestResourceFilter
Running org.apache.hadoop.hbase.rest.client.TestRemoteTable
Tests run: 18, Failures: 0, Errors: 0, Skipped: 0, Time elapsed: 20.288 sec - in org.apache.hadoop.hbase.rest.TestGetAndPutResource
Tests run: 10, Failures: 0, Errors: 0, Skipped: 0, Time elapsed: 9.279 sec - in org.apache.hadoop.hbase.rest.TestTableScan
Tests run: 9, Failures: 0, Errors: 0, Skipped: 0, Time elapsed: 11.695 sec - in org.apache.hadoop.hbase.rest.client.TestRemoteTable
Running org.apache.hadoop.hbase.rest.TestVersionResource
Running org.apache.hadoop.hbase.rest.TestScannersWithFilters
Running org.apache.hadoop.hbase.rest.TestMultiRowResource
Tests run: 7, Failures: 0, Errors: 0, Skipped: 0, Time elapsed: 3.172 sec - in org.apache.hadoop.hbase.rest.TestVersionResource
Tests run: 3, Failures: 0, Errors: 0, Skipped: 0, Time elapsed: 2.955 sec - in org.apache.hadoop.hbase.rest.TestMultiRowResource
Running org.apache.hadoop.hbase.rest.TestGzipFilter
Tests run: 10, Failures: 0, Errors: 0, Skipped: 0, Time elapsed: 5.948 sec - in org.apache.hadoop.hbase.rest.TestScannersWithFilters
Tests run: 2, Failures: 0, Errors: 0, Skipped: 0, Time elapsed: 2.87 sec - in org.apache.hadoop.hbase.rest.TestGzipFilter
Running org.apache.hadoop.hbase.TestZooKeeper
Running org.apache.hadoop.hbase.snapshot.TestFlushSnapshotFromClient
Running org.apache.hadoop.hbase.rest.TestScannerResource
Running org.apache.hadoop.hbase.snapshot.TestExportSnapshot
Tests run: 5, Failures: 0, Errors: 0, Skipped: 0, Time elapsed: 5.003 sec - in org.apache.hadoop.hbase.rest.TestScannerResource
Tests run: 9, Failures: 0, Errors: 0, Skipped: 0, Time elapsed: 40.52 sec - in org.apache.hadoop.hbase.snapshot.TestFlushSnapshotFromClient
Running org.apache.hadoop.hbase.snapshot.TestSecureExportSnapshot
Running org.apache.hadoop.hbase.snapshot.TestRestoreFlushSnapshotFromClient
Tests run: 5, Failures: 0, Errors: 0, Skipped: 0, Time elapsed: 43.78 sec - in org.apache.hadoop.hbase.snapshot.TestRestoreFlushSnapshotFromClient
Running org.apache.hadoop.hbase.snapshot.TestSnapshotDescriptionUtils
Tests run: 2, Failures: 0, Errors: 0, Skipped: 0, Time elapsed: 0.184 sec - in org.apache.hadoop.hbase.snapshot.TestSnapshotDescriptionUtils
Running org.apache.hadoop.hbase.TestIOFencing
Tests run: 11, Failures: 0, Errors: 0, Skipped: 0, Time elapsed: 194.07 sec - in org.apache.hadoop.hbase.TestZooKeeper
Running org.apache.hadoop.hbase.coprocessor.TestRegionObserverScannerOpenHook
Tests run: 3, Failures: 0, Errors: 0, Skipped: 0, Time elapsed: 8.4 sec - in org.apache.hadoop.hbase.coprocessor.TestRegionObserverScannerOpenHook
Running org.apache.hadoop.hbase.coprocessor.TestOpenTableInCoprocessor
Tests run: 2, Failures: 0, Errors: 0, Skipped: 0, Time elapsed: 4.533 sec - in org.apache.hadoop.hbase.coprocessor.TestOpenTableInCoprocessor
Running org.apache.hadoop.hbase.coprocessor.TestMasterCoprocessorExceptionWithAbort
Tests run: 1, Failures: 0, Errors: 0, Skipped: 0, Time elapsed: 17.185 sec - in org.apache.hadoop.hbase.coprocessor.TestMasterCoprocessorExceptionWithAbort
Running org.apache.hadoop.hbase.coprocessor.TestRegionObserverInterface
Tests run: 12, Failures: 0, Errors: 0, Skipped: 0, Time elapsed: 34.553 sec - in org.apache.hadoop.hbase.coprocessor.TestRegionObserverInterface
Running org.apache.hadoop.hbase.coprocessor.TestMasterCoprocessorExceptionWithRemove
Tests run: 9, Failures: 0, Errors: 0, Skipped: 0, Time elapsed: 273.598 sec - in org.apache.hadoop.hbase.snapshot.TestExportSnapshot
Tests run: 1, Failures: 0, Errors: 0, Skipped: 0, Time elapsed: 4.526 sec - in org.apache.hadoop.hbase.coprocessor.TestMasterCoprocessorExceptionWithRemove
Tests run: 2, Failures: 0, Errors: 0, Skipped: 0, Time elapsed: 194.534 sec - in org.apache.hadoop.hbase.TestIOFencing
Running org.apache.hadoop.hbase.coprocessor.TestAggregateProtocol
Running org.apache.hadoop.hbase.coprocessor.TestBatchCoprocessorEndpoint
Running org.apache.hadoop.hbase.coprocessor.TestHTableWrapper
Tests run: 4, Failures: 0, Errors: 0, Skipped: 0, Time elapsed: 1.721 sec - in org.apache.hadoop.hbase.coprocessor.TestBatchCoprocessorEndpoint
Running org.apache.hadoop.hbase.coprocessor.TestRegionServerObserver
Tests run: 1, Failures: 0, Errors: 0, Skipped: 0, Time elapsed: 2.676 sec - in org.apache.hadoop.hbase.coprocessor.TestHTableWrapper
Tests run: 44, Failures: 0, Errors: 0, Skipped: 0, Time elapsed: 4.267 sec - in org.apache.hadoop.hbase.coprocessor.TestAggregateProtocol
Running org.apache.hadoop.hbase.coprocessor.TestRegionServerCoprocessorExceptionWithAbort
Running org.apache.hadoop.hbase.coprocessor.TestClassLoading
Tests run: 46, Failures: 0, Errors: 0, Skipped: 0, Time elapsed: 517.95 sec - in org.apache.hadoop.hbase.client.TestAdmin
Tests run: 1, Failures: 0, Errors: 0, Skipped: 0, Time elapsed: 11.514 sec - in org.apache.hadoop.hbase.coprocessor.TestRegionServerObserver
Tests run: 2, Failures: 0, Errors: 0, Skipped: 0, Time elapsed: 13.87 sec - in org.apache.hadoop.hbase.coprocessor.TestRegionServerCoprocessorExceptionWithAbort
Tests run: 9, Failures: 0, Errors: 0, Skipped: 0, Time elapsed: 276.708 sec - in org.apache.hadoop.hbase.snapshot.TestSecureExportSnapshot
Running org.apache.hadoop.hbase.coprocessor.TestRegionObserverBypass
Running org.apache.hadoop.hbase.coprocessor.TestDoubleColumnInterpreter
Tests run: 2, Failures: 0, Errors: 0, Skipped: 0, Time elapsed: 3.408 sec - in org.apache.hadoop.hbase.coprocessor.TestRegionObserverBypass
Tests run: 38, Failures: 0, Errors: 0, Skipped: 0, Time elapsed: 3.67 sec - in org.apache.hadoop.hbase.coprocessor.TestDoubleColumnInterpreter
Running org.apache.hadoop.hbase.coprocessor.TestRowProcessorEndpoint
Running org.apache.hadoop.hbase.coprocessor.TestCoprocessorStop
Tests run: 8, Failures: 0, Errors: 0, Skipped: 0, Time elapsed: 17.539 sec - in org.apache.hadoop.hbase.coprocessor.TestClassLoading
Running org.apache.hadoop.hbase.coprocessor.TestRegionServerCoprocessorExceptionWithRemove
Tests run: 4, Failures: 0, Errors: 0, Skipped: 0, Time elapsed: 7.243 sec - in org.apache.hadoop.hbase.coprocessor.TestRowProcessorEndpoint
Running org.apache.hadoop.hbase.coprocessor.TestBigDecimalColumnInterpreter
Running org.apache.hadoop.hbase.coprocessor.TestMasterObserver
Tests run: 38, Failures: 0, Errors: 0, Skipped: 0, Time elapsed: 3.392 sec - in org.apache.hadoop.hbase.coprocessor.TestBigDecimalColumnInterpreter
Running org.apache.hadoop.hbase.coprocessor.TestCoprocessorEndpoint
Tests run: 1, Failures: 0, Errors: 0, Skipped: 0, Time elapsed: 16.224 sec - in org.apache.hadoop.hbase.coprocessor.TestCoprocessorStop
Tests run: 6, Failures: 0, Errors: 0, Skipped: 0, Time elapsed: 2.294 sec - in org.apache.hadoop.hbase.coprocessor.TestCoprocessorEndpoint
Tests run: 6, Failures: 1, Errors: 0, Skipped: 0, Time elapsed: 7.669 sec <<< FAILURE!
- in org.apache.hadoop.hbase.coprocessor.TestMasterObserver
testRegionTransitionOperations(org.apache.hadoop.hbase.coprocessor.TestMasterObserver)  Time
elapsed: 2.21 sec  <<< FAILURE!
java.lang.AssertionError: Coprocessor should have been called on region move
	at org.junit.Assert.fail(Assert.java:88)
	at org.junit.Assert.assertTrue(Assert.java:41)
	at org.apache.hadoop.hbase.coprocessor.TestMasterObserver.testRegionTransitionOperations(TestMasterObserver.java:1445)

Running org.apache.hadoop.hbase.TestGlobalMemStoreSize
Running org.apache.hadoop.hbase.coprocessor.TestWALObserver
Tests run: 1, Failures: 0, Errors: 0, Skipped: 0, Time elapsed: 13.341 sec - in org.apache.hadoop.hbase.coprocessor.TestRegionServerCoprocessorExceptionWithRemove
Running org.apache.hadoop.hbase.TestMetaTableLocator
Tests run: 7, Failures: 0, Errors: 0, Skipped: 0, Time elapsed: 3.575 sec - in org.apache.hadoop.hbase.TestMetaTableLocator
Running org.apache.hadoop.hbase.zookeeper.TestZKMulti
Tests run: 6, Failures: 0, Errors: 0, Skipped: 0, Time elapsed: 0.385 sec - in org.apache.hadoop.hbase.zookeeper.TestZKMulti
Running org.apache.hadoop.hbase.zookeeper.lock.TestZKInterProcessReadWriteLock
Running org.apache.hadoop.hbase.TestJMXListener
Running org.apache.hadoop.hbase.zookeeper.TestZooKeeperACL
Tests run: 3, Failures: 0, Errors: 0, Skipped: 0, Time elapsed: 9.469 sec - in org.apache.hadoop.hbase.coprocessor.TestWALObserver
Tests run: 6, Failures: 0, Errors: 0, Skipped: 0, Time elapsed: 0.289 sec - in org.apache.hadoop.hbase.zookeeper.TestZooKeeperACL
Tests run: 1, Failures: 0, Errors: 0, Skipped: 0, Time elapsed: 11.181 sec - in org.apache.hadoop.hbase.TestGlobalMemStoreSize
Running org.apache.hadoop.hbase.zookeeper.TestZKLeaderManager
Tests run: 1, Failures: 0, Errors: 0, Skipped: 0, Time elapsed: 0.121 sec - in org.apache.hadoop.hbase.zookeeper.TestZKLeaderManager
Running org.apache.hadoop.hbase.zookeeper.TestRecoverableZooKeeper
Running org.apache.hadoop.hbase.zookeeper.TestZooKeeperNodeTracker
Running org.apache.hadoop.hbase.zookeeper.TestHQuorumPeer
Tests run: 3, Failures: 0, Errors: 0, Skipped: 0, Time elapsed: 0.865 sec - in org.apache.hadoop.hbase.zookeeper.TestZooKeeperNodeTracker
Tests run: 1, Failures: 0, Errors: 0, Skipped: 0, Time elapsed: 1.226 sec - in org.apache.hadoop.hbase.zookeeper.TestRecoverableZooKeeper
Running org.apache.hadoop.hbase.TestClusterBootOrder
Tests run: 3, Failures: 0, Errors: 0, Skipped: 0, Time elapsed: 1.145 sec - in org.apache.hadoop.hbase.zookeeper.TestHQuorumPeer
Tests run: 2, Failures: 0, Errors: 0, Skipped: 0, Time elapsed: 16.189 sec - in org.apache.hadoop.hbase.TestJMXListener
Tests run: 6, Failures: 0, Errors: 0, Skipped: 0, Time elapsed: 24.512 sec - in org.apache.hadoop.hbase.zookeeper.lock.TestZKInterProcessReadWriteLock
Tests run: 2, Failures: 0, Errors: 0, Skipped: 0, Time elapsed: 24.949 sec - in org.apache.hadoop.hbase.TestClusterBootOrder

Results :

Failed tests: 
  TestDistributedLogSplitting.testMasterStartsUpWithLogReplayWork:536 Waiting timed out after
[180,000] msec
  TestMasterObserver.testRegionTransitionOperations:1445 Coprocessor should have been called
on region move

Tests run: 2035, Failures: 2, Errors: 0, Skipped: 19

[INFO] ------------------------------------------------------------------------
[INFO] Reactor Summary:
[INFO] 
[INFO] HBase ............................................. SUCCESS [2.479s]
[INFO] HBase - Annotations ............................... SUCCESS [1.335s]
[INFO] HBase - Common .................................... SUCCESS [1:01.364s]
[INFO] HBase - Protocol .................................. SUCCESS [9.182s]
[INFO] HBase - Client .................................... SUCCESS [1:08.301s]
[INFO] HBase - Hadoop Compatibility ...................... SUCCESS [7.058s]
[INFO] HBase - Hadoop Two Compatibility .................. SUCCESS [5.867s]
[INFO] HBase - Prefix Tree ............................... SUCCESS [8.362s]
[INFO] HBase - Server .................................... FAILURE [1:00:13.400s]
[INFO] HBase - Testing Util .............................. SKIPPED
[INFO] HBase - Thrift .................................... SKIPPED
[INFO] HBase - Shell ..................................... SKIPPED
[INFO] HBase - Integration Tests ......................... SKIPPED
[INFO] HBase - Examples .................................. SKIPPED
[INFO] HBase - Assembly .................................. SKIPPED
[INFO] ------------------------------------------------------------------------
[INFO] BUILD FAILURE
[INFO] ------------------------------------------------------------------------
[INFO] Total time: 1:02:58.202s
[INFO] Finished at: Fri Oct 03 20:09:16 UTC 2014
[INFO] Final Memory: 41M/689M
[INFO] ------------------------------------------------------------------------
[ERROR] Failed to execute goal org.apache.maven.plugins:maven-surefire-plugin:2.17:test (secondPartTestsExecution)
on project hbase-server: There are test failures.
[ERROR] 
[ERROR] Please refer to <https://builds.apache.org/job/HBase-TRUNK/ws/hbase-server/target/surefire-reports>
for the individual test results.
[ERROR] -> [Help 1]
[ERROR] 
[ERROR] To see the full stack trace of the errors, re-run Maven with the -e switch.
[ERROR] Re-run Maven using the -X switch to enable full debug logging.
[ERROR] 
[ERROR] For more information about the errors and possible solutions, please read the following
articles:
[ERROR] [Help 1] http://cwiki.apache.org/confluence/display/MAVEN/MojoFailureException
[ERROR] 
[ERROR] After correcting the problems, you can resume the build with the command
[ERROR]   mvn <goals> -rf :hbase-server
Build step 'Invoke top-level Maven targets' marked build as failure
Performing Post build task...
Match found for :.* : True
Logical operation result is TRUE
Running script  :   ZOMBIE_TESTS_COUNT=`jps | grep surefirebooter | wc -l`
  if [[ $ZOMBIE_TESTS_COUNT != 0 ]] ; then
    #It seems sometimes the tests are not dying immediately. Let's give them 10s
    echo "Suspicious java process found - waiting 10s to see if there are just slow to stop"
    sleep 10   
    ZOMBIE_TESTS_COUNT=`jps | grep surefirebooter | wc -l`
    if [[ $ZOMBIE_TESTS_COUNT != 0 ]] ; then
      echo "There are $ZOMBIE_TESTS_COUNT zombie tests, they should have been killed by surefire
but survived"
      echo "************ BEGIN zombies jstack extract"
      ZB_STACK=`jps | grep surefirebooter | cut -d ' ' -f 1 | xargs -n 1 jstack | grep ".test"
| grep "\.java"`
      jps | grep surefirebooter | cut -d ' ' -f 1 | xargs -n 1 jstack
      echo "************ END  zombies jstack extract"
      JIRA_COMMENT="$JIRA_COMMENT

     {color:red}-1 core zombie tests{color}.  There are ${ZOMBIE_TESTS_COUNT} zombie test(s):
${ZB_STACK}"
      BAD=1
      jps | grep surefirebooter | cut -d ' ' -f 1 | xargs kill -9
    else
      echo "We're ok: there is no zombie test, but some tests took some time to stop"
    fi
  else
    echo "We're ok: there is no zombie test"
  fi
[HBase-TRUNK] $ /bin/bash -xe /tmp/hudson8881287777281424397.sh
++ jps
++ grep surefirebooter
++ wc -l
+ ZOMBIE_TESTS_COUNT=0
+ [[ 0 != 0 ]]
+ echo 'We'\''re ok: there is no zombie test'
We're ok: there is no zombie test
POST BUILD TASK : SUCCESS
END OF POST BUILD TASK : 0
Archiving artifacts
Sending artifact delta relative to HBase-TRUNK #5564
Archived 1821 artifacts
Archive block size is 32768
Received 73 blocks and 548439398 bytes
Compression is 0.4%
Took 2 min 36 sec
Recording test results
Updating HBASE-12167

Mime
View raw message