hbase-builds mailing list archives

Site index · List index
Message view « Date » · « Thread »
Top « Date » · « Thread »
From Apache Jenkins Server <jenk...@builds.apache.org>
Subject Build failed in Jenkins: HBase-0.94-security #543
Date Thu, 02 Oct 2014 01:16:04 GMT
See <https://builds.apache.org/job/HBase-0.94-security/543/changes>

Changes:

[apurtell] HBASE-12065 Import tool is not restoring multiple DeleteFamily markers of a row
(Maddineni Sukumar)

------------------------------------------
[...truncated 53565 lines...]
Forking command line: /bin/sh -c cd /x1/jenkins/jenkins-slave/workspace/HBase-0.94-security
&& /x1/jenkins/tools/java/jdk1.6.0_45-32/jre/bin/java -enableassertions -Xmx1900m
-Djava.security.egd=file:/dev/./urandom -jar /x1/jenkins/jenkins-slave/workspace/HBase-0.94-security/target/surefire/surefirebooter5326351239225070764.jar
/x1/jenkins/jenkins-slave/workspace/HBase-0.94-security/target/surefire/surefire4643312611740690459tmp
/x1/jenkins/jenkins-slave/workspace/HBase-0.94-security/target/surefire/surefire_1029177458657090998414tmp
Running org.apache.hadoop.hbase.regionserver.handler.TestOpenRegionHandler
Tests run: 4, Failures: 0, Errors: 0, Skipped: 0, Time elapsed: 17.737 sec
Forking command line: /bin/sh -c cd /x1/jenkins/jenkins-slave/workspace/HBase-0.94-security
&& /x1/jenkins/tools/java/jdk1.6.0_45-32/jre/bin/java -enableassertions -Xmx1900m
-Djava.security.egd=file:/dev/./urandom -jar /x1/jenkins/jenkins-slave/workspace/HBase-0.94-security/target/surefire/surefirebooter6368402588712424147.jar
/x1/jenkins/jenkins-slave/workspace/HBase-0.94-security/target/surefire/surefire553541756446737845tmp
/x1/jenkins/jenkins-slave/workspace/HBase-0.94-security/target/surefire/surefire_1033474697635069877595tmp
Running org.apache.hadoop.hbase.regionserver.TestStoreScanner
Tests run: 16, Failures: 0, Errors: 0, Skipped: 0, Time elapsed: 0.049 sec
Forking command line: /bin/sh -c cd /x1/jenkins/jenkins-slave/workspace/HBase-0.94-security
&& /x1/jenkins/tools/java/jdk1.6.0_45-32/jre/bin/java -enableassertions -Xmx1900m
-Djava.security.egd=file:/dev/./urandom -jar /x1/jenkins/jenkins-slave/workspace/HBase-0.94-security/target/surefire/surefirebooter6499221804678441238.jar
/x1/jenkins/jenkins-slave/workspace/HBase-0.94-security/target/surefire/surefire8678505478276892356tmp
/x1/jenkins/jenkins-slave/workspace/HBase-0.94-security/target/surefire/surefire_1043895223658089291817tmp
Running org.apache.hadoop.hbase.regionserver.TestSplitLogWorker
Tests run: 5, Failures: 0, Errors: 0, Skipped: 0, Time elapsed: 17.078 sec
Forking command line: /bin/sh -c cd /x1/jenkins/jenkins-slave/workspace/HBase-0.94-security
&& /x1/jenkins/tools/java/jdk1.6.0_45-32/jre/bin/java -enableassertions -Xmx1900m
-Djava.security.egd=file:/dev/./urandom -jar /x1/jenkins/jenkins-slave/workspace/HBase-0.94-security/target/surefire/surefirebooter5492636253854480956.jar
/x1/jenkins/jenkins-slave/workspace/HBase-0.94-security/target/surefire/surefire5158580820323846264tmp
/x1/jenkins/jenkins-slave/workspace/HBase-0.94-security/target/surefire/surefire_1053299288402664889546tmp
Running org.apache.hadoop.hbase.regionserver.metrics.TestSchemaMetrics
Tests run: 6, Failures: 0, Errors: 0, Skipped: 0, Time elapsed: 15.094 sec
Forking command line: /bin/sh -c cd /x1/jenkins/jenkins-slave/workspace/HBase-0.94-security
&& /x1/jenkins/tools/java/jdk1.6.0_45-32/jre/bin/java -enableassertions -Xmx1900m
-Djava.security.egd=file:/dev/./urandom -jar /x1/jenkins/jenkins-slave/workspace/HBase-0.94-security/target/surefire/surefirebooter7745210491219362271.jar
/x1/jenkins/jenkins-slave/workspace/HBase-0.94-security/target/surefire/surefire7415572753856009088tmp
/x1/jenkins/jenkins-slave/workspace/HBase-0.94-security/target/surefire/surefire_1067296187058095471157tmp
Running org.apache.hadoop.hbase.regionserver.TestStoreFileBlockCacheSummary
Tests run: 1, Failures: 0, Errors: 0, Skipped: 0, Time elapsed: 19.2 sec
Forking command line: /bin/sh -c cd /x1/jenkins/jenkins-slave/workspace/HBase-0.94-security
&& /x1/jenkins/tools/java/jdk1.6.0_45-32/jre/bin/java -enableassertions -Xmx1900m
-Djava.security.egd=file:/dev/./urandom -jar /x1/jenkins/jenkins-slave/workspace/HBase-0.94-security/target/surefire/surefirebooter1138542780048772604.jar
/x1/jenkins/jenkins-slave/workspace/HBase-0.94-security/target/surefire/surefire4583162273470777374tmp
/x1/jenkins/jenkins-slave/workspace/HBase-0.94-security/target/surefire/surefire_1075891064846747192525tmp
Running org.apache.hadoop.hbase.regionserver.TestMasterAddressManager
Tests run: 1, Failures: 0, Errors: 0, Skipped: 0, Time elapsed: 0.723 sec
Forking command line: /bin/sh -c cd /x1/jenkins/jenkins-slave/workspace/HBase-0.94-security
&& /x1/jenkins/tools/java/jdk1.6.0_45-32/jre/bin/java -enableassertions -Xmx1900m
-Djava.security.egd=file:/dev/./urandom -jar /x1/jenkins/jenkins-slave/workspace/HBase-0.94-security/target/surefire/surefirebooter1977069789934902024.jar
/x1/jenkins/jenkins-slave/workspace/HBase-0.94-security/target/surefire/surefire2515022081938287132tmp
/x1/jenkins/jenkins-slave/workspace/HBase-0.94-security/target/surefire/surefire_1083853361153384942173tmp
Running org.apache.hadoop.hbase.regionserver.TestMultiColumnScanner
Tests run: 12, Failures: 0, Errors: 0, Skipped: 0, Time elapsed: 34.693 sec
Forking command line: /bin/sh -c cd /x1/jenkins/jenkins-slave/workspace/HBase-0.94-security
&& /x1/jenkins/tools/java/jdk1.6.0_45-32/jre/bin/java -enableassertions -Xmx1900m
-Djava.security.egd=file:/dev/./urandom -jar /x1/jenkins/jenkins-slave/workspace/HBase-0.94-security/target/surefire/surefirebooter1590936442899163799.jar
/x1/jenkins/jenkins-slave/workspace/HBase-0.94-security/target/surefire/surefire2973336779977501653tmp
/x1/jenkins/jenkins-slave/workspace/HBase-0.94-security/target/surefire/surefire_1098907756211631861913tmp
Running org.apache.hadoop.hbase.regionserver.TestHRegion
Tests run: 75, Failures: 0, Errors: 0, Skipped: 0, Time elapsed: 56.539 sec
Forking command line: /bin/sh -c cd /x1/jenkins/jenkins-slave/workspace/HBase-0.94-security
&& /x1/jenkins/tools/java/jdk1.6.0_45-32/jre/bin/java -enableassertions -Xmx1900m
-Djava.security.egd=file:/dev/./urandom -jar /x1/jenkins/jenkins-slave/workspace/HBase-0.94-security/target/surefire/surefirebooter4068605902579860257.jar
/x1/jenkins/jenkins-slave/workspace/HBase-0.94-security/target/surefire/surefire3131128372666208878tmp
/x1/jenkins/jenkins-slave/workspace/HBase-0.94-security/target/surefire/surefire_1105464143330922938939tmp
Running org.apache.hadoop.hbase.TestLocalHBaseCluster
Tests run: 1, Failures: 0, Errors: 0, Skipped: 0, Time elapsed: 10.554 sec
Forking command line: /bin/sh -c cd /x1/jenkins/jenkins-slave/workspace/HBase-0.94-security
&& /x1/jenkins/tools/java/jdk1.6.0_45-32/jre/bin/java -enableassertions -Xmx1900m
-Djava.security.egd=file:/dev/./urandom -jar /x1/jenkins/jenkins-slave/workspace/HBase-0.94-security/target/surefire/surefirebooter2446330301236107140.jar
/x1/jenkins/jenkins-slave/workspace/HBase-0.94-security/target/surefire/surefire7556281007459154223tmp
/x1/jenkins/jenkins-slave/workspace/HBase-0.94-security/target/surefire/surefire_1113982639704127698093tmp
Running org.apache.hadoop.hbase.ipc.TestDelayedRpc
Tests run: 4, Failures: 0, Errors: 0, Skipped: 0, Time elapsed: 2.901 sec
Forking command line: /bin/sh -c cd /x1/jenkins/jenkins-slave/workspace/HBase-0.94-security
&& /x1/jenkins/tools/java/jdk1.6.0_45-32/jre/bin/java -enableassertions -Xmx1900m
-Djava.security.egd=file:/dev/./urandom -jar /x1/jenkins/jenkins-slave/workspace/HBase-0.94-security/target/surefire/surefirebooter809893948312111163.jar
/x1/jenkins/jenkins-slave/workspace/HBase-0.94-security/target/surefire/surefire5567767499484079956tmp
/x1/jenkins/jenkins-slave/workspace/HBase-0.94-security/target/surefire/surefire_1125764636784442306937tmp
Running org.apache.hadoop.hbase.ipc.TestPBOnWritableRpc
Tests run: 1, Failures: 0, Errors: 0, Skipped: 0, Time elapsed: 1.227 sec
Forking command line: /bin/sh -c cd /x1/jenkins/jenkins-slave/workspace/HBase-0.94-security
&& /x1/jenkins/tools/java/jdk1.6.0_45-32/jre/bin/java -enableassertions -Xmx1900m
-Djava.security.egd=file:/dev/./urandom -jar /x1/jenkins/jenkins-slave/workspace/HBase-0.94-security/target/surefire/surefirebooter766788540715598568.jar
/x1/jenkins/jenkins-slave/workspace/HBase-0.94-security/target/surefire/surefire633253837691989340tmp
/x1/jenkins/jenkins-slave/workspace/HBase-0.94-security/target/surefire/surefire_1135032522237990593807tmp
Running org.apache.hadoop.hbase.TestGlobalMemStoreSize
Tests run: 1, Failures: 0, Errors: 0, Skipped: 0, Time elapsed: 26.178 sec
Forking command line: /bin/sh -c cd /x1/jenkins/jenkins-slave/workspace/HBase-0.94-security
&& /x1/jenkins/tools/java/jdk1.6.0_45-32/jre/bin/java -enableassertions -Xmx1900m
-Djava.security.egd=file:/dev/./urandom -jar /x1/jenkins/jenkins-slave/workspace/HBase-0.94-security/target/surefire/surefirebooter2311009780829194272.jar
/x1/jenkins/jenkins-slave/workspace/HBase-0.94-security/target/surefire/surefire8283675530939617331tmp
/x1/jenkins/jenkins-slave/workspace/HBase-0.94-security/target/surefire/surefire_1142452972987214723851tmp
Running org.apache.hadoop.hbase.constraint.TestConstraint
Tests run: 5, Failures: 0, Errors: 0, Skipped: 0, Time elapsed: 36.87 sec
Forking command line: /bin/sh -c cd /x1/jenkins/jenkins-slave/workspace/HBase-0.94-security
&& /x1/jenkins/tools/java/jdk1.6.0_45-32/jre/bin/java -enableassertions -Xmx1900m
-Djava.security.egd=file:/dev/./urandom -jar /x1/jenkins/jenkins-slave/workspace/HBase-0.94-security/target/surefire/surefirebooter7541018755274435633.jar
/x1/jenkins/jenkins-slave/workspace/HBase-0.94-security/target/surefire/surefire1165135160718532937tmp
/x1/jenkins/jenkins-slave/workspace/HBase-0.94-security/target/surefire/surefire_1158090780242261929564tmp
Running org.apache.hadoop.hbase.rest.TestSchemaResource
Tests run: 2, Failures: 0, Errors: 0, Skipped: 0, Time elapsed: 27.662 sec
Forking command line: /bin/sh -c cd /x1/jenkins/jenkins-slave/workspace/HBase-0.94-security
&& /x1/jenkins/tools/java/jdk1.6.0_45-32/jre/bin/java -enableassertions -Xmx1900m
-Djava.security.egd=file:/dev/./urandom -jar /x1/jenkins/jenkins-slave/workspace/HBase-0.94-security/target/surefire/surefirebooter2871448594183818485.jar
/x1/jenkins/jenkins-slave/workspace/HBase-0.94-security/target/surefire/surefire7578463138735515941tmp
/x1/jenkins/jenkins-slave/workspace/HBase-0.94-security/target/surefire/surefire_1167463647580673509840tmp
Running org.apache.hadoop.hbase.backup.TestHFileArchiving
Tests run: 5, Failures: 0, Errors: 0, Skipped: 0, Time elapsed: 157.321 sec
Forking command line: /bin/sh -c cd /x1/jenkins/jenkins-slave/workspace/HBase-0.94-security
&& /x1/jenkins/tools/java/jdk1.6.0_45-32/jre/bin/java -enableassertions -Xmx1900m
-Djava.security.egd=file:/dev/./urandom -jar /x1/jenkins/jenkins-slave/workspace/HBase-0.94-security/target/surefire/surefirebooter1228035358462878701.jar
/x1/jenkins/jenkins-slave/workspace/HBase-0.94-security/target/surefire/surefire3907443545096836828tmp
/x1/jenkins/jenkins-slave/workspace/HBase-0.94-security/target/surefire/surefire_1172657533872249257237tmp
Running org.apache.hadoop.hbase.rest.client.TestRemoteAdmin
Tests run: 5, Failures: 0, Errors: 0, Skipped: 0, Time elapsed: 23.356 sec
Forking command line: /bin/sh -c cd /x1/jenkins/jenkins-slave/workspace/HBase-0.94-security
&& /x1/jenkins/tools/java/jdk1.6.0_45-32/jre/bin/java -enableassertions -Xmx1900m
-Djava.security.egd=file:/dev/./urandom -jar /x1/jenkins/jenkins-slave/workspace/HBase-0.94-security/target/surefire/surefirebooter2332001897562243182.jar
/x1/jenkins/jenkins-slave/workspace/HBase-0.94-security/target/surefire/surefire5063298187102084911tmp
/x1/jenkins/jenkins-slave/workspace/HBase-0.94-security/target/surefire/surefire_1183167573830120472412tmp
Running org.apache.hadoop.hbase.rest.TestTableResource
Tests run: 8, Failures: 0, Errors: 0, Skipped: 0, Time elapsed: 29.814 sec
Forking command line: /bin/sh -c cd /x1/jenkins/jenkins-slave/workspace/HBase-0.94-security
&& /x1/jenkins/tools/java/jdk1.6.0_45-32/jre/bin/java -enableassertions -Xmx1900m
-Djava.security.egd=file:/dev/./urandom -jar /x1/jenkins/jenkins-slave/workspace/HBase-0.94-security/target/surefire/surefirebooter3066279842761925420.jar
/x1/jenkins/jenkins-slave/workspace/HBase-0.94-security/target/surefire/surefire595464498340115362tmp
/x1/jenkins/jenkins-slave/workspace/HBase-0.94-security/target/surefire/surefire_1191987100699005241738tmp
Running org.apache.hadoop.hbase.rest.TestMultiRowResource
Tests run: 3, Failures: 0, Errors: 0, Skipped: 0, Time elapsed: 21.472 sec
Forking command line: /bin/sh -c cd /x1/jenkins/jenkins-slave/workspace/HBase-0.94-security
&& /x1/jenkins/tools/java/jdk1.6.0_45-32/jre/bin/java -enableassertions -Xmx1900m
-Djava.security.egd=file:/dev/./urandom -jar /x1/jenkins/jenkins-slave/workspace/HBase-0.94-security/target/surefire/surefirebooter6356285787167030788.jar
/x1/jenkins/jenkins-slave/workspace/HBase-0.94-security/target/surefire/surefire3653129151175308225tmp
/x1/jenkins/jenkins-slave/workspace/HBase-0.94-security/target/surefire/surefire_120878354771934835011tmp
Running org.apache.hadoop.hbase.rest.client.TestRemoteTable
Tests run: 9, Failures: 0, Errors: 0, Skipped: 0, Time elapsed: 59.304 sec
Forking command line: /bin/sh -c cd /x1/jenkins/jenkins-slave/workspace/HBase-0.94-security
&& /x1/jenkins/tools/java/jdk1.6.0_45-32/jre/bin/java -enableassertions -Xmx1900m
-Djava.security.egd=file:/dev/./urandom -jar /x1/jenkins/jenkins-slave/workspace/HBase-0.94-security/target/surefire/surefirebooter308705743939271307.jar
/x1/jenkins/jenkins-slave/workspace/HBase-0.94-security/target/surefire/surefire2206048068939976339tmp
/x1/jenkins/jenkins-slave/workspace/HBase-0.94-security/target/surefire/surefire_1217575737587343476154tmp
Running org.apache.hadoop.hbase.rest.TestGzipFilter
Tests run: 2, Failures: 0, Errors: 0, Skipped: 0, Time elapsed: 22.172 sec
Forking command line: /bin/sh -c cd /x1/jenkins/jenkins-slave/workspace/HBase-0.94-security
&& /x1/jenkins/tools/java/jdk1.6.0_45-32/jre/bin/java -enableassertions -Xmx1900m
-Djava.security.egd=file:/dev/./urandom -jar /x1/jenkins/jenkins-slave/workspace/HBase-0.94-security/target/surefire/surefirebooter3714103097598404136.jar
/x1/jenkins/jenkins-slave/workspace/HBase-0.94-security/target/surefire/surefire8682764617288755355tmp
/x1/jenkins/jenkins-slave/workspace/HBase-0.94-security/target/surefire/surefire_1225551377147734484757tmp
Running org.apache.hadoop.hbase.rest.TestRowResource
Tests run: 12, Failures: 0, Errors: 0, Skipped: 0, Time elapsed: 24.013 sec
Forking command line: /bin/sh -c cd /x1/jenkins/jenkins-slave/workspace/HBase-0.94-security
&& /x1/jenkins/tools/java/jdk1.6.0_45-32/jre/bin/java -enableassertions -Xmx1900m
-Djava.security.egd=file:/dev/./urandom -jar /x1/jenkins/jenkins-slave/workspace/HBase-0.94-security/target/surefire/surefirebooter2556525187852438169.jar
/x1/jenkins/jenkins-slave/workspace/HBase-0.94-security/target/surefire/surefire1719040123479151452tmp
/x1/jenkins/jenkins-slave/workspace/HBase-0.94-security/target/surefire/surefire_1234342947131751828533tmp
Running org.apache.hadoop.hbase.rest.TestVersionResource
Tests run: 7, Failures: 0, Errors: 0, Skipped: 0, Time elapsed: 17.61 sec
Forking command line: /bin/sh -c cd /x1/jenkins/jenkins-slave/workspace/HBase-0.94-security
&& /x1/jenkins/tools/java/jdk1.6.0_45-32/jre/bin/java -enableassertions -Xmx1900m
-Djava.security.egd=file:/dev/./urandom -jar /x1/jenkins/jenkins-slave/workspace/HBase-0.94-security/target/surefire/surefirebooter2597746432317992343.jar
/x1/jenkins/jenkins-slave/workspace/HBase-0.94-security/target/surefire/surefire66287808617251187tmp
/x1/jenkins/jenkins-slave/workspace/HBase-0.94-security/target/surefire/surefire_1248416037532523272441tmp
Running org.apache.hadoop.hbase.rest.TestScannerResource
Tests run: 5, Failures: 0, Errors: 0, Skipped: 0, Time elapsed: 32.88 sec
Forking command line: /bin/sh -c cd /x1/jenkins/jenkins-slave/workspace/HBase-0.94-security
&& /x1/jenkins/tools/java/jdk1.6.0_45-32/jre/bin/java -enableassertions -Xmx1900m
-Djava.security.egd=file:/dev/./urandom -jar /x1/jenkins/jenkins-slave/workspace/HBase-0.94-security/target/surefire/surefirebooter6867241922754251580.jar
/x1/jenkins/jenkins-slave/workspace/HBase-0.94-security/target/surefire/surefire8714788500387944238tmp
/x1/jenkins/jenkins-slave/workspace/HBase-0.94-security/target/surefire/surefire_1256834317581274741274tmp
Running org.apache.hadoop.hbase.rest.TestGZIPResponseWrapper
Tests run: 5, Failures: 0, Errors: 0, Skipped: 0, Time elapsed: 0.282 sec
Forking command line: /bin/sh -c cd /x1/jenkins/jenkins-slave/workspace/HBase-0.94-security
&& /x1/jenkins/tools/java/jdk1.6.0_45-32/jre/bin/java -enableassertions -Xmx1900m
-Djava.security.egd=file:/dev/./urandom -jar /x1/jenkins/jenkins-slave/workspace/HBase-0.94-security/target/surefire/surefirebooter8585507313570873484.jar
/x1/jenkins/jenkins-slave/workspace/HBase-0.94-security/target/surefire/surefire3921882397150968410tmp
/x1/jenkins/jenkins-slave/workspace/HBase-0.94-security/target/surefire/surefire_1263710529009874267720tmp
Running org.apache.hadoop.hbase.rest.TestStatusResource
Tests run: 2, Failures: 0, Errors: 0, Skipped: 0, Time elapsed: 16.029 sec
Forking command line: /bin/sh -c cd /x1/jenkins/jenkins-slave/workspace/HBase-0.94-security
&& /x1/jenkins/tools/java/jdk1.6.0_45-32/jre/bin/java -enableassertions -Xmx1900m
-Djava.security.egd=file:/dev/./urandom -jar /x1/jenkins/jenkins-slave/workspace/HBase-0.94-security/target/surefire/surefirebooter9045265035624847129.jar
/x1/jenkins/jenkins-slave/workspace/HBase-0.94-security/target/surefire/surefire4138783716601662024tmp
/x1/jenkins/jenkins-slave/workspace/HBase-0.94-security/target/surefire/surefire_1272062092678830415321tmp
Running org.apache.hadoop.hbase.rest.TestScannersWithFilters
Tests run: 10, Failures: 0, Errors: 0, Skipped: 0, Time elapsed: 23.624 sec
Forking command line: /bin/sh -c cd /x1/jenkins/jenkins-slave/workspace/HBase-0.94-security
&& /x1/jenkins/tools/java/jdk1.6.0_45-32/jre/bin/java -enableassertions -Xmx1900m
-Djava.security.egd=file:/dev/./urandom -jar /x1/jenkins/jenkins-slave/workspace/HBase-0.94-security/target/surefire/surefirebooter7754674770340839942.jar
/x1/jenkins/jenkins-slave/workspace/HBase-0.94-security/target/surefire/surefire6611227009693854757tmp
/x1/jenkins/jenkins-slave/workspace/HBase-0.94-security/target/surefire/surefire_1281902614628349356438tmp
Running org.apache.hadoop.hbase.metrics.TestMetricsMBeanBase
Tests run: 3, Failures: 0, Errors: 0, Skipped: 0, Time elapsed: 1.275 sec
Forking command line: /bin/sh -c cd /x1/jenkins/jenkins-slave/workspace/HBase-0.94-security
&& /x1/jenkins/tools/java/jdk1.6.0_45-32/jre/bin/java -enableassertions -Xmx1900m
-Djava.security.egd=file:/dev/./urandom -jar /x1/jenkins/jenkins-slave/workspace/HBase-0.94-security/target/surefire/surefirebooter4450361666994732409.jar
/x1/jenkins/jenkins-slave/workspace/HBase-0.94-security/target/surefire/surefire7147292053080559688tmp
/x1/jenkins/jenkins-slave/workspace/HBase-0.94-security/target/surefire/surefire_1294507769635199708304tmp
Running org.apache.hadoop.hbase.TestHBaseFileSystem
Tests run: 2, Failures: 0, Errors: 0, Skipped: 0, Time elapsed: 24.763 sec
Forking command line: /bin/sh -c cd /x1/jenkins/jenkins-slave/workspace/HBase-0.94-security
&& /x1/jenkins/tools/java/jdk1.6.0_45-32/jre/bin/java -enableassertions -Xmx1900m
-Djava.security.egd=file:/dev/./urandom -jar /x1/jenkins/jenkins-slave/workspace/HBase-0.94-security/target/surefire/surefirebooter3377376410986150055.jar
/x1/jenkins/jenkins-slave/workspace/HBase-0.94-security/target/surefire/surefire5132335658999343212tmp
/x1/jenkins/jenkins-slave/workspace/HBase-0.94-security/target/surefire/surefire_1308714286221874014051tmp
Running org.apache.hadoop.hbase.io.hfile.TestHFileBlockIndex
Tests run: 10, Failures: 0, Errors: 0, Skipped: 0, Time elapsed: 8.654 sec
Forking command line: /bin/sh -c cd /x1/jenkins/jenkins-slave/workspace/HBase-0.94-security
&& /x1/jenkins/tools/java/jdk1.6.0_45-32/jre/bin/java -enableassertions -Xmx1900m
-Djava.security.egd=file:/dev/./urandom -jar /x1/jenkins/jenkins-slave/workspace/HBase-0.94-security/target/surefire/surefirebooter8046574404501469473.jar
/x1/jenkins/jenkins-slave/workspace/HBase-0.94-security/target/surefire/surefire6066359233768122831tmp
/x1/jenkins/jenkins-slave/workspace/HBase-0.94-security/target/surefire/surefire_1311964641038683351991tmp
Running org.apache.hadoop.hbase.io.hfile.TestHFileSeek
Tests run: 1, Failures: 0, Errors: 0, Skipped: 0, Time elapsed: 4.801 sec
Forking command line: /bin/sh -c cd /x1/jenkins/jenkins-slave/workspace/HBase-0.94-security
&& /x1/jenkins/tools/java/jdk1.6.0_45-32/jre/bin/java -enableassertions -Xmx1900m
-Djava.security.egd=file:/dev/./urandom -jar /x1/jenkins/jenkins-slave/workspace/HBase-0.94-security/target/surefire/surefirebooter9041556324215185404.jar
/x1/jenkins/jenkins-slave/workspace/HBase-0.94-security/target/surefire/surefire3287810532705988881tmp
/x1/jenkins/jenkins-slave/workspace/HBase-0.94-security/target/surefire/surefire_1326156811800309261845tmp
Running org.apache.hadoop.hbase.io.hfile.TestLruBlockCache
Tests run: 16, Failures: 0, Errors: 0, Skipped: 0, Time elapsed: 1.071 sec
Forking command line: /bin/sh -c cd /x1/jenkins/jenkins-slave/workspace/HBase-0.94-security
&& /x1/jenkins/tools/java/jdk1.6.0_45-32/jre/bin/java -enableassertions -Xmx1900m
-Djava.security.egd=file:/dev/./urandom -jar /x1/jenkins/jenkins-slave/workspace/HBase-0.94-security/target/surefire/surefirebooter233500044666650815.jar
/x1/jenkins/jenkins-slave/workspace/HBase-0.94-security/target/surefire/surefire929404888233914464tmp
/x1/jenkins/jenkins-slave/workspace/HBase-0.94-security/target/surefire/surefire_1338733462072766881161tmp
Running org.apache.hadoop.hbase.io.hfile.TestFixedFileTrailer
Tests run: 2, Failures: 0, Errors: 0, Skipped: 0, Time elapsed: 0.766 sec
Forking command line: /bin/sh -c cd /x1/jenkins/jenkins-slave/workspace/HBase-0.94-security
&& /x1/jenkins/tools/java/jdk1.6.0_45-32/jre/bin/java -enableassertions -Xmx1900m
-Djava.security.egd=file:/dev/./urandom -jar /x1/jenkins/jenkins-slave/workspace/HBase-0.94-security/target/surefire/surefirebooter6954669672655320566.jar
/x1/jenkins/jenkins-slave/workspace/HBase-0.94-security/target/surefire/surefire4057224537128238721tmp
/x1/jenkins/jenkins-slave/workspace/HBase-0.94-security/target/surefire/surefire_1343984729545986878990tmp
Running org.apache.hadoop.hbase.io.hfile.TestHFilePerformance
Tests run: 1, Failures: 0, Errors: 0, Skipped: 0, Time elapsed: 5.008 sec
Forking command line: /bin/sh -c cd /x1/jenkins/jenkins-slave/workspace/HBase-0.94-security
&& /x1/jenkins/tools/java/jdk1.6.0_45-32/jre/bin/java -enableassertions -Xmx1900m
-Djava.security.egd=file:/dev/./urandom -jar /x1/jenkins/jenkins-slave/workspace/HBase-0.94-security/target/surefire/surefirebooter6192054670528904422.jar
/x1/jenkins/jenkins-slave/workspace/HBase-0.94-security/target/surefire/surefire8899830863417508806tmp
/x1/jenkins/jenkins-slave/workspace/HBase-0.94-security/target/surefire/surefire_1356905817934213627533tmp
Running org.apache.hadoop.hbase.io.hfile.TestHFileBlockCompatibility
Tests run: 10, Failures: 0, Errors: 0, Skipped: 0, Time elapsed: 1.173 sec
Forking command line: /bin/sh -c cd /x1/jenkins/jenkins-slave/workspace/HBase-0.94-security
&& /x1/jenkins/tools/java/jdk1.6.0_45-32/jre/bin/java -enableassertions -Xmx1900m
-Djava.security.egd=file:/dev/./urandom -jar /x1/jenkins/jenkins-slave/workspace/HBase-0.94-security/target/surefire/surefirebooter6959927196696329699.jar
/x1/jenkins/jenkins-slave/workspace/HBase-0.94-security/target/surefire/surefire4372448537509681900tmp
/x1/jenkins/jenkins-slave/workspace/HBase-0.94-security/target/surefire/surefire_1361903244892362542851tmp
Running org.apache.hadoop.hbase.io.hfile.TestCacheOnWrite
Tests run: 36, Failures: 0, Errors: 0, Skipped: 0, Time elapsed: 30.22 sec
Forking command line: /bin/sh -c cd /x1/jenkins/jenkins-slave/workspace/HBase-0.94-security
&& /x1/jenkins/tools/java/jdk1.6.0_45-32/jre/bin/java -enableassertions -Xmx1900m
-Djava.security.egd=file:/dev/./urandom -jar /x1/jenkins/jenkins-slave/workspace/HBase-0.94-security/target/surefire/surefirebooter3379966693634930451.jar
/x1/jenkins/jenkins-slave/workspace/HBase-0.94-security/target/surefire/surefire610102616091733935tmp
/x1/jenkins/jenkins-slave/workspace/HBase-0.94-security/target/surefire/surefire_1373117426508815211813tmp
Running org.apache.hadoop.hbase.io.hfile.TestChecksum
Tests run: 3, Failures: 0, Errors: 0, Skipped: 0, Time elapsed: 0.909 sec
Forking command line: /bin/sh -c cd /x1/jenkins/jenkins-slave/workspace/HBase-0.94-security
&& /x1/jenkins/tools/java/jdk1.6.0_45-32/jre/bin/java -enableassertions -Xmx1900m
-Djava.security.egd=file:/dev/./urandom -jar /x1/jenkins/jenkins-slave/workspace/HBase-0.94-security/target/surefire/surefirebooter116920583230724669.jar
/x1/jenkins/jenkins-slave/workspace/HBase-0.94-security/target/surefire/surefire8897082758529258249tmp
/x1/jenkins/jenkins-slave/workspace/HBase-0.94-security/target/surefire/surefire_1386956817028810452438tmp
Running org.apache.hadoop.hbase.io.hfile.TestForceCacheImportantBlocks
Tests run: 6, Failures: 0, Errors: 0, Skipped: 0, Time elapsed: 65.271 sec
Forking command line: /bin/sh -c cd /x1/jenkins/jenkins-slave/workspace/HBase-0.94-security
&& /x1/jenkins/tools/java/jdk1.6.0_45-32/jre/bin/java -enableassertions -Xmx1900m
-Djava.security.egd=file:/dev/./urandom -jar /x1/jenkins/jenkins-slave/workspace/HBase-0.94-security/target/surefire/surefirebooter5042599974821718742.jar
/x1/jenkins/jenkins-slave/workspace/HBase-0.94-security/target/surefire/surefire5806401807402659715tmp
/x1/jenkins/jenkins-slave/workspace/HBase-0.94-security/target/surefire/surefire_1394479696799613451724tmp
Running org.apache.hadoop.hbase.io.hfile.slab.TestSlabCache
Tests run: 7, Failures: 0, Errors: 0, Skipped: 0, Time elapsed: 20.746 sec
Forking command line: /bin/sh -c cd /x1/jenkins/jenkins-slave/workspace/HBase-0.94-security
&& /x1/jenkins/tools/java/jdk1.6.0_45-32/jre/bin/java -enableassertions -Xmx1900m
-Djava.security.egd=file:/dev/./urandom -jar /x1/jenkins/jenkins-slave/workspace/HBase-0.94-security/target/surefire/surefirebooter4781664283312953778.jar
/x1/jenkins/jenkins-slave/workspace/HBase-0.94-security/target/surefire/surefire5583468574109555984tmp
/x1/jenkins/jenkins-slave/workspace/HBase-0.94-security/target/surefire/surefire_1408478682828299354563tmp
Running org.apache.hadoop.hbase.io.hfile.TestHFileBlock
Tests run: 16, Failures: 0, Errors: 0, Skipped: 0, Time elapsed: 54.488 sec
Forking command line: /bin/sh -c cd /x1/jenkins/jenkins-slave/workspace/HBase-0.94-security
&& /x1/jenkins/tools/java/jdk1.6.0_45-32/jre/bin/java -enableassertions -Xmx1900m
-Djava.security.egd=file:/dev/./urandom -jar /x1/jenkins/jenkins-slave/workspace/HBase-0.94-security/target/surefire/surefirebooter8149848994311652653.jar
/x1/jenkins/jenkins-slave/workspace/HBase-0.94-security/target/surefire/surefire3481732428934733098tmp
/x1/jenkins/jenkins-slave/workspace/HBase-0.94-security/target/surefire/surefire_1411753487255761792643tmp
Running org.apache.hadoop.hbase.io.hfile.slab.TestSingleSizeCache
Tests run: 5, Failures: 0, Errors: 0, Skipped: 0, Time elapsed: 22.079 sec
Forking command line: /bin/sh -c cd /x1/jenkins/jenkins-slave/workspace/HBase-0.94-security
&& /x1/jenkins/tools/java/jdk1.6.0_45-32/jre/bin/java -enableassertions -Xmx1900m
-Djava.security.egd=file:/dev/./urandom -jar /x1/jenkins/jenkins-slave/workspace/HBase-0.94-security/target/surefire/surefirebooter4809475689003161040.jar
/x1/jenkins/jenkins-slave/workspace/HBase-0.94-security/target/surefire/surefire4885504895232407714tmp
/x1/jenkins/jenkins-slave/workspace/HBase-0.94-security/target/surefire/surefire_1425398229820662953705tmp
Running org.apache.hadoop.hbase.io.TestFileLink
Tests run: 3, Failures: 0, Errors: 0, Skipped: 0, Time elapsed: 21.362 sec
Forking command line: /bin/sh -c cd /x1/jenkins/jenkins-slave/workspace/HBase-0.94-security
&& /x1/jenkins/tools/java/jdk1.6.0_45-32/jre/bin/java -enableassertions -Xmx1900m
-Djava.security.egd=file:/dev/./urandom -jar /x1/jenkins/jenkins-slave/workspace/HBase-0.94-security/target/surefire/surefirebooter6335863603278671040.jar
/x1/jenkins/jenkins-slave/workspace/HBase-0.94-security/target/surefire/surefire358649027725195960tmp
/x1/jenkins/jenkins-slave/workspace/HBase-0.94-security/target/surefire/surefire_1437651782936649295166tmp
Running org.apache.hadoop.hbase.replication.TestReplicationZookeeper
Tests run: 1, Failures: 0, Errors: 0, Skipped: 0, Time elapsed: 0.923 sec
Forking command line: /bin/sh -c cd /x1/jenkins/jenkins-slave/workspace/HBase-0.94-security
&& /x1/jenkins/tools/java/jdk1.6.0_45-32/jre/bin/java -enableassertions -Xmx1900m
-Djava.security.egd=file:/dev/./urandom -jar /x1/jenkins/jenkins-slave/workspace/HBase-0.94-security/target/surefire/surefirebooter2650730484775653193.jar
/x1/jenkins/jenkins-slave/workspace/HBase-0.94-security/target/surefire/surefire1607456891673998912tmp
/x1/jenkins/jenkins-slave/workspace/HBase-0.94-security/target/surefire/surefire_1441984146040684534478tmp
Running org.apache.hadoop.hbase.io.encoding.TestLoadAndSwitchEncodeOnDisk
Tests run: 1, Failures: 0, Errors: 0, Skipped: 0, Time elapsed: 31.8 sec
Forking command line: /bin/sh -c cd /x1/jenkins/jenkins-slave/workspace/HBase-0.94-security
&& /x1/jenkins/tools/java/jdk1.6.0_45-32/jre/bin/java -enableassertions -Xmx1900m
-Djava.security.egd=file:/dev/./urandom -jar /x1/jenkins/jenkins-slave/workspace/HBase-0.94-security/target/surefire/surefirebooter2476336515513134513.jar
/x1/jenkins/jenkins-slave/workspace/HBase-0.94-security/target/surefire/surefire3635683945965454375tmp
/x1/jenkins/jenkins-slave/workspace/HBase-0.94-security/target/surefire/surefire_1453956934250831828262tmp
Running org.apache.hadoop.hbase.replication.regionserver.TestReplicationSink
Tests run: 5, Failures: 0, Errors: 0, Skipped: 0, Time elapsed: 22.947 sec
Forking command line: /bin/sh -c cd /x1/jenkins/jenkins-slave/workspace/HBase-0.94-security
&& /x1/jenkins/tools/java/jdk1.6.0_45-32/jre/bin/java -enableassertions -Xmx1900m
-Djava.security.egd=file:/dev/./urandom -jar /x1/jenkins/jenkins-slave/workspace/HBase-0.94-security/target/surefire/surefirebooter5232290906798342437.jar
/x1/jenkins/jenkins-slave/workspace/HBase-0.94-security/target/surefire/surefire6576747709542632969tmp
/x1/jenkins/jenkins-slave/workspace/HBase-0.94-security/target/surefire/surefire_1467350936987606350416tmp
Running org.apache.hadoop.hbase.replication.regionserver.TestReplicationSourceManager
Tests run: 3, Failures: 0, Errors: 0, Skipped: 0, Time elapsed: 2.867 sec
Forking command line: /bin/sh -c cd /x1/jenkins/jenkins-slave/workspace/HBase-0.94-security
&& /x1/jenkins/tools/java/jdk1.6.0_45-32/jre/bin/java -enableassertions -Xmx1900m
-Djava.security.egd=file:/dev/./urandom -jar /x1/jenkins/jenkins-slave/workspace/HBase-0.94-security/target/surefire/surefirebooter891568222760273878.jar
/x1/jenkins/jenkins-slave/workspace/HBase-0.94-security/target/surefire/surefire6738684058364833806tmp
/x1/jenkins/jenkins-slave/workspace/HBase-0.94-security/target/surefire/surefire_1475330058072067355587tmp
Running org.apache.hadoop.hbase.util.TestFSTableDescriptors
Tests run: 11, Failures: 0, Errors: 0, Skipped: 0, Time elapsed: 0.966 sec
Forking command line: /bin/sh -c cd /x1/jenkins/jenkins-slave/workspace/HBase-0.94-security
&& /x1/jenkins/tools/java/jdk1.6.0_45-32/jre/bin/java -enableassertions -Xmx1900m
-Djava.security.egd=file:/dev/./urandom -jar /x1/jenkins/jenkins-slave/workspace/HBase-0.94-security/target/surefire/surefirebooter823830616913984525.jar
/x1/jenkins/jenkins-slave/workspace/HBase-0.94-security/target/surefire/surefire9041397272259175469tmp
/x1/jenkins/jenkins-slave/workspace/HBase-0.94-security/target/surefire/surefire_1488969933672546661488tmp
Running org.apache.hadoop.hbase.replication.TestReplicationSource
Tests run: 1, Failures: 0, Errors: 0, Skipped: 0, Time elapsed: 4.614 sec
Forking command line: /bin/sh -c cd /x1/jenkins/jenkins-slave/workspace/HBase-0.94-security
&& /x1/jenkins/tools/java/jdk1.6.0_45-32/jre/bin/java -enableassertions -Xmx1900m
-Djava.security.egd=file:/dev/./urandom -jar /x1/jenkins/jenkins-slave/workspace/HBase-0.94-security/target/surefire/surefirebooter7207556964571374430.jar
/x1/jenkins/jenkins-slave/workspace/HBase-0.94-security/target/surefire/surefire3233629844318558008tmp
/x1/jenkins/jenkins-slave/workspace/HBase-0.94-security/target/surefire/surefire_1495965086145589532638tmp
Running org.apache.hadoop.hbase.util.TestEnvironmentEdgeManager
Tests run: 2, Failures: 0, Errors: 0, Skipped: 0, Time elapsed: 0.384 sec
Forking command line: /bin/sh -c cd /x1/jenkins/jenkins-slave/workspace/HBase-0.94-security
&& /x1/jenkins/tools/java/jdk1.6.0_45-32/jre/bin/java -enableassertions -Xmx1900m
-Djava.security.egd=file:/dev/./urandom -jar /x1/jenkins/jenkins-slave/workspace/HBase-0.94-security/target/surefire/surefirebooter1108192165353725189.jar
/x1/jenkins/jenkins-slave/workspace/HBase-0.94-security/target/surefire/surefire8267969960365124572tmp
/x1/jenkins/jenkins-slave/workspace/HBase-0.94-security/target/surefire/surefire_1505710499225005564526tmp
Running org.apache.hadoop.hbase.util.TestIdLock
Tests run: 1, Failures: 0, Errors: 0, Skipped: 0, Time elapsed: 15.403 sec
Forking command line: /bin/sh -c cd /x1/jenkins/jenkins-slave/workspace/HBase-0.94-security
&& /x1/jenkins/tools/java/jdk1.6.0_45-32/jre/bin/java -enableassertions -Xmx1900m
-Djava.security.egd=file:/dev/./urandom -jar /x1/jenkins/jenkins-slave/workspace/HBase-0.94-security/target/surefire/surefirebooter2779172434231499593.jar
/x1/jenkins/jenkins-slave/workspace/HBase-0.94-security/target/surefire/surefire6478693905510410075tmp
/x1/jenkins/jenkins-slave/workspace/HBase-0.94-security/target/surefire/surefire_1518946228389806801362tmp
Running org.apache.hadoop.hbase.util.TestMergeTable
Tests run: 1, Failures: 0, Errors: 0, Skipped: 0, Time elapsed: 33.458 sec
Forking command line: /bin/sh -c cd /x1/jenkins/jenkins-slave/workspace/HBase-0.94-security
&& /x1/jenkins/tools/java/jdk1.6.0_45-32/jre/bin/java -enableassertions -Xmx1900m
-Djava.security.egd=file:/dev/./urandom -jar /x1/jenkins/jenkins-slave/workspace/HBase-0.94-security/target/surefire/surefirebooter8403152467153703888.jar
/x1/jenkins/jenkins-slave/workspace/HBase-0.94-security/target/surefire/surefire1403570745692466710tmp
/x1/jenkins/jenkins-slave/workspace/HBase-0.94-security/target/surefire/surefire_152957939028605768089tmp
Running org.apache.hadoop.hbase.util.TestPoolMap$TestRoundRobinPoolType
Tests run: 3, Failures: 0, Errors: 0, Skipped: 0, Time elapsed: 0.008 sec
Running org.apache.hadoop.hbase.util.TestPoolMap$TestThreadLocalPoolType
Tests run: 3, Failures: 0, Errors: 0, Skipped: 0, Time elapsed: 0.004 sec
Running org.apache.hadoop.hbase.util.TestPoolMap$TestReusablePoolType
Tests run: 3, Failures: 0, Errors: 0, Skipped: 0, Time elapsed: 0.029 sec
Forking command line: /bin/sh -c cd /x1/jenkins/jenkins-slave/workspace/HBase-0.94-security
&& /x1/jenkins/tools/java/jdk1.6.0_45-32/jre/bin/java -enableassertions -Xmx1900m
-Djava.security.egd=file:/dev/./urandom -jar /x1/jenkins/jenkins-slave/workspace/HBase-0.94-security/target/surefire/surefirebooter2071818514750645274.jar
/x1/jenkins/jenkins-slave/workspace/HBase-0.94-security/target/surefire/surefire3183248582172156165tmp
/x1/jenkins/jenkins-slave/workspace/HBase-0.94-security/target/surefire/surefire_1539086444541186427948tmp
Running org.apache.hadoop.hbase.util.TestFSUtils
Tests run: 4, Failures: 0, Errors: 0, Skipped: 0, Time elapsed: 34.898 sec
Forking command line: /bin/sh -c cd /x1/jenkins/jenkins-slave/workspace/HBase-0.94-security
&& /x1/jenkins/tools/java/jdk1.6.0_45-32/jre/bin/java -enableassertions -Xmx1900m
-Djava.security.egd=file:/dev/./urandom -jar /x1/jenkins/jenkins-slave/workspace/HBase-0.94-security/target/surefire/surefirebooter6809205096571487731.jar
/x1/jenkins/jenkins-slave/workspace/HBase-0.94-security/target/surefire/surefire5221309152901472568tmp
/x1/jenkins/jenkins-slave/workspace/HBase-0.94-security/target/surefire/surefire_1542589886582805903569tmp
Running org.apache.hadoop.hbase.util.TestRegionSplitter
Tests run: 5, Failures: 0, Errors: 0, Skipped: 0, Time elapsed: 25.673 sec
Forking command line: /bin/sh -c cd /x1/jenkins/jenkins-slave/workspace/HBase-0.94-security
&& /x1/jenkins/tools/java/jdk1.6.0_45-32/jre/bin/java -enableassertions -Xmx1900m
-Djava.security.egd=file:/dev/./urandom -jar /x1/jenkins/jenkins-slave/workspace/HBase-0.94-security/target/surefire/surefirebooter9075925845792696119.jar
/x1/jenkins/jenkins-slave/workspace/HBase-0.94-security/target/surefire/surefire3692507918980974592tmp
/x1/jenkins/jenkins-slave/workspace/HBase-0.94-security/target/surefire/surefire_1557723793343348486898tmp
Running org.apache.hadoop.hbase.util.TestFSVisitor
Tests run: 3, Failures: 0, Errors: 0, Skipped: 0, Time elapsed: 1.6 sec
Forking command line: /bin/sh -c cd /x1/jenkins/jenkins-slave/workspace/HBase-0.94-security
&& /x1/jenkins/tools/java/jdk1.6.0_45-32/jre/bin/java -enableassertions -Xmx1900m
-Djava.security.egd=file:/dev/./urandom -jar /x1/jenkins/jenkins-slave/workspace/HBase-0.94-security/target/surefire/surefirebooter4888004737081571142.jar
/x1/jenkins/jenkins-slave/workspace/HBase-0.94-security/target/surefire/surefire499201174031390601tmp
/x1/jenkins/jenkins-slave/workspace/HBase-0.94-security/target/surefire/surefire_1567368702200939075269tmp
Running org.apache.hadoop.hbase.util.TestCoprocessorScanPolicy
Tests run: 2, Failures: 0, Errors: 0, Skipped: 0, Time elapsed: 22.689 sec
Forking command line: /bin/sh -c cd /x1/jenkins/jenkins-slave/workspace/HBase-0.94-security
&& /x1/jenkins/tools/java/jdk1.6.0_45-32/jre/bin/java -enableassertions -Xmx1900m
-Djava.security.egd=file:/dev/./urandom -jar /x1/jenkins/jenkins-slave/workspace/HBase-0.94-security/target/surefire/surefirebooter2423391281587299279.jar
/x1/jenkins/jenkins-slave/workspace/HBase-0.94-security/target/surefire/surefire829086993031682646tmp
/x1/jenkins/jenkins-slave/workspace/HBase-0.94-security/target/surefire/surefire_1575578367796309909797tmp
Running org.apache.hadoop.hbase.util.hbck.TestOfflineMetaRebuildBase
Tests run: 1, Failures: 0, Errors: 0, Skipped: 0, Time elapsed: 36.671 sec
Forking command line: /bin/sh -c cd /x1/jenkins/jenkins-slave/workspace/HBase-0.94-security
&& /x1/jenkins/tools/java/jdk1.6.0_45-32/jre/bin/java -enableassertions -Xmx1900m
-Djava.security.egd=file:/dev/./urandom -jar /x1/jenkins/jenkins-slave/workspace/HBase-0.94-security/target/surefire/surefirebooter2368410216635875241.jar
/x1/jenkins/jenkins-slave/workspace/HBase-0.94-security/target/surefire/surefire478547888329306541tmp
/x1/jenkins/jenkins-slave/workspace/HBase-0.94-security/target/surefire/surefire_1582717797989654860688tmp
Running org.apache.hadoop.hbase.util.hbck.TestOfflineMetaRebuildOverlap
Tests run: 1, Failures: 0, Errors: 0, Skipped: 0, Time elapsed: 33.298 sec
Forking command line: /bin/sh -c cd /x1/jenkins/jenkins-slave/workspace/HBase-0.94-security
&& /x1/jenkins/tools/java/jdk1.6.0_45-32/jre/bin/java -enableassertions -Xmx1900m
-Djava.security.egd=file:/dev/./urandom -jar /x1/jenkins/jenkins-slave/workspace/HBase-0.94-security/target/surefire/surefirebooter1618082185329036974.jar
/x1/jenkins/jenkins-slave/workspace/HBase-0.94-security/target/surefire/surefire6547342437999199094tmp
/x1/jenkins/jenkins-slave/workspace/HBase-0.94-security/target/surefire/surefire_1592316168656659622281tmp
Running org.apache.hadoop.hbase.util.TestDefaultEnvironmentEdge
Tests run: 1, Failures: 0, Errors: 0, Skipped: 0, Time elapsed: 0.207 sec
Forking command line: /bin/sh -c cd /x1/jenkins/jenkins-slave/workspace/HBase-0.94-security
&& /x1/jenkins/tools/java/jdk1.6.0_45-32/jre/bin/java -enableassertions -Xmx1900m
-Djava.security.egd=file:/dev/./urandom -jar /x1/jenkins/jenkins-slave/workspace/HBase-0.94-security/target/surefire/surefirebooter5649751861242695751.jar
/x1/jenkins/jenkins-slave/workspace/HBase-0.94-security/target/surefire/surefire3326327232460620506tmp
/x1/jenkins/jenkins-slave/workspace/HBase-0.94-security/target/surefire/surefire_1606343694365053411216tmp
Running org.apache.hadoop.hbase.util.TestFSHDFSUtils
Tests run: 3, Failures: 0, Errors: 0, Skipped: 0, Time elapsed: 3.771 sec
Forking command line: /bin/sh -c cd /x1/jenkins/jenkins-slave/workspace/HBase-0.94-security
&& /x1/jenkins/tools/java/jdk1.6.0_45-32/jre/bin/java -enableassertions -Xmx1900m
-Djava.security.egd=file:/dev/./urandom -jar /x1/jenkins/jenkins-slave/workspace/HBase-0.94-security/target/surefire/surefirebooter10564424011237.jar
/x1/jenkins/jenkins-slave/workspace/HBase-0.94-security/target/surefire/surefire6887394692991103782tmp
/x1/jenkins/jenkins-slave/workspace/HBase-0.94-security/target/surefire/surefire_1611661514282927780597tmp
Running org.apache.hadoop.hbase.util.hbck.TestOfflineMetaRebuildHole
Tests run: 1, Failures: 0, Errors: 0, Skipped: 0, Time elapsed: 32.787 sec
Forking command line: /bin/sh -c cd /x1/jenkins/jenkins-slave/workspace/HBase-0.94-security
&& /x1/jenkins/tools/java/jdk1.6.0_45-32/jre/bin/java -enableassertions -Xmx1900m
-Djava.security.egd=file:/dev/./urandom -jar /x1/jenkins/jenkins-slave/workspace/HBase-0.94-security/target/surefire/surefirebooter5097204319310933491.jar
/x1/jenkins/jenkins-slave/workspace/HBase-0.94-security/target/surefire/surefire3470294442422075948tmp
/x1/jenkins/jenkins-slave/workspace/HBase-0.94-security/target/surefire/surefire_1627253623107158199705tmp
Running org.apache.hadoop.hbase.TestInfoServers
Tests run: 3, Failures: 0, Errors: 0, Skipped: 0, Time elapsed: 17.602 sec
Running org.apache.hadoop.hbase.util.TestSizeBasedThrottler
Tests run: 3, Failures: 0, Errors: 0, Skipped: 0, Time elapsed: 44.634 sec

Results :

Tests run: 930, Failures: 0, Errors: 0, Skipped: 2

[INFO] ------------------------------------------------------------------------
[INFO] BUILD FAILURE
[INFO] ------------------------------------------------------------------------
[INFO] Total time: 59:02.465s
[INFO] Finished at: Thu Oct 02 01:15:05 UTC 2014
[INFO] Final Memory: 70M/591M
[INFO] ------------------------------------------------------------------------
[ERROR] Failed to execute goal org.apache.maven.plugins:maven-surefire-plugin:2.12-TRUNK-HBASE-2:test
(secondPartTestsExecution) on project hbase: Failure or timeout -> [Help 1]
org.apache.maven.lifecycle.LifecycleExecutionException: Failed to execute goal org.apache.maven.plugins:maven-surefire-plugin:2.12-TRUNK-HBASE-2:test
(secondPartTestsExecution) on project hbase: Failure or timeout
	at org.apache.maven.lifecycle.internal.MojoExecutor.execute(MojoExecutor.java:217)
	at org.apache.maven.lifecycle.internal.MojoExecutor.execute(MojoExecutor.java:153)
	at org.apache.maven.lifecycle.internal.MojoExecutor.execute(MojoExecutor.java:145)
	at org.apache.maven.lifecycle.internal.MojoExecutor.executeForkedExecutions(MojoExecutor.java:365)
	at org.apache.maven.lifecycle.internal.MojoExecutor.execute(MojoExecutor.java:199)
	at org.apache.maven.lifecycle.internal.MojoExecutor.execute(MojoExecutor.java:153)
	at org.apache.maven.lifecycle.internal.MojoExecutor.execute(MojoExecutor.java:145)
	at org.apache.maven.lifecycle.internal.LifecycleModuleBuilder.buildProject(LifecycleModuleBuilder.java:84)
	at org.apache.maven.lifecycle.internal.LifecycleModuleBuilder.buildProject(LifecycleModuleBuilder.java:59)
	at org.apache.maven.lifecycle.internal.LifecycleStarter.singleThreadedBuild(LifecycleStarter.java:183)
	at org.apache.maven.lifecycle.internal.LifecycleStarter.execute(LifecycleStarter.java:161)
	at org.apache.maven.DefaultMaven.doExecute(DefaultMaven.java:320)
	at org.apache.maven.DefaultMaven.execute(DefaultMaven.java:156)
	at org.apache.maven.cli.MavenCli.execute(MavenCli.java:537)
	at org.apache.maven.cli.MavenCli.doMain(MavenCli.java:196)
	at org.apache.maven.cli.MavenCli.main(MavenCli.java:141)
	at sun.reflect.NativeMethodAccessorImpl.invoke0(Native Method)
	at sun.reflect.NativeMethodAccessorImpl.invoke(NativeMethodAccessorImpl.java:39)
	at sun.reflect.DelegatingMethodAccessorImpl.invoke(DelegatingMethodAccessorImpl.java:25)
	at java.lang.reflect.Method.invoke(Method.java:597)
	at org.codehaus.plexus.classworlds.launcher.Launcher.launchEnhanced(Launcher.java:290)
	at org.codehaus.plexus.classworlds.launcher.Launcher.launch(Launcher.java:230)
	at org.codehaus.plexus.classworlds.launcher.Launcher.mainWithExitCode(Launcher.java:409)
	at org.codehaus.plexus.classworlds.launcher.Launcher.main(Launcher.java:352)
Caused by: org.apache.maven.plugin.MojoExecutionException: Failure or timeout
	at org.apache.maven.plugin.surefire.SurefirePlugin.assertNoFailureOrTimeout(SurefirePlugin.java:643)
	at org.apache.maven.plugin.surefire.SurefirePlugin.handleSummary(SurefirePlugin.java:624)
	at org.apache.maven.plugin.surefire.AbstractSurefireMojo.executeAfterPreconditionsChecked(AbstractSurefireMojo.java:137)
	at org.apache.maven.plugin.surefire.AbstractSurefireMojo.execute(AbstractSurefireMojo.java:98)
	at org.apache.maven.plugin.DefaultBuildPluginManager.executeMojo(DefaultBuildPluginManager.java:101)
	at org.apache.maven.lifecycle.internal.MojoExecutor.execute(MojoExecutor.java:209)
	... 23 more
[ERROR] 
[ERROR] 
[ERROR] For more information about the errors and possible solutions, please read the following
articles:
[ERROR] [Help 1] http://cwiki.apache.org/confluence/display/MAVEN/MojoExecutionException
Build step 'Invoke top-level Maven targets' marked build as failure
Archiving artifacts
Sending artifact delta relative to HBase-0.94-security #542
Archived 957 artifacts
Archive block size is 32768
Received 8 blocks and 123789742 bytes
Compression is 0.2%
Took 48 sec
Updating HBASE-12065
Recording test results

Mime
View raw message