hbase-builds mailing list archives

Site index · List index
Message view « Date » · « Thread »
Top « Date » · « Thread »
From Apache Jenkins Server <jenk...@builds.apache.org>
Subject Build failed in Jenkins: HBase-TRUNK #5620
Date Sat, 04 Oct 2014 04:14:44 GMT
See <https://builds.apache.org/job/HBase-TRUNK/5620/changes>

Changes:

[stack] HBASE-12148 RegionServerTracker should escape data in log messages

------------------------------------------
[...truncated 1728 lines...]
Tests run: 1, Failures: 0, Errors: 0, Skipped: 0, Time elapsed: 20.055 sec - in org.apache.hadoop.hbase.replication.TestReplicationDisableInactivePeer
Running org.apache.hadoop.hbase.replication.TestReplicationKillMasterRSCompressed
Tests run: 4, Failures: 0, Errors: 0, Skipped: 0, Time elapsed: 81.926 sec - in org.apache.hadoop.hbase.mapred.TestTableMapReduceUtil
Tests run: 1, Failures: 0, Errors: 0, Skipped: 0, Time elapsed: 16.078 sec - in org.apache.hadoop.hbase.replication.TestReplicationKillMasterRSCompressed
Tests run: 28, Failures: 0, Errors: 0, Skipped: 0, Time elapsed: 181.447 sec - in org.apache.hadoop.hbase.io.encoding.TestDataBlockEncoders
Running org.apache.hadoop.hbase.replication.regionserver.TestReplicationHLogReaderManager
Running org.apache.hadoop.hbase.replication.TestPerTableCFReplication
Running org.apache.hadoop.hbase.replication.regionserver.TestReplicationSink
Tests run: 5, Failures: 0, Errors: 0, Skipped: 0, Time elapsed: 1.995 sec - in org.apache.hadoop.hbase.replication.regionserver.TestReplicationSink
Running org.apache.hadoop.hbase.replication.regionserver.TestReplicationSourceManager
Tests run: 4, Failures: 0, Errors: 0, Skipped: 0, Time elapsed: 4.528 sec - in org.apache.hadoop.hbase.replication.regionserver.TestReplicationSourceManager
Tests run: 2, Failures: 0, Errors: 0, Skipped: 0, Time elapsed: 88.759 sec - in org.apache.hadoop.hbase.mapred.TestTableMapReduce
Running org.apache.hadoop.hbase.replication.regionserver.TestRegionReplicaReplicationEndpoint
Running org.apache.hadoop.hbase.replication.regionserver.TestRegionReplicaReplicationEndpointNoMaster
Tests run: 2, Failures: 0, Errors: 0, Skipped: 0, Time elapsed: 24.5 sec - in org.apache.hadoop.hbase.replication.TestPerTableCFReplication
Running org.apache.hadoop.hbase.replication.TestReplicationSource
Tests run: 1, Failures: 0, Errors: 0, Skipped: 0, Time elapsed: 0.721 sec - in org.apache.hadoop.hbase.replication.TestReplicationSource
Running org.apache.hadoop.hbase.replication.TestReplicationChangingPeerRegionservers
Tests run: 1, Failures: 0, Errors: 0, Skipped: 0, Time elapsed: 6.943 sec - in org.apache.hadoop.hbase.replication.TestReplicationChangingPeerRegionservers
Tests run: 3, Failures: 0, Errors: 0, Skipped: 0, Time elapsed: 35.157 sec - in org.apache.hadoop.hbase.replication.regionserver.TestRegionReplicaReplicationEndpointNoMaster
Running org.apache.hadoop.hbase.replication.TestReplicationSyncUpTool
Running org.apache.hadoop.hbase.replication.TestReplicationKillMasterRS
Tests run: 1, Failures: 0, Errors: 0, Skipped: 0, Time elapsed: 18.562 sec - in org.apache.hadoop.hbase.replication.TestReplicationKillMasterRS
Running org.apache.hadoop.hbase.replication.TestMultiSlaveReplication
Tests run: 1, Failures: 0, Errors: 0, Skipped: 0, Time elapsed: 24.528 sec - in org.apache.hadoop.hbase.replication.TestMultiSlaveReplication
Tests run: 1, Failures: 0, Errors: 0, Skipped: 0, Time elapsed: 50.599 sec - in org.apache.hadoop.hbase.replication.TestReplicationSyncUpTool
Running org.apache.hadoop.hbase.replication.TestReplicationWithTags
Tests run: 1, Failures: 0, Errors: 0, Skipped: 0, Time elapsed: 7.079 sec - in org.apache.hadoop.hbase.replication.TestReplicationWithTags
Running org.apache.hadoop.hbase.replication.TestReplicationStateZKImpl
Running org.apache.hadoop.hbase.replication.TestReplicationKillSlaveRS
Tests run: 6, Failures: 0, Errors: 0, Skipped: 0, Time elapsed: 3.593 sec - in org.apache.hadoop.hbase.replication.TestReplicationStateZKImpl
Tests run: 1, Failures: 0, Errors: 0, Skipped: 0, Time elapsed: 15.589 sec - in org.apache.hadoop.hbase.replication.TestReplicationKillSlaveRS
Tests run: 6, Failures: 0, Errors: 0, Skipped: 0, Time elapsed: 265.687 sec - in org.apache.hadoop.hbase.mapred.TestTableSnapshotInputFormat
Running org.apache.hadoop.hbase.replication.TestMasterReplication
Running org.apache.hadoop.hbase.util.TestMergeTool
Running org.apache.hadoop.hbase.replication.TestReplicationSmallTests
Tests run: 1, Failures: 0, Errors: 0, Skipped: 0, Time elapsed: 23.205 sec - in org.apache.hadoop.hbase.util.TestMergeTool
Running org.apache.hadoop.hbase.util.TestFSTableDescriptors
Tests run: 13, Failures: 0, Errors: 0, Skipped: 0, Time elapsed: 1.692 sec - in org.apache.hadoop.hbase.util.TestFSTableDescriptors
Running org.apache.hadoop.hbase.util.TestHBaseFsckEncryption
Tests run: 1, Failures: 0, Errors: 0, Skipped: 0, Time elapsed: 16.001 sec - in org.apache.hadoop.hbase.util.TestHBaseFsckEncryption
Running org.apache.hadoop.hbase.util.TestIdLock
Tests run: 9, Failures: 0, Errors: 0, Skipped: 0, Time elapsed: 43.248 sec - in org.apache.hadoop.hbase.replication.TestReplicationSmallTests
Running org.apache.hadoop.hbase.util.TestMiniClusterLoadSequential
Tests run: 1, Failures: 0, Errors: 0, Skipped: 0, Time elapsed: 15.371 sec - in org.apache.hadoop.hbase.util.TestIdLock
Running org.apache.hadoop.hbase.util.TestMergeTable
Tests run: 3, Failures: 0, Errors: 0, Skipped: 0, Time elapsed: 65.768 sec - in org.apache.hadoop.hbase.replication.TestMasterReplication
Running org.apache.hadoop.hbase.util.TestMiniClusterLoadParallel
Tests run: 1, Failures: 0, Errors: 0, Skipped: 0, Time elapsed: 30.673 sec - in org.apache.hadoop.hbase.util.TestMergeTable
Tests run: 8, Failures: 0, Errors: 0, Skipped: 0, Time elapsed: 263.733 sec - in org.apache.hadoop.hbase.replication.regionserver.TestReplicationHLogReaderManager
Running org.apache.hadoop.hbase.util.TestFSUtils
Running org.apache.hadoop.hbase.util.TestHBaseFsck
Tests run: 7, Failures: 0, Errors: 0, Skipped: 0, Time elapsed: 23.328 sec - in org.apache.hadoop.hbase.util.TestFSUtils
Running org.apache.hadoop.hbase.util.TestRegionSplitter
Tests run: 4, Failures: 0, Errors: 0, Skipped: 0, Time elapsed: 78.514 sec - in org.apache.hadoop.hbase.util.TestMiniClusterLoadSequential
Running org.apache.hadoop.hbase.util.TestProcessBasedCluster
Tests run: 1, Failures: 0, Errors: 0, Skipped: 0, Time elapsed: 0.092 sec - in org.apache.hadoop.hbase.util.TestProcessBasedCluster
Running org.apache.hadoop.hbase.util.TestTableName
Tests run: 5, Failures: 0, Errors: 0, Skipped: 0, Time elapsed: 0.426 sec - in org.apache.hadoop.hbase.util.TestTableName
Tests run: 6, Failures: 0, Errors: 0, Skipped: 0, Time elapsed: 6.444 sec - in org.apache.hadoop.hbase.util.TestRegionSplitter
Running org.apache.hadoop.hbase.util.TestMiniClusterLoadEncoded
Tests run: 4, Failures: 0, Errors: 0, Skipped: 0, Time elapsed: 75.927 sec - in org.apache.hadoop.hbase.util.TestMiniClusterLoadParallel
Running org.apache.hadoop.hbase.util.TestFSVisitor
Running org.apache.hadoop.hbase.util.TestCoprocessorScanPolicy
Tests run: 3, Failures: 0, Errors: 0, Skipped: 0, Time elapsed: 4.57 sec - in org.apache.hadoop.hbase.util.TestFSVisitor
Running org.apache.hadoop.hbase.util.hbck.TestOfflineMetaRebuildBase
Tests run: 4, Failures: 0, Errors: 0, Skipped: 0, Time elapsed: 6.16 sec - in org.apache.hadoop.hbase.util.TestCoprocessorScanPolicy
Running org.apache.hadoop.hbase.util.hbck.TestOfflineMetaRebuildOverlap
Tests run: 1, Failures: 0, Errors: 0, Skipped: 0, Time elapsed: 23.113 sec - in org.apache.hadoop.hbase.util.hbck.TestOfflineMetaRebuildBase
Running org.apache.hadoop.hbase.util.hbck.TestOfflineMetaRebuildHole
Tests run: 1, Failures: 0, Errors: 0, Skipped: 0, Time elapsed: 24.06 sec - in org.apache.hadoop.hbase.util.hbck.TestOfflineMetaRebuildOverlap
Running org.apache.hadoop.hbase.util.TestDefaultEnvironmentEdge
Tests run: 7, Failures: 0, Errors: 5, Skipped: 0, Time elapsed: 317.953 sec <<< FAILURE!
- in org.apache.hadoop.hbase.replication.regionserver.TestRegionReplicaReplicationEndpoint
testRegionReplicaReplicationIgnoresDisabledTables(org.apache.hadoop.hbase.replication.regionserver.TestRegionReplicaReplicationEndpoint)
 Time elapsed: 60.064 sec  <<< ERROR!
java.lang.Exception: test timed out after 60000 milliseconds
	at java.lang.Object.hashCode(Native Method)
	at java.util.concurrent.ConcurrentHashMap.hash(ConcurrentHashMap.java:333)
	at java.util.concurrent.ConcurrentHashMap.remove(ConcurrentHashMap.java:1175)
	at org.apache.hadoop.hbase.regionserver.HRegion$RegionScannerImpl.close(HRegion.java:4357)
	at org.apache.hadoop.hbase.regionserver.HRegion.get(HRegion.java:5018)
	at org.apache.hadoop.hbase.regionserver.HRegion.get(HRegion.java:4988)
	at org.apache.hadoop.hbase.HBaseTestingUtility.verifyNumericRows(HBaseTestingUtility.java:1933)
	at org.apache.hadoop.hbase.replication.regionserver.TestRegionReplicaReplicationEndpoint$1.evaluate(TestRegionReplicaReplicationEndpoint.java:199)
	at org.apache.hadoop.hbase.Waiter.waitFor(Waiter.java:177)
	at org.apache.hadoop.hbase.Waiter.waitFor(Waiter.java:128)
	at org.apache.hadoop.hbase.replication.regionserver.TestRegionReplicaReplicationEndpoint.verifyReplication(TestRegionReplicaReplicationEndpoint.java:194)
	at org.apache.hadoop.hbase.replication.regionserver.TestRegionReplicaReplicationEndpoint.testRegionReplicaReplicationIgnoresDisabledTables(TestRegionReplicaReplicationEndpoint.java:337)
	at org.apache.hadoop.hbase.replication.regionserver.TestRegionReplicaReplicationEndpoint.testRegionReplicaReplicationIgnoresDisabledTables(TestRegionReplicaReplicationEndpoint.java:264)

testRegionReplicaReplicationWith3Replicas(org.apache.hadoop.hbase.replication.regionserver.TestRegionReplicaReplicationEndpoint)
 Time elapsed: 60.033 sec  <<< ERROR!
java.lang.Exception: test timed out after 60000 milliseconds
	at java.lang.Thread.sleep(Native Method)
	at org.apache.hadoop.hbase.Waiter.waitFor(Waiter.java:181)
	at org.apache.hadoop.hbase.Waiter.waitFor(Waiter.java:128)
	at org.apache.hadoop.hbase.replication.regionserver.TestRegionReplicaReplicationEndpoint.verifyReplication(TestRegionReplicaReplicationEndpoint.java:194)
	at org.apache.hadoop.hbase.replication.regionserver.TestRegionReplicaReplicationEndpoint.testRegionReplicaReplication(TestRegionReplicaReplicationEndpoint.java:164)
	at org.apache.hadoop.hbase.replication.regionserver.TestRegionReplicaReplicationEndpoint.testRegionReplicaReplicationWith3Replicas(TestRegionReplicaReplicationEndpoint.java:219)

testRegionReplicaReplicationWith10Replicas(org.apache.hadoop.hbase.replication.regionserver.TestRegionReplicaReplicationEndpoint)
 Time elapsed: 60.041 sec  <<< ERROR!
java.lang.Exception: test timed out after 60000 milliseconds
	at java.lang.Thread.sleep(Native Method)
	at org.apache.hadoop.hbase.Waiter.waitFor(Waiter.java:181)
	at org.apache.hadoop.hbase.Waiter.waitFor(Waiter.java:128)
	at org.apache.hadoop.hbase.replication.regionserver.TestRegionReplicaReplicationEndpoint.verifyReplication(TestRegionReplicaReplicationEndpoint.java:194)
	at org.apache.hadoop.hbase.replication.regionserver.TestRegionReplicaReplicationEndpoint.testRegionReplicaReplication(TestRegionReplicaReplicationEndpoint.java:164)
	at org.apache.hadoop.hbase.replication.regionserver.TestRegionReplicaReplicationEndpoint.testRegionReplicaReplicationWith10Replicas(TestRegionReplicaReplicationEndpoint.java:224)

testRegionReplicaReplicationWith2Replicas(org.apache.hadoop.hbase.replication.regionserver.TestRegionReplicaReplicationEndpoint)
 Time elapsed: 60.045 sec  <<< ERROR!
java.lang.Exception: test timed out after 60000 milliseconds
	at java.lang.Object.hashCode(Native Method)
	at java.util.concurrent.ConcurrentHashMap.hash(ConcurrentHashMap.java:333)
	at java.util.concurrent.ConcurrentHashMap.put(ConcurrentHashMap.java:1125)
	at java.util.Collections$SetFromMap.add(Collections.java:3903)
	at org.apache.hadoop.hbase.regionserver.HStore.addChangedReaderObserver(HStore.java:1076)
	at org.apache.hadoop.hbase.regionserver.StoreScanner.<init>(StoreScanner.java:177)
	at org.apache.hadoop.hbase.regionserver.HStore.getScanner(HStore.java:1890)
	at org.apache.hadoop.hbase.regionserver.HRegion$RegionScannerImpl.<init>(HRegion.java:4032)
	at org.apache.hadoop.hbase.regionserver.HRegion.instantiateRegionScanner(HRegion.java:2109)
	at org.apache.hadoop.hbase.regionserver.HRegion.getScanner(HRegion.java:2095)
	at org.apache.hadoop.hbase.regionserver.HRegion.getScanner(HRegion.java:2072)
	at org.apache.hadoop.hbase.regionserver.HRegion.get(HRegion.java:5014)
	at org.apache.hadoop.hbase.regionserver.HRegion.get(HRegion.java:4988)
	at org.apache.hadoop.hbase.HBaseTestingUtility.verifyNumericRows(HBaseTestingUtility.java:1933)
	at org.apache.hadoop.hbase.replication.regionserver.TestRegionReplicaReplicationEndpoint$1.evaluate(TestRegionReplicaReplicationEndpoint.java:199)
	at org.apache.hadoop.hbase.Waiter.waitFor(Waiter.java:177)
	at org.apache.hadoop.hbase.Waiter.waitFor(Waiter.java:128)
	at org.apache.hadoop.hbase.replication.regionserver.TestRegionReplicaReplicationEndpoint.verifyReplication(TestRegionReplicaReplicationEndpoint.java:194)
	at org.apache.hadoop.hbase.replication.regionserver.TestRegionReplicaReplicationEndpoint.testRegionReplicaReplication(TestRegionReplicaReplicationEndpoint.java:164)
	at org.apache.hadoop.hbase.replication.regionserver.TestRegionReplicaReplicationEndpoint.testRegionReplicaReplicationWith2Replicas(TestRegionReplicaReplicationEndpoint.java:214)

testRegionReplicaReplicationIgnoresDroppedTables(org.apache.hadoop.hbase.replication.regionserver.TestRegionReplicaReplicationEndpoint)
 Time elapsed: 60.024 sec  <<< ERROR!
java.lang.Exception: test timed out after 60000 milliseconds
	at java.lang.Thread.sleep(Native Method)
	at org.apache.hadoop.hbase.Waiter.waitFor(Waiter.java:181)
	at org.apache.hadoop.hbase.Waiter.waitFor(Waiter.java:128)
	at org.apache.hadoop.hbase.replication.regionserver.TestRegionReplicaReplicationEndpoint.verifyReplication(TestRegionReplicaReplicationEndpoint.java:194)
	at org.apache.hadoop.hbase.replication.regionserver.TestRegionReplicaReplicationEndpoint.testRegionReplicaReplicationIgnoresDisabledTables(TestRegionReplicaReplicationEndpoint.java:337)
	at org.apache.hadoop.hbase.replication.regionserver.TestRegionReplicaReplicationEndpoint.testRegionReplicaReplicationIgnoresDroppedTables(TestRegionReplicaReplicationEndpoint.java:269)

Tests run: 1, Failures: 0, Errors: 0, Skipped: 0, Time elapsed: 0.273 sec - in org.apache.hadoop.hbase.util.TestDefaultEnvironmentEdge
Running org.apache.hadoop.hbase.util.TestFSHDFSUtils
Tests run: 3, Failures: 0, Errors: 0, Skipped: 0, Time elapsed: 5.126 sec - in org.apache.hadoop.hbase.util.TestFSHDFSUtils
Running org.apache.hadoop.hbase.TestMetaTableAccessorNoCluster
Tests run: 2, Failures: 0, Errors: 0, Skipped: 0, Time elapsed: 3.408 sec - in org.apache.hadoop.hbase.TestMetaTableAccessorNoCluster
Tests run: 5, Failures: 0, Errors: 0, Skipped: 0, Time elapsed: 57.49 sec - in org.apache.hadoop.hbase.util.TestMiniClusterLoadEncoded
Tests run: 1, Failures: 0, Errors: 0, Skipped: 0, Time elapsed: 22.689 sec - in org.apache.hadoop.hbase.util.hbck.TestOfflineMetaRebuildHole
Running org.apache.hadoop.hbase.TestNamespace
Running org.apache.hadoop.hbase.TestInfoServers
Tests run: 3, Failures: 0, Errors: 0, Skipped: 0, Time elapsed: 2.983 sec - in org.apache.hadoop.hbase.TestInfoServers
Running org.apache.hadoop.hbase.TestMetaTableAccessor
Tests run: 9, Failures: 0, Errors: 0, Skipped: 1, Time elapsed: 9.281 sec - in org.apache.hadoop.hbase.TestNamespace
Tests run: 8, Failures: 0, Errors: 0, Skipped: 0, Time elapsed: 5.379 sec - in org.apache.hadoop.hbase.TestMetaTableAccessor
Tests run: 47, Failures: 0, Errors: 0, Skipped: 1, Time elapsed: 283.788 sec - in org.apache.hadoop.hbase.util.TestHBaseFsck

Results :

Tests in error: 
  TestRegionReplicaReplicationEndpoint.testRegionReplicaReplicationIgnoresDisabledTables:264->testRegionReplicaReplicationIgnoresDisabledTables:337->verifyReplication:194->Object.hashCode:-2
? 
  TestRegionReplicaReplicationEndpoint.testRegionReplicaReplicationWith3Replicas:219->testRegionReplicaReplication:164->verifyReplication:194
? 
  TestRegionReplicaReplicationEndpoint.testRegionReplicaReplicationWith10Replicas:224->testRegionReplicaReplication:164->verifyReplication:194
? 
  TestRegionReplicaReplicationEndpoint.testRegionReplicaReplicationWith2Replicas:214->testRegionReplicaReplication:164->verifyReplication:194->Object.hashCode:-2
? 
  TestRegionReplicaReplicationEndpoint.testRegionReplicaReplicationIgnoresDroppedTables:269->testRegionReplicaReplicationIgnoresDisabledTables:337->verifyReplication:194
? 

Tests run: 2040, Failures: 0, Errors: 5, Skipped: 19

[INFO] ------------------------------------------------------------------------
[INFO] Reactor Summary:
[INFO] 
[INFO] HBase ............................................. SUCCESS [3.316s]
[INFO] HBase - Annotations ............................... SUCCESS [1.569s]
[INFO] HBase - Common .................................... SUCCESS [59.038s]
[INFO] HBase - Protocol .................................. SUCCESS [7.971s]
[INFO] HBase - Client .................................... SUCCESS [1:05.618s]
[INFO] HBase - Hadoop Compatibility ...................... SUCCESS [7.128s]
[INFO] HBase - Hadoop Two Compatibility .................. SUCCESS [5.501s]
[INFO] HBase - Prefix Tree ............................... SUCCESS [7.767s]
[INFO] HBase - Server .................................... FAILURE [1:02:51.859s]
[INFO] HBase - Testing Util .............................. SKIPPED
[INFO] HBase - Thrift .................................... SKIPPED
[INFO] HBase - Shell ..................................... SKIPPED
[INFO] HBase - Integration Tests ......................... SKIPPED
[INFO] HBase - Examples .................................. SKIPPED
[INFO] HBase - Assembly .................................. SKIPPED
[INFO] ------------------------------------------------------------------------
[INFO] BUILD FAILURE
[INFO] ------------------------------------------------------------------------
[INFO] Total time: 1:05:30.571s
[INFO] Finished at: Sat Oct 04 04:11:51 UTC 2014
[INFO] Final Memory: 40M/266M
[INFO] ------------------------------------------------------------------------
[ERROR] Failed to execute goal org.apache.maven.plugins:maven-surefire-plugin:2.17:test (secondPartTestsExecution)
on project hbase-server: There are test failures.
[ERROR] 
[ERROR] Please refer to /x1/jenkins/jenkins-slave/workspace/HBase-TRUNK/hbase-server/target/surefire-reports
for the individual test results.
[ERROR] -> [Help 1]
[ERROR] 
[ERROR] To see the full stack trace of the errors, re-run Maven with the -e switch.
[ERROR] Re-run Maven using the -X switch to enable full debug logging.
[ERROR] 
[ERROR] For more information about the errors and possible solutions, please read the following
articles:
[ERROR] [Help 1] http://cwiki.apache.org/confluence/display/MAVEN/MojoFailureException
[ERROR] 
[ERROR] After correcting the problems, you can resume the build with the command
[ERROR]   mvn <goals> -rf :hbase-server
Build step 'Invoke top-level Maven targets' marked build as failure
Performing Post build task...
Match found for :.* : True
Logical operation result is TRUE
Running script  :   ZOMBIE_TESTS_COUNT=`jps | grep surefirebooter | wc -l`
  if [[ $ZOMBIE_TESTS_COUNT != 0 ]] ; then
    #It seems sometimes the tests are not dying immediately. Let's give them 10s
    echo "Suspicious java process found - waiting 10s to see if there are just slow to stop"
    sleep 10   
    ZOMBIE_TESTS_COUNT=`jps | grep surefirebooter | wc -l`
    if [[ $ZOMBIE_TESTS_COUNT != 0 ]] ; then
      echo "There are $ZOMBIE_TESTS_COUNT zombie tests, they should have been killed by surefire
but survived"
      echo "************ BEGIN zombies jstack extract"
      ZB_STACK=`jps | grep surefirebooter | cut -d ' ' -f 1 | xargs -n 1 jstack | grep ".test"
| grep "\.java"`
      jps | grep surefirebooter | cut -d ' ' -f 1 | xargs -n 1 jstack
      echo "************ END  zombies jstack extract"
      JIRA_COMMENT="$JIRA_COMMENT

     {color:red}-1 core zombie tests{color}.  There are ${ZOMBIE_TESTS_COUNT} zombie test(s):
${ZB_STACK}"
      BAD=1
      jps | grep surefirebooter | cut -d ' ' -f 1 | xargs kill -9
    else
      echo "We're ok: there is no zombie test, but some tests took some time to stop"
    fi
  else
    echo "We're ok: there is no zombie test"
  fi
[HBase-TRUNK] $ /bin/bash -xe /tmp/hudson7879503361515969107.sh
++ jps
++ grep surefirebooter
++ wc -l
+ ZOMBIE_TESTS_COUNT=0
+ [[ 0 != 0 ]]
+ echo 'We'\''re ok: there is no zombie test'
We're ok: there is no zombie test
POST BUILD TASK : SUCCESS
END OF POST BUILD TASK : 0
Archiving artifacts
Sending artifact delta relative to HBase-TRUNK #5564
Archived 1821 artifacts
Archive block size is 32768
Received 73 blocks and 546325940 bytes
Compression is 0.4%
Took 2 min 35 sec
Recording test results
Updating HBASE-12148

Mime
View raw message