hbase-builds mailing list archives

Site index · List index
Message view « Date » · « Thread »
Top « Date » · « Thread »
From Apache Jenkins Server <jenk...@builds.apache.org>
Subject Build failed in Jenkins: HBase-0.98-on-Hadoop-1.1 #537
Date Fri, 03 Oct 2014 04:25:13 GMT
See <https://builds.apache.org/job/HBase-0.98-on-Hadoop-1.1/537/changes>

Changes:

[tedyu] HBASE-10153 improve VerifyReplication to compute BADROWS more accurately (Jianwei)

[tedyu] HBASE-12164 Check for presence of user Id in SecureBulkLoadEndpoint#secureBulkLoadHFiles()
is inaccurate

------------------------------------------
[...truncated 919 lines...]
Running org.apache.hadoop.hbase.io.hfile.TestHFileWriterV3
Tests run: 4, Failures: 0, Errors: 0, Skipped: 0, Time elapsed: 1.511 sec
Running org.apache.hadoop.hbase.io.hfile.bucket.TestFileIOEngine
Tests run: 1, Failures: 0, Errors: 0, Skipped: 0, Time elapsed: 0.023 sec
Running org.apache.hadoop.hbase.io.hfile.bucket.TestBucketWriterThread
Tests run: 4, Failures: 0, Errors: 0, Skipped: 0, Time elapsed: 0.215 sec
Running org.apache.hadoop.hbase.io.hfile.bucket.TestByteBufferIOEngine
Tests run: 1, Failures: 0, Errors: 0, Skipped: 0, Time elapsed: 0.062 sec
Running org.apache.hadoop.hbase.io.hfile.bucket.TestBucketCache
Tests run: 8, Failures: 0, Errors: 0, Skipped: 0, Time elapsed: 15.253 sec
Running org.apache.hadoop.hbase.io.hfile.TestCachedBlockQueue
Tests run: 2, Failures: 0, Errors: 0, Skipped: 0, Time elapsed: 0.036 sec
Running org.apache.hadoop.hbase.io.hfile.TestPrefetch
Tests run: 1, Failures: 0, Errors: 0, Skipped: 0, Time elapsed: 1.038 sec
Running org.apache.hadoop.hbase.io.hfile.TestHFileDataBlockEncoder
Tests run: 30, Failures: 0, Errors: 0, Skipped: 0, Time elapsed: 0.604 sec
Running org.apache.hadoop.hbase.io.hfile.TestScannerSelectionUsingKeyRange
Tests run: 3, Failures: 0, Errors: 0, Skipped: 0, Time elapsed: 0.143 sec
Running org.apache.hadoop.hbase.io.hfile.TestHFileBlockCompatibility
Tests run: 16, Failures: 0, Errors: 0, Skipped: 0, Time elapsed: 0.921 sec
Running org.apache.hadoop.hbase.io.hfile.TestSeekTo
Tests run: 4, Failures: 0, Errors: 0, Skipped: 0, Time elapsed: 0.18 sec
Running org.apache.hadoop.hbase.io.hfile.TestHFileWriterV2
Tests run: 2, Failures: 0, Errors: 0, Skipped: 0, Time elapsed: 0.648 sec
Running org.apache.hadoop.hbase.io.hfile.TestHFileEncryption
Tests run: 3, Failures: 0, Errors: 0, Skipped: 0, Time elapsed: 1.829 sec
Running org.apache.hadoop.hbase.io.hfile.TestLruBlockCache
Tests run: 9, Failures: 0, Errors: 0, Skipped: 0, Time elapsed: 0.562 sec
Running org.apache.hadoop.hbase.io.hfile.TestHFile
Tests run: 7, Failures: 0, Errors: 0, Skipped: 0, Time elapsed: 0.282 sec
Running org.apache.hadoop.hbase.io.hfile.TestChecksum
Tests run: 3, Failures: 0, Errors: 0, Skipped: 0, Time elapsed: 0.233 sec
Running org.apache.hadoop.hbase.io.hfile.TestFixedFileTrailer
Tests run: 4, Failures: 0, Errors: 0, Skipped: 0, Time elapsed: 0.085 sec
Running org.apache.hadoop.hbase.io.TestHeapSize
Tests run: 3, Failures: 0, Errors: 0, Skipped: 0, Time elapsed: 0.055 sec
Running org.apache.hadoop.hbase.procedure.TestProcedureCoordinator
Tests run: 7, Failures: 0, Errors: 0, Skipped: 0, Time elapsed: 0.259 sec
Running org.apache.hadoop.hbase.procedure.TestProcedure
Tests run: 4, Failures: 0, Errors: 0, Skipped: 0, Time elapsed: 0.106 sec
Running org.apache.hadoop.hbase.procedure.TestProcedureMember
Tests run: 8, Failures: 0, Errors: 0, Skipped: 0, Time elapsed: 0.425 sec
Running org.apache.hadoop.hbase.errorhandling.TestTimeoutExceptionInjector
Tests run: 4, Failures: 0, Errors: 0, Skipped: 0, Time elapsed: 0.123 sec
Running org.apache.hadoop.hbase.errorhandling.TestForeignExceptionSerialization
Tests run: 2, Failures: 0, Errors: 0, Skipped: 0, Time elapsed: 0.052 sec
Running org.apache.hadoop.hbase.errorhandling.TestForeignExceptionDispatcher
Tests run: 3, Failures: 0, Errors: 0, Skipped: 0, Time elapsed: 0.064 sec
Running org.apache.hadoop.hbase.TestHColumnDescriptor
Tests run: 3, Failures: 0, Errors: 0, Skipped: 0, Time elapsed: 0.06 sec
Running org.apache.hadoop.hbase.coprocessor.TestCoprocessorInterface
Tests run: 2, Failures: 0, Errors: 0, Skipped: 0, Time elapsed: 3.556 sec
Running org.apache.hadoop.hbase.coprocessor.TestRegionObserverStacking
Tests run: 1, Failures: 0, Errors: 0, Skipped: 0, Time elapsed: 0.089 sec
Running org.apache.hadoop.hbase.client.TestResult
Tests run: 8, Failures: 0, Errors: 0, Skipped: 0, Time elapsed: 0.162 sec
Running org.apache.hadoop.hbase.client.TestPutDeleteEtcCellIteration
Tests run: 6, Failures: 0, Errors: 0, Skipped: 0, Time elapsed: 0.115 sec
Running org.apache.hadoop.hbase.client.TestConnectionUtils
Tests run: 1, Failures: 0, Errors: 0, Skipped: 0, Time elapsed: 0.02 sec
Running org.apache.hadoop.hbase.client.TestIntraRowPagination
Tests run: 1, Failures: 0, Errors: 0, Skipped: 0, Time elapsed: 0.067 sec
Running org.apache.hadoop.hbase.client.TestHBaseAdminNoCluster
Tests run: 1, Failures: 0, Errors: 0, Skipped: 0, Time elapsed: 0.439 sec
Running org.apache.hadoop.hbase.metrics.TestMetricsHistogram
Tests run: 3, Failures: 0, Errors: 0, Skipped: 0, Time elapsed: 0.127 sec
Running org.apache.hadoop.hbase.snapshot.TestRestoreSnapshotHelper
Tests run: 1, Failures: 0, Errors: 0, Skipped: 0, Time elapsed: 0.291 sec
Running org.apache.hadoop.hbase.TestHTableDescriptor
Tests run: 11, Failures: 0, Errors: 0, Skipped: 0, Time elapsed: 0.215 sec
Running org.apache.hadoop.hbase.TestServerLoad
Tests run: 2, Failures: 0, Errors: 0, Skipped: 0, Time elapsed: 0.044 sec
Running org.apache.hadoop.hbase.codec.TestCellMessageCodec
Tests run: 3, Failures: 0, Errors: 0, Skipped: 0, Time elapsed: 0.065 sec
Running org.apache.hadoop.hbase.TestHRegionLocation
Tests run: 3, Failures: 0, Errors: 0, Skipped: 0, Time elapsed: 0.059 sec
Running org.apache.hadoop.hbase.security.TestHBaseSaslRpcClient
Tests run: 5, Failures: 0, Errors: 0, Skipped: 0, Time elapsed: 0.305 sec
Running org.apache.hadoop.hbase.security.visibility.TestExpressionParser
Tests run: 4, Failures: 0, Errors: 0, Skipped: 0, Time elapsed: 0.086 sec
Running org.apache.hadoop.hbase.security.visibility.TestExpressionExpander
Tests run: 1, Failures: 0, Errors: 0, Skipped: 0, Time elapsed: 0.021 sec
Running org.apache.hadoop.hbase.security.TestUser
Tests run: 5, Failures: 0, Errors: 0, Skipped: 0, Time elapsed: 0.171 sec
Running org.apache.hadoop.hbase.TestHDFSBlocksDistribution
Tests run: 2, Failures: 0, Errors: 0, Skipped: 0, Time elapsed: 0.039 sec
Running org.apache.hadoop.hbase.TestNodeHealthCheckChore
Tests run: 4, Failures: 0, Errors: 0, Skipped: 0, Time elapsed: 10.157 sec
Running org.apache.hadoop.hbase.zookeeper.TestZKConfig
Tests run: 1, Failures: 0, Errors: 0, Skipped: 0, Time elapsed: 0.036 sec
Running org.apache.hadoop.hbase.zookeeper.TestZooKeeperMainServer
Tests run: 2, Failures: 0, Errors: 0, Skipped: 0, Time elapsed: 0.276 sec
Running org.apache.hadoop.hbase.executor.TestExecutorService
Tests run: 1, Failures: 0, Errors: 0, Skipped: 0, Time elapsed: 2.065 sec
Running org.apache.hadoop.hbase.mapreduce.TestImportTsvParser
Tests run: 12, Failures: 0, Errors: 0, Skipped: 0, Time elapsed: 0.296 sec
Running org.apache.hadoop.hbase.mapreduce.hadoopbackport.TestJarFinder
Tests run: 4, Failures: 0, Errors: 0, Skipped: 0, Time elapsed: 1.273 sec
Running org.apache.hadoop.hbase.mapreduce.TestTableMapReduceUtil
Tests run: 4, Failures: 0, Errors: 0, Skipped: 0, Time elapsed: 2.301 sec
Running org.apache.hadoop.hbase.mapreduce.TestTableInputFormatBase
Tests run: 1, Failures: 0, Errors: 0, Skipped: 0, Time elapsed: 0.163 sec
Running org.apache.hadoop.hbase.mapreduce.TestGroupingTableMapper
Tests run: 1, Failures: 0, Errors: 0, Skipped: 0, Time elapsed: 0.045 sec
Running org.apache.hadoop.hbase.mapreduce.TestSimpleTotalOrderPartitioner
Tests run: 1, Failures: 0, Errors: 0, Skipped: 0, Time elapsed: 0.034 sec
Running org.apache.hadoop.hbase.mapreduce.TestTableSplit
Tests run: 4, Failures: 0, Errors: 0, Skipped: 0, Time elapsed: 0.095 sec
Running org.apache.hadoop.hbase.filter.TestFilter
Tests run: 21, Failures: 0, Errors: 0, Skipped: 0, Time elapsed: 1.586 sec
Running org.apache.hadoop.hbase.filter.TestFilterSerialization
Tests run: 25, Failures: 0, Errors: 0, Skipped: 0, Time elapsed: 0.614 sec
Running org.apache.hadoop.hbase.filter.TestMultipleColumnPrefixFilter
Tests run: 3, Failures: 0, Errors: 0, Skipped: 0, Time elapsed: 2.196 sec
Running org.apache.hadoop.hbase.filter.TestFuzzyRowFilter
Tests run: 2, Failures: 0, Errors: 0, Skipped: 0, Time elapsed: 0.039 sec
Running org.apache.hadoop.hbase.filter.TestNullComparator
Tests run: 3, Failures: 0, Errors: 0, Skipped: 0, Time elapsed: 0.06 sec
Running org.apache.hadoop.hbase.filter.TestParseFilter
Tests run: 34, Failures: 0, Errors: 0, Skipped: 0, Time elapsed: 0.691 sec
Running org.apache.hadoop.hbase.filter.TestSingleColumnValueExcludeFilter
Tests run: 1, Failures: 0, Errors: 0, Skipped: 0, Time elapsed: 0.028 sec
Running org.apache.hadoop.hbase.filter.TestDependentColumnFilter
Tests run: 4, Failures: 0, Errors: 0, Skipped: 0, Time elapsed: 0.203 sec
Running org.apache.hadoop.hbase.filter.TestInclusiveStopFilter
Tests run: 2, Failures: 0, Errors: 0, Skipped: 0, Time elapsed: 0.043 sec
Running org.apache.hadoop.hbase.filter.TestSingleColumnValueFilter
Tests run: 2, Failures: 0, Errors: 0, Skipped: 0, Time elapsed: 0.043 sec
Running org.apache.hadoop.hbase.filter.TestPrefixFilter
Tests run: 3, Failures: 0, Errors: 0, Skipped: 0, Time elapsed: 0.058 sec
Running org.apache.hadoop.hbase.filter.TestColumnPrefixFilter
Tests run: 2, Failures: 0, Errors: 0, Skipped: 0, Time elapsed: 1.24 sec
Running org.apache.hadoop.hbase.filter.TestRandomRowFilter
Tests run: 2, Failures: 0, Errors: 0, Skipped: 0, Time elapsed: 0.352 sec
Running org.apache.hadoop.hbase.filter.TestBitComparator
Tests run: 6, Failures: 0, Errors: 0, Skipped: 0, Time elapsed: 0.113 sec
Running org.apache.hadoop.hbase.filter.TestFilterList
Tests run: 7, Failures: 0, Errors: 0, Skipped: 0, Time elapsed: 0.139 sec
Running org.apache.hadoop.hbase.filter.TestComparatorSerialization
Tests run: 6, Failures: 0, Errors: 0, Skipped: 0, Time elapsed: 0.117 sec
Running org.apache.hadoop.hbase.filter.TestColumnPaginationFilter
Tests run: 1, Failures: 0, Errors: 0, Skipped: 0, Time elapsed: 0.021 sec
Running org.apache.hadoop.hbase.filter.TestInvocationRecordFilter
Tests run: 1, Failures: 0, Errors: 0, Skipped: 0, Time elapsed: 0.044 sec
Running org.apache.hadoop.hbase.filter.TestFirstKeyValueMatchingQualifiersFilter
Tests run: 1, Failures: 0, Errors: 0, Skipped: 0, Time elapsed: 0.02 sec
Running org.apache.hadoop.hbase.filter.TestPageFilter
Tests run: 2, Failures: 0, Errors: 0, Skipped: 0, Time elapsed: 0.039 sec
Running org.apache.hadoop.hbase.procedure.TestProcedureManager
Tests run: 1, Failures: 0, Errors: 1, Skipped: 0, Time elapsed: 187.509 sec <<< FAILURE!
Running org.apache.hadoop.hbase.security.TestSecureRPC
Tests run: 1, Failures: 0, Errors: 0, Skipped: 1, Time elapsed: 187.509 sec
Running org.apache.hadoop.hbase.security.TestUsersOperationsWithSecureHadoop
Tests run: 1, Failures: 0, Errors: 0, Skipped: 1, Time elapsed: 187.509 sec
Running org.apache.hadoop.hbase.TestIPv6NIOServerSocketChannel
Tests run: 2, Failures: 0, Errors: 0, Skipped: 0, Time elapsed: 187.509 sec

Results :

Tests in error: 
  org.apache.hadoop.hbase.procedure.TestProcedureManager

Tests run: 832, Failures: 0, Errors: 1, Skipped: 2

[INFO] ------------------------------------------------------------------------
[INFO] Reactor Summary:
[INFO] 
[INFO] HBase ............................................. SUCCESS [3.356s]
[INFO] HBase - Annotations ............................... SUCCESS [2.032s]
[INFO] HBase - Common .................................... SUCCESS [21.962s]
[INFO] HBase - Protocol .................................. SUCCESS [20.119s]
[INFO] HBase - Client .................................... SUCCESS [38.469s]
[INFO] HBase - Hadoop Compatibility ...................... SUCCESS [5.827s]
[INFO] HBase - Hadoop One Compatibility .................. SUCCESS [2.689s]
[INFO] HBase - Prefix Tree ............................... SUCCESS [3.425s]
[INFO] HBase - Server .................................... FAILURE [3:26.296s]
[INFO] HBase - Testing Util .............................. SKIPPED
[INFO] HBase - Thrift .................................... SKIPPED
[INFO] HBase - Shell ..................................... SKIPPED
[INFO] HBase - Integration Tests ......................... SKIPPED
[INFO] HBase - Examples .................................. SKIPPED
[INFO] HBase - Assembly .................................. SKIPPED
[INFO] ------------------------------------------------------------------------
[INFO] BUILD FAILURE
[INFO] ------------------------------------------------------------------------
[INFO] Total time: 5:05.007s
[INFO] Finished at: Fri Oct 03 04:24:28 UTC 2014
[INFO] Final Memory: 59M/1013M
[INFO] ------------------------------------------------------------------------
[ERROR] Failed to execute goal org.apache.maven.plugins:maven-surefire-plugin:2.12-TRUNK-HBASE-2:test
(default-test) on project hbase-server: There are test failures.
[ERROR] 
[ERROR] Please refer to <https://builds.apache.org/job/HBase-0.98-on-Hadoop-1.1/ws/hbase-server/target/surefire-reports>
for the individual test results.
[ERROR] -> [Help 1]
[ERROR] 
[ERROR] To see the full stack trace of the errors, re-run Maven with the -e switch.
[ERROR] Re-run Maven using the -X switch to enable full debug logging.
[ERROR] 
[ERROR] For more information about the errors and possible solutions, please read the following
articles:
[ERROR] [Help 1] http://cwiki.apache.org/confluence/display/MAVEN/MojoFailureException
[ERROR] 
[ERROR] After correcting the problems, you can resume the build with the command
[ERROR]   mvn <goals> -rf :hbase-server
Build step 'Invoke top-level Maven targets' marked build as failure
Performing Post build task...
Match found for :.* : True
Logical operation result is TRUE
Running script  :   ZOMBIE_TESTS_COUNT=`jps | grep surefirebooter | wc -l`
  if [[ $ZOMBIE_TESTS_COUNT != 0 ]] ; then
    #It seems sometimes the tests are not dying immediately. Let's give them 10s
    echo "Suspicious java process found - waiting 10s to see if there are just slow to stop"
    sleep 10
    ZOMBIE_TESTS_COUNT=`jps | grep surefirebooter | wc -l`
    if [[ $ZOMBIE_TESTS_COUNT != 0 ]] ; then
      echo "There are $ZOMBIE_TESTS_COUNT zombie tests, they should have been killed by surefire
but survived"
      echo "************ BEGIN zombies jstack extract"
      ZB_STACK=`jps | grep surefirebooter | cut -d ' ' -f 1 | xargs -n 1 jstack | grep ".test"
| grep "\.java"`
      jps | grep surefirebooter | cut -d ' ' -f 1 | xargs -n 1 jstack
      echo "************ END  zombies jstack extract"
      JIRA_COMMENT="$JIRA_COMMENT

     {color:red}-1 core zombie tests{color}.  There are ${ZOMBIE_TESTS_COUNT} zombie test(s):
${ZB_STACK}"
      BAD=1
      jps | grep surefirebooter | cut -d ' ' -f 1 | xargs kill -9
    else
      echo "We're ok: there is no zombie test, but some tests took some time to stop"
    fi
  else
    echo "We're ok: there is no zombie test"
  fi
[HBase-0.98-on-Hadoop-1.1] $ /bin/bash -xe /tmp/hudson880376566946484850.sh
++ jps
++ grep surefirebooter
++ wc -l
+ ZOMBIE_TESTS_COUNT=0
+ [[ 0 != 0 ]]
+ echo 'We'\''re ok: there is no zombie test'
We're ok: there is no zombie test
POST BUILD TASK : SUCCESS
END OF POST BUILD TASK : 0
Archiving artifacts
Sending artifact delta relative to HBase-0.98-on-Hadoop-1.1 #517
Archived 793 artifacts
Archive block size is 32768
Received 4 blocks and 34828366 bytes
Compression is 0.4%
Took 23 sec
Recording test results
Updating HBASE-12164
Updating HBASE-10153

Mime
View raw message