hbase-builds mailing list archives

Site index · List index
Message view « Date » · « Thread »
Top « Date » · « Thread »
From Apache Jenkins Server <jenk...@builds.apache.org>
Subject Build failed in Jenkins: HBase-TRUNK #5621
Date Sat, 04 Oct 2014 06:14:16 GMT
See <https://builds.apache.org/job/HBase-TRUNK/5621/changes>

Changes:

[stack] HBASE-8808 Use Jacoco to generate Unit Test coverage reports (Manukranth)

------------------------------------------
[...truncated 1952 lines...]
Tests run: 10, Failures: 0, Errors: 0, Skipped: 0, Time elapsed: 8.989 sec - in org.apache.hadoop.hbase.mapred.TestTableInputFormat
Tests run: 3, Failures: 0, Errors: 0, Skipped: 0, Time elapsed: 17.333 sec - in org.apache.hadoop.hbase.TestHColumnDescriptorDefaultVersions
Running org.apache.hadoop.hbase.mapred.TestTableSnapshotInputFormat
Running org.apache.hadoop.hbase.mapred.TestTableMapReduceUtil
Tests run: 2, Failures: 0, Errors: 0, Skipped: 0, Time elapsed: 50.75 sec - in org.apache.hadoop.hbase.TestRegionRebalancing
Running org.apache.hadoop.hbase.replication.TestReplicationTrackerZKImpl
Tests run: 4, Failures: 0, Errors: 0, Skipped: 2, Time elapsed: 0.874 sec - in org.apache.hadoop.hbase.replication.TestReplicationTrackerZKImpl
Running org.apache.hadoop.hbase.mapred.TestTableMapReduce
Running org.apache.hadoop.hbase.replication.TestReplicationEndpoint
Tests run: 3, Failures: 0, Errors: 0, Skipped: 0, Time elapsed: 3.023 sec - in org.apache.hadoop.hbase.replication.TestReplicationEndpoint
Running org.apache.hadoop.hbase.replication.TestReplicationDisableInactivePeer
Tests run: 1, Failures: 0, Errors: 0, Skipped: 0, Time elapsed: 23.745 sec - in org.apache.hadoop.hbase.replication.TestReplicationDisableInactivePeer
Tests run: 28, Failures: 0, Errors: 0, Skipped: 0, Time elapsed: 184.447 sec - in org.apache.hadoop.hbase.io.encoding.TestDataBlockEncoders
Tests run: 4, Failures: 0, Errors: 0, Skipped: 0, Time elapsed: 96.89 sec - in org.apache.hadoop.hbase.mapred.TestTableMapReduceUtil
Running org.apache.hadoop.hbase.replication.TestReplicationKillMasterRSCompressed
Running org.apache.hadoop.hbase.replication.regionserver.TestReplicationHLogReaderManager
Running org.apache.hadoop.hbase.replication.TestPerTableCFReplication
Tests run: 1, Failures: 0, Errors: 0, Skipped: 0, Time elapsed: 16.927 sec - in org.apache.hadoop.hbase.replication.TestReplicationKillMasterRSCompressed
Tests run: 2, Failures: 0, Errors: 0, Skipped: 0, Time elapsed: 97.137 sec - in org.apache.hadoop.hbase.mapred.TestTableMapReduce
Running org.apache.hadoop.hbase.replication.regionserver.TestReplicationSink
Running org.apache.hadoop.hbase.replication.regionserver.TestReplicationSourceManager
Tests run: 5, Failures: 0, Errors: 0, Skipped: 0, Time elapsed: 2.123 sec - in org.apache.hadoop.hbase.replication.regionserver.TestReplicationSink
Tests run: 2, Failures: 0, Errors: 0, Skipped: 0, Time elapsed: 25.295 sec - in org.apache.hadoop.hbase.replication.TestPerTableCFReplication
Tests run: 4, Failures: 0, Errors: 0, Skipped: 0, Time elapsed: 4.307 sec - in org.apache.hadoop.hbase.replication.regionserver.TestReplicationSourceManager
Running org.apache.hadoop.hbase.replication.regionserver.TestRegionReplicaReplicationEndpoint
Running org.apache.hadoop.hbase.replication.TestReplicationSource
Tests run: 1, Failures: 0, Errors: 0, Skipped: 0, Time elapsed: 0.413 sec - in org.apache.hadoop.hbase.replication.TestReplicationSource
Running org.apache.hadoop.hbase.replication.regionserver.TestRegionReplicaReplicationEndpointNoMaster
Running org.apache.hadoop.hbase.replication.TestReplicationChangingPeerRegionservers
Tests run: 1, Failures: 0, Errors: 0, Skipped: 0, Time elapsed: 6.601 sec - in org.apache.hadoop.hbase.replication.TestReplicationChangingPeerRegionservers
Tests run: 3, Failures: 0, Errors: 0, Skipped: 0, Time elapsed: 37.904 sec - in org.apache.hadoop.hbase.replication.regionserver.TestRegionReplicaReplicationEndpointNoMaster
Running org.apache.hadoop.hbase.replication.TestReplicationSyncUpTool
Running org.apache.hadoop.hbase.replication.TestReplicationKillMasterRS
Tests run: 1, Failures: 0, Errors: 0, Skipped: 0, Time elapsed: 20.452 sec - in org.apache.hadoop.hbase.replication.TestReplicationKillMasterRS
Running org.apache.hadoop.hbase.replication.TestMultiSlaveReplication
Tests run: 1, Failures: 0, Errors: 0, Skipped: 0, Time elapsed: 51.556 sec - in org.apache.hadoop.hbase.replication.TestReplicationSyncUpTool
Tests run: 1, Failures: 0, Errors: 0, Skipped: 0, Time elapsed: 30.682 sec - in org.apache.hadoop.hbase.replication.TestMultiSlaveReplication
Running org.apache.hadoop.hbase.replication.TestReplicationWithTags
Tests run: 1, Failures: 0, Errors: 0, Skipped: 0, Time elapsed: 7.529 sec - in org.apache.hadoop.hbase.replication.TestReplicationWithTags
Running org.apache.hadoop.hbase.replication.TestReplicationStateZKImpl
Tests run: 6, Failures: 0, Errors: 0, Skipped: 0, Time elapsed: 4.082 sec - in org.apache.hadoop.hbase.replication.TestReplicationStateZKImpl
Running org.apache.hadoop.hbase.replication.TestReplicationKillSlaveRS
Tests run: 6, Failures: 0, Errors: 0, Skipped: 0, Time elapsed: 294.726 sec - in org.apache.hadoop.hbase.mapred.TestTableSnapshotInputFormat
Running org.apache.hadoop.hbase.replication.TestMasterReplication
Tests run: 1, Failures: 0, Errors: 0, Skipped: 0, Time elapsed: 18.223 sec - in org.apache.hadoop.hbase.replication.TestReplicationKillSlaveRS
Running org.apache.hadoop.hbase.util.TestMergeTool
Running org.apache.hadoop.hbase.replication.TestReplicationSmallTests
Tests run: 1, Failures: 0, Errors: 0, Skipped: 0, Time elapsed: 21.871 sec - in org.apache.hadoop.hbase.util.TestMergeTool
Running org.apache.hadoop.hbase.util.TestFSTableDescriptors
Tests run: 13, Failures: 0, Errors: 0, Skipped: 0, Time elapsed: 1.906 sec - in org.apache.hadoop.hbase.util.TestFSTableDescriptors
Running org.apache.hadoop.hbase.util.TestHBaseFsckEncryption
Tests run: 1, Failures: 0, Errors: 0, Skipped: 0, Time elapsed: 13.554 sec - in org.apache.hadoop.hbase.util.TestHBaseFsckEncryption
Running org.apache.hadoop.hbase.util.TestIdLock
Tests run: 9, Failures: 0, Errors: 0, Skipped: 0, Time elapsed: 41.475 sec - in org.apache.hadoop.hbase.replication.TestReplicationSmallTests
Running org.apache.hadoop.hbase.util.TestMiniClusterLoadSequential
Tests run: 8, Failures: 0, Errors: 0, Skipped: 0, Time elapsed: 242.001 sec - in org.apache.hadoop.hbase.replication.regionserver.TestReplicationHLogReaderManager
Running org.apache.hadoop.hbase.util.TestMergeTable
Tests run: 1, Failures: 0, Errors: 0, Skipped: 0, Time elapsed: 15.426 sec - in org.apache.hadoop.hbase.util.TestIdLock
Tests run: 3, Failures: 0, Errors: 0, Skipped: 0, Time elapsed: 61.019 sec - in org.apache.hadoop.hbase.replication.TestMasterReplication
Running org.apache.hadoop.hbase.util.TestMiniClusterLoadParallel
Running org.apache.hadoop.hbase.util.TestHBaseFsck
Tests run: 1, Failures: 0, Errors: 0, Skipped: 0, Time elapsed: 20.992 sec - in org.apache.hadoop.hbase.util.TestMergeTable
Running org.apache.hadoop.hbase.util.TestFSUtils
Tests run: 7, Failures: 0, Errors: 0, Skipped: 0, Time elapsed: 17.107 sec - in org.apache.hadoop.hbase.util.TestFSUtils
Tests run: 4, Failures: 0, Errors: 0, Skipped: 0, Time elapsed: 48.485 sec - in org.apache.hadoop.hbase.util.TestMiniClusterLoadSequential
Running org.apache.hadoop.hbase.util.TestProcessBasedCluster
Tests run: 1, Failures: 0, Errors: 0, Skipped: 0, Time elapsed: 0.091 sec - in org.apache.hadoop.hbase.util.TestProcessBasedCluster
Running org.apache.hadoop.hbase.util.TestTableName
Tests run: 5, Failures: 0, Errors: 0, Skipped: 0, Time elapsed: 0.429 sec - in org.apache.hadoop.hbase.util.TestTableName
Running org.apache.hadoop.hbase.util.TestMiniClusterLoadEncoded
Running org.apache.hadoop.hbase.util.TestRegionSplitter
Tests run: 6, Failures: 0, Errors: 0, Skipped: 0, Time elapsed: 4.997 sec - in org.apache.hadoop.hbase.util.TestRegionSplitter
Tests run: 4, Failures: 0, Errors: 0, Skipped: 0, Time elapsed: 44.91 sec - in org.apache.hadoop.hbase.util.TestMiniClusterLoadParallel
Running org.apache.hadoop.hbase.util.TestFSVisitor
Tests run: 3, Failures: 0, Errors: 0, Skipped: 0, Time elapsed: 3.739 sec - in org.apache.hadoop.hbase.util.TestFSVisitor
Running org.apache.hadoop.hbase.util.hbck.TestOfflineMetaRebuildBase
Running org.apache.hadoop.hbase.util.TestCoprocessorScanPolicy
Tests run: 4, Failures: 0, Errors: 0, Skipped: 0, Time elapsed: 5.087 sec - in org.apache.hadoop.hbase.util.TestCoprocessorScanPolicy
Running org.apache.hadoop.hbase.util.hbck.TestOfflineMetaRebuildOverlap
Tests run: 1, Failures: 0, Errors: 0, Skipped: 0, Time elapsed: 24.289 sec - in org.apache.hadoop.hbase.util.hbck.TestOfflineMetaRebuildBase
Running org.apache.hadoop.hbase.util.hbck.TestOfflineMetaRebuildHole
Tests run: 1, Failures: 0, Errors: 0, Skipped: 0, Time elapsed: 24.099 sec - in org.apache.hadoop.hbase.util.hbck.TestOfflineMetaRebuildOverlap
Running org.apache.hadoop.hbase.util.TestDefaultEnvironmentEdge
Tests run: 1, Failures: 0, Errors: 0, Skipped: 0, Time elapsed: 0.415 sec - in org.apache.hadoop.hbase.util.TestDefaultEnvironmentEdge
Running org.apache.hadoop.hbase.util.TestFSHDFSUtils
Tests run: 3, Failures: 0, Errors: 0, Skipped: 0, Time elapsed: 5.012 sec - in org.apache.hadoop.hbase.util.TestFSHDFSUtils
Tests run: 5, Failures: 0, Errors: 0, Skipped: 0, Time elapsed: 55.756 sec - in org.apache.hadoop.hbase.util.TestMiniClusterLoadEncoded
Running org.apache.hadoop.hbase.TestMetaTableAccessorNoCluster
Tests run: 1, Failures: 0, Errors: 0, Skipped: 0, Time elapsed: 25.664 sec - in org.apache.hadoop.hbase.util.hbck.TestOfflineMetaRebuildHole
Tests run: 2, Failures: 0, Errors: 0, Skipped: 0, Time elapsed: 3.642 sec - in org.apache.hadoop.hbase.TestMetaTableAccessorNoCluster
Tests run: 7, Failures: 0, Errors: 5, Skipped: 0, Time elapsed: 316.526 sec <<< FAILURE!
- in org.apache.hadoop.hbase.replication.regionserver.TestRegionReplicaReplicationEndpoint
testRegionReplicaReplicationIgnoresDisabledTables(org.apache.hadoop.hbase.replication.regionserver.TestRegionReplicaReplicationEndpoint)
 Time elapsed: 58.854 sec  <<< ERROR!
java.lang.Exception: test timed out after 60000 milliseconds
	at java.lang.Object.hashCode(Native Method)
	at java.util.concurrent.ConcurrentHashMap.hash(ConcurrentHashMap.java:333)
	at java.util.concurrent.ConcurrentHashMap.put(ConcurrentHashMap.java:1125)
	at org.apache.hadoop.hbase.regionserver.HRegion$RegionScannerImpl.<init>(HRegion.java:4018)
	at org.apache.hadoop.hbase.regionserver.HRegion.instantiateRegionScanner(HRegion.java:2109)
	at org.apache.hadoop.hbase.regionserver.HRegion.getScanner(HRegion.java:2095)
	at org.apache.hadoop.hbase.regionserver.HRegion.getScanner(HRegion.java:2072)
	at org.apache.hadoop.hbase.regionserver.HRegion.get(HRegion.java:5014)
	at org.apache.hadoop.hbase.regionserver.HRegion.get(HRegion.java:4988)
	at org.apache.hadoop.hbase.HBaseTestingUtility.verifyNumericRows(HBaseTestingUtility.java:1933)
	at org.apache.hadoop.hbase.replication.regionserver.TestRegionReplicaReplicationEndpoint$1.evaluate(TestRegionReplicaReplicationEndpoint.java:199)
	at org.apache.hadoop.hbase.Waiter.waitFor(Waiter.java:177)
	at org.apache.hadoop.hbase.Waiter.waitFor(Waiter.java:128)
	at org.apache.hadoop.hbase.replication.regionserver.TestRegionReplicaReplicationEndpoint.verifyReplication(TestRegionReplicaReplicationEndpoint.java:194)
	at org.apache.hadoop.hbase.replication.regionserver.TestRegionReplicaReplicationEndpoint.testRegionReplicaReplicationIgnoresDisabledTables(TestRegionReplicaReplicationEndpoint.java:337)
	at org.apache.hadoop.hbase.replication.regionserver.TestRegionReplicaReplicationEndpoint.testRegionReplicaReplicationIgnoresDisabledTables(TestRegionReplicaReplicationEndpoint.java:264)

testRegionReplicaReplicationWith3Replicas(org.apache.hadoop.hbase.replication.regionserver.TestRegionReplicaReplicationEndpoint)
 Time elapsed: 59.97 sec  <<< ERROR!
java.lang.Exception: test timed out after 60000 milliseconds
	at java.lang.Thread.sleep(Native Method)
	at org.apache.hadoop.hbase.Waiter.waitFor(Waiter.java:181)
	at org.apache.hadoop.hbase.Waiter.waitFor(Waiter.java:128)
	at org.apache.hadoop.hbase.replication.regionserver.TestRegionReplicaReplicationEndpoint.verifyReplication(TestRegionReplicaReplicationEndpoint.java:194)
	at org.apache.hadoop.hbase.replication.regionserver.TestRegionReplicaReplicationEndpoint.testRegionReplicaReplication(TestRegionReplicaReplicationEndpoint.java:164)
	at org.apache.hadoop.hbase.replication.regionserver.TestRegionReplicaReplicationEndpoint.testRegionReplicaReplicationWith3Replicas(TestRegionReplicaReplicationEndpoint.java:219)

testRegionReplicaReplicationWith10Replicas(org.apache.hadoop.hbase.replication.regionserver.TestRegionReplicaReplicationEndpoint)
 Time elapsed: 60.038 sec  <<< ERROR!
java.lang.Exception: test timed out after 60000 milliseconds
	at java.lang.Thread.sleep(Native Method)
	at org.apache.hadoop.hbase.Waiter.waitFor(Waiter.java:181)
	at org.apache.hadoop.hbase.Waiter.waitFor(Waiter.java:128)
	at org.apache.hadoop.hbase.replication.regionserver.TestRegionReplicaReplicationEndpoint.verifyReplication(TestRegionReplicaReplicationEndpoint.java:194)
	at org.apache.hadoop.hbase.replication.regionserver.TestRegionReplicaReplicationEndpoint.testRegionReplicaReplication(TestRegionReplicaReplicationEndpoint.java:164)
	at org.apache.hadoop.hbase.replication.regionserver.TestRegionReplicaReplicationEndpoint.testRegionReplicaReplicationWith10Replicas(TestRegionReplicaReplicationEndpoint.java:224)

testRegionReplicaReplicationWith2Replicas(org.apache.hadoop.hbase.replication.regionserver.TestRegionReplicaReplicationEndpoint)
 Time elapsed: 60.028 sec  <<< ERROR!
java.lang.Exception: test timed out after 60000 milliseconds
	at java.lang.Thread.sleep(Native Method)
	at org.apache.hadoop.hbase.Waiter.waitFor(Waiter.java:181)
	at org.apache.hadoop.hbase.Waiter.waitFor(Waiter.java:128)
	at org.apache.hadoop.hbase.replication.regionserver.TestRegionReplicaReplicationEndpoint.verifyReplication(TestRegionReplicaReplicationEndpoint.java:194)
	at org.apache.hadoop.hbase.replication.regionserver.TestRegionReplicaReplicationEndpoint.testRegionReplicaReplication(TestRegionReplicaReplicationEndpoint.java:164)
	at org.apache.hadoop.hbase.replication.regionserver.TestRegionReplicaReplicationEndpoint.testRegionReplicaReplicationWith2Replicas(TestRegionReplicaReplicationEndpoint.java:214)

testRegionReplicaReplicationIgnoresDroppedTables(org.apache.hadoop.hbase.replication.regionserver.TestRegionReplicaReplicationEndpoint)
 Time elapsed: 60.033 sec  <<< ERROR!
java.lang.Exception: test timed out after 60000 milliseconds
	at java.lang.Thread.sleep(Native Method)
	at org.apache.hadoop.hbase.Waiter.waitFor(Waiter.java:181)
	at org.apache.hadoop.hbase.Waiter.waitFor(Waiter.java:128)
	at org.apache.hadoop.hbase.replication.regionserver.TestRegionReplicaReplicationEndpoint.verifyReplication(TestRegionReplicaReplicationEndpoint.java:194)
	at org.apache.hadoop.hbase.replication.regionserver.TestRegionReplicaReplicationEndpoint.testRegionReplicaReplicationIgnoresDisabledTables(TestRegionReplicaReplicationEndpoint.java:337)
	at org.apache.hadoop.hbase.replication.regionserver.TestRegionReplicaReplicationEndpoint.testRegionReplicaReplicationIgnoresDroppedTables(TestRegionReplicaReplicationEndpoint.java:269)

Running org.apache.hadoop.hbase.TestNamespace
Running org.apache.hadoop.hbase.TestInfoServers
Tests run: 3, Failures: 0, Errors: 0, Skipped: 0, Time elapsed: 3.243 sec - in org.apache.hadoop.hbase.TestInfoServers
Running org.apache.hadoop.hbase.TestMetaTableAccessor
Tests run: 9, Failures: 0, Errors: 0, Skipped: 1, Time elapsed: 10.57 sec - in org.apache.hadoop.hbase.TestNamespace
Tests run: 8, Failures: 0, Errors: 0, Skipped: 0, Time elapsed: 5.158 sec - in org.apache.hadoop.hbase.TestMetaTableAccessor
Tests run: 47, Failures: 0, Errors: 0, Skipped: 1, Time elapsed: 274.481 sec - in org.apache.hadoop.hbase.util.TestHBaseFsck

Results :

Tests in error: 
  TestRegionReplicaReplicationEndpoint.testRegionReplicaReplicationIgnoresDisabledTables:264->testRegionReplicaReplicationIgnoresDisabledTables:337->verifyReplication:194->Object.hashCode:-2
? 
  TestRegionReplicaReplicationEndpoint.testRegionReplicaReplicationWith3Replicas:219->testRegionReplicaReplication:164->verifyReplication:194
? 
  TestRegionReplicaReplicationEndpoint.testRegionReplicaReplicationWith10Replicas:224->testRegionReplicaReplication:164->verifyReplication:194
? 
  TestRegionReplicaReplicationEndpoint.testRegionReplicaReplicationWith2Replicas:214->testRegionReplicaReplication:164->verifyReplication:194
? 
  TestRegionReplicaReplicationEndpoint.testRegionReplicaReplicationIgnoresDroppedTables:269->testRegionReplicaReplicationIgnoresDisabledTables:337->verifyReplication:194
? 

Tests run: 2040, Failures: 0, Errors: 5, Skipped: 19

[INFO] ------------------------------------------------------------------------
[INFO] Reactor Summary:
[INFO] 
[INFO] HBase ............................................. SUCCESS [6.532s]
[INFO] HBase - Annotations ............................... SUCCESS [1.484s]
[INFO] HBase - Common .................................... SUCCESS [1:04.639s]
[INFO] HBase - Protocol .................................. SUCCESS [7.865s]
[INFO] HBase - Client .................................... SUCCESS [1:05.631s]
[INFO] HBase - Hadoop Compatibility ...................... SUCCESS [7.145s]
[INFO] HBase - Hadoop Two Compatibility .................. SUCCESS [5.543s]
[INFO] HBase - Prefix Tree ............................... SUCCESS [7.602s]
[INFO] HBase - Server .................................... FAILURE [1:02:23.945s]
[INFO] HBase - Testing Util .............................. SKIPPED
[INFO] HBase - Thrift .................................... SKIPPED
[INFO] HBase - Shell ..................................... SKIPPED
[INFO] HBase - Integration Tests ......................... SKIPPED
[INFO] HBase - Examples .................................. SKIPPED
[INFO] HBase - Assembly .................................. SKIPPED
[INFO] ------------------------------------------------------------------------
[INFO] BUILD FAILURE
[INFO] ------------------------------------------------------------------------
[INFO] Total time: 1:05:11.179s
[INFO] Finished at: Sat Oct 04 06:11:25 UTC 2014
[INFO] Final Memory: 43M/425M
[INFO] ------------------------------------------------------------------------
[ERROR] Failed to execute goal org.apache.maven.plugins:maven-surefire-plugin:2.17:test (secondPartTestsExecution)
on project hbase-server: There are test failures.
[ERROR] 
[ERROR] Please refer to /x1/jenkins/jenkins-slave/workspace/HBase-TRUNK/hbase-server/target/surefire-reports
for the individual test results.
[ERROR] -> [Help 1]
[ERROR] 
[ERROR] To see the full stack trace of the errors, re-run Maven with the -e switch.
[ERROR] Re-run Maven using the -X switch to enable full debug logging.
[ERROR] 
[ERROR] For more information about the errors and possible solutions, please read the following
articles:
[ERROR] [Help 1] http://cwiki.apache.org/confluence/display/MAVEN/MojoFailureException
[ERROR] 
[ERROR] After correcting the problems, you can resume the build with the command
[ERROR]   mvn <goals> -rf :hbase-server
Build step 'Invoke top-level Maven targets' marked build as failure
Performing Post build task...
Match found for :.* : True
Logical operation result is TRUE
Running script  :   ZOMBIE_TESTS_COUNT=`jps | grep surefirebooter | wc -l`
  if [[ $ZOMBIE_TESTS_COUNT != 0 ]] ; then
    #It seems sometimes the tests are not dying immediately. Let's give them 10s
    echo "Suspicious java process found - waiting 10s to see if there are just slow to stop"
    sleep 10   
    ZOMBIE_TESTS_COUNT=`jps | grep surefirebooter | wc -l`
    if [[ $ZOMBIE_TESTS_COUNT != 0 ]] ; then
      echo "There are $ZOMBIE_TESTS_COUNT zombie tests, they should have been killed by surefire
but survived"
      echo "************ BEGIN zombies jstack extract"
      ZB_STACK=`jps | grep surefirebooter | cut -d ' ' -f 1 | xargs -n 1 jstack | grep ".test"
| grep "\.java"`
      jps | grep surefirebooter | cut -d ' ' -f 1 | xargs -n 1 jstack
      echo "************ END  zombies jstack extract"
      JIRA_COMMENT="$JIRA_COMMENT

     {color:red}-1 core zombie tests{color}.  There are ${ZOMBIE_TESTS_COUNT} zombie test(s):
${ZB_STACK}"
      BAD=1
      jps | grep surefirebooter | cut -d ' ' -f 1 | xargs kill -9
    else
      echo "We're ok: there is no zombie test, but some tests took some time to stop"
    fi
  else
    echo "We're ok: there is no zombie test"
  fi
[HBase-TRUNK] $ /bin/bash -xe /tmp/hudson1560203846012507701.sh
++ jps
++ grep surefirebooter
++ wc -l
+ ZOMBIE_TESTS_COUNT=0
+ [[ 0 != 0 ]]
+ echo 'We'\''re ok: there is no zombie test'
We're ok: there is no zombie test
POST BUILD TASK : SUCCESS
END OF POST BUILD TASK : 0
Archiving artifacts
Sending artifact delta relative to HBase-TRUNK #5564
Archived 1821 artifacts
Archive block size is 32768
Received 73 blocks and 546308032 bytes
Compression is 0.4%
Took 2 min 29 sec
Recording test results
Updating HBASE-8808

Mime
View raw message