hbase-builds mailing list archives

Site index · List index
Message view « Date » · « Thread »
Top « Date » · « Thread »
From Apache Jenkins Server <jenk...@builds.apache.org>
Subject Build failed in Jenkins: HBase-1.1 #149
Date Fri, 06 Feb 2015 16:39:35 GMT
See <https://builds.apache.org/job/HBase-1.1/149/changes>

Changes:

[ddas] HBASE-11568. Async WAL replication for region replicas (Enis Soztutar)

------------------------------------------
[...truncated 779 lines...]
[INFO] ------------------------------------------------------------------------
[INFO] 
[INFO] --- maven-enforcer-plugin:1.0.1:enforce (enforce) @ hbase-server ---
[INFO] 
[INFO] --- jacoco-maven-plugin:0.6.2.201302030002:prepare-agent (prepare-agent) @ hbase-server
---
[INFO] Skipping JaCoCo execution
[INFO] argLine set to 
[INFO] 
[INFO] --- maven-antrun-plugin:1.6:run (generate) @ hbase-server ---
[INFO] Executing tasks

main:
    [mkdir] Created dir: /x1/jenkins/jenkins-slave/workspace/HBase-1.1/hbase-server/target/hbase-webapps
     [copy] Copying 20 files to /x1/jenkins/jenkins-slave/workspace/HBase-1.1/hbase-server/target/hbase-webapps
log4j:WARN No appenders could be found for logger (org.mortbay.log).
log4j:WARN Please initialize the log4j system properly.
log4j:WARN See http://logging.apache.org/log4j/1.2/faq.html#noconfig for more info.
    [mkdir] Created dir: /x1/jenkins/jenkins-slave/workspace/HBase-1.1/hbase-server/target/hbase-webapps/master/WEB-INF
    [mkdir] Created dir: /x1/jenkins/jenkins-slave/workspace/HBase-1.1/hbase-server/target/hbase-webapps/regionserver/WEB-INF
[INFO] Executed tasks
[INFO] 
[INFO] --- build-helper-maven-plugin:1.9.1:add-source (jspcSource-packageInfo-source) @ hbase-server
---
[INFO] Source directory: /x1/jenkins/jenkins-slave/workspace/HBase-1.1/hbase-server/target/generated-jamon
added.
[INFO] Source directory: /x1/jenkins/jenkins-slave/workspace/HBase-1.1/hbase-server/target/generated-sources/java
added.
[INFO] 
[INFO] --- jamon-maven-plugin:2.3.4:translate (default) @ hbase-server ---
[INFO] Translating 10 templates from /x1/jenkins/jenkins-slave/workspace/HBase-1.1/hbase-server/src/main/jamon
to /x1/jenkins/jenkins-slave/workspace/HBase-1.1/hbase-server/target/generated-jamon
[INFO] 
[INFO] --- maven-remote-resources-plugin:1.4:process (default) @ hbase-server ---
[INFO] 
[INFO] --- maven-resources-plugin:2.6:resources (default-resources) @ hbase-server ---
[INFO] Using 'UTF-8' encoding to copy filtered resources.
[INFO] Copying 22 resources
[INFO] Copying 3 resources
[INFO] 
[INFO] --- maven-compiler-plugin:2.5.1:compile (default-compile) @ hbase-server ---
[INFO] Compiling 721 source files to /x1/jenkins/jenkins-slave/workspace/HBase-1.1/hbase-server/target/classes
[INFO] -------------------------------------------------------------
[ERROR] COMPILATION ERROR : 
[INFO] -------------------------------------------------------------
[ERROR] /x1/jenkins/jenkins-slave/workspace/HBase-1.1/hbase-server/src/main/java/org/apache/hadoop/hbase/replication/regionserver/RegionReplicaReplicationEndpoint.java:[50,37]
error: cannot find symbol
[ERROR]   symbol:   class RegionAdminServiceCallable
  location: package org.apache.hadoop.hbase.client
/x1/jenkins/jenkins-slave/workspace/HBase-1.1/hbase-server/src/main/java/org/apache/hadoop/hbase/replication/regionserver/RegionReplicaReplicationEndpoint.java:[455,12]
error: cannot find symbol
[ERROR]   symbol:   class RegionAdminServiceCallable
  location: class RegionReplicaReplicationEndpoint
/x1/jenkins/jenkins-slave/workspace/HBase-1.1/hbase-server/src/main/java/org/apache/hadoop/hbase/replication/regionserver/RegionReplicaReplicationEndpoint.java:[395,13]
error: constructor RetryingRpcCallable in class RetryingRpcCallable<V> cannot be applied
to given types;
[ERROR]   required: RpcRetryingCallerFactory,RetryingCallable<ReplicateWALEntryResponse>,int
  found: RpcRetryingCallerFactory,RegionReplicaReplayCallable,int
  reason: actual argument RegionReplicaReplayCallable cannot be converted to RetryingCallable<ReplicateWALEntryResponse>
by method invocation conversion
  where V is a type-variable:
    V extends Object declared in class RetryingRpcCallable
/x1/jenkins/jenkins-slave/workspace/HBase-1.1/hbase-server/src/main/java/org/apache/hadoop/hbase/replication/regionserver/RegionReplicaReplicationEndpoint.java:[479,46]
error: non-static variable connection cannot be referenced from a static context
[ERROR] /x1/jenkins/jenkins-slave/workspace/HBase-1.1/hbase-server/src/main/java/org/apache/hadoop/hbase/replication/regionserver/RegionReplicaReplicationEndpoint.java:[479,58]
error: cannot find symbol
[ERROR]   symbol:   variable tableName
  location: class RegionReplicaReplayCallable
/x1/jenkins/jenkins-slave/workspace/HBase-1.1/hbase-server/src/main/java/org/apache/hadoop/hbase/replication/regionserver/RegionReplicaReplicationEndpoint.java:[479,69]
error: cannot find symbol
[ERROR]   symbol:   variable row
  location: class RegionReplicaReplayCallable
/x1/jenkins/jenkins-slave/workspace/HBase-1.1/hbase-server/src/main/java/org/apache/hadoop/hbase/replication/regionserver/RegionReplicaReplicationEndpoint.java:[483,6]
error: cannot find symbol
[ERROR]   symbol:   variable location
  location: class RegionReplicaReplayCallable
/x1/jenkins/jenkins-slave/workspace/HBase-1.1/hbase-server/src/main/java/org/apache/hadoop/hbase/replication/regionserver/RegionReplicaReplicationEndpoint.java:[484,10]
error: cannot find symbol
[ERROR]   symbol:   variable location
  location: class RegionReplicaReplayCallable
/x1/jenkins/jenkins-slave/workspace/HBase-1.1/hbase-server/src/main/java/org/apache/hadoop/hbase/replication/regionserver/RegionReplicaReplicationEndpoint.java:[491,24]
error: cannot find symbol
[ERROR]   symbol:   variable location
  location: class RegionReplicaReplayCallable
/x1/jenkins/jenkins-slave/workspace/HBase-1.1/hbase-server/src/main/java/org/apache/hadoop/hbase/replication/regionserver/RegionReplicaReplicationEndpoint.java:[497,13]
error: cannot find symbol
[ERROR]   symbol:   variable location
  location: class RegionReplicaReplayCallable
/x1/jenkins/jenkins-slave/workspace/HBase-1.1/hbase-server/src/main/java/org/apache/hadoop/hbase/replication/regionserver/RegionReplicaReplicationEndpoint.java:[477,4]
error: method does not override or implement a method from a supertype
[ERROR] /x1/jenkins/jenkins-slave/workspace/HBase-1.1/hbase-server/src/main/java/org/apache/hadoop/hbase/replication/regionserver/RegionReplicaReplicationEndpoint.java:[500,4]
error: method does not override or implement a method from a supertype
[ERROR] /x1/jenkins/jenkins-slave/workspace/HBase-1.1/hbase-server/src/main/java/org/apache/hadoop/hbase/replication/regionserver/RegionReplicaReplicationEndpoint.java:[518,26]
error: cannot find symbol
[ERROR]   symbol:   variable location
  location: class RegionReplicaReplayCallable
/x1/jenkins/jenkins-slave/workspace/HBase-1.1/hbase-server/src/main/java/org/apache/hadoop/hbase/replication/regionserver/RegionReplicaReplicationEndpoint.java:[522,31]
error: cannot find symbol
[ERROR]   symbol:   variable tableName
  location: class RegionReplicaReplayCallable
/x1/jenkins/jenkins-slave/workspace/HBase-1.1/hbase-server/src/main/java/org/apache/hadoop/hbase/replication/regionserver/RegionReplicaReplicationEndpoint.java:[523,15]
error: cannot find symbol
[ERROR]   symbol:   variable stub
  location: class RegionReplicaReplayCallable
/x1/jenkins/jenkins-slave/workspace/HBase-1.1/hbase-server/src/main/java/org/apache/hadoop/hbase/replication/regionserver/RegionReplicaReplicationEndpoint.java:[531,13]
error: non-static variable super cannot be referenced from a static context
[ERROR] /x1/jenkins/jenkins-slave/workspace/HBase-1.1/hbase-server/src/main/java/org/apache/hadoop/hbase/replication/regionserver/RegionReplicaReplicationEndpoint.java:[531,18]
error: cannot find symbol
[ERROR]   symbol: method getExceptionMessage()
/x1/jenkins/jenkins-slave/workspace/HBase-1.1/hbase-server/src/main/java/org/apache/hadoop/hbase/replication/regionserver/RegionReplicaReplicationEndpoint.java:[531,55]
error: cannot find symbol
[ERROR]   symbol:   variable tableName
  location: class RegionReplicaReplayCallable
/x1/jenkins/jenkins-slave/workspace/HBase-1.1/hbase-server/src/main/java/org/apache/hadoop/hbase/replication/regionserver/RegionReplicaReplicationEndpoint.java:[532,71]
error: cannot find symbol
[ERROR]   symbol:   variable row
  location: class RegionReplicaReplayCallable
/x1/jenkins/jenkins-slave/workspace/HBase-1.1/hbase-server/src/main/java/org/apache/hadoop/hbase/replication/regionserver/RegionReplicaReplicationEndpoint.java:[529,4]
error: method does not override or implement a method from a supertype
[INFO] 20 errors 
[INFO] -------------------------------------------------------------
[INFO] ------------------------------------------------------------------------
[INFO] Reactor Summary:
[INFO] 
[INFO] HBase ............................................. SUCCESS [7.576s]
[INFO] HBase - Checkstyle ................................ SUCCESS [0.898s]
[INFO] HBase - Annotations ............................... SUCCESS [1.000s]
[INFO] HBase - Common .................................... SUCCESS [1:15.940s]
[INFO] HBase - Protocol .................................. SUCCESS [7.990s]
[INFO] HBase - Client .................................... SUCCESS [1:12.934s]
[INFO] HBase - Hadoop Compatibility ...................... SUCCESS [7.202s]
[INFO] HBase - Hadoop Two Compatibility .................. SUCCESS [6.207s]
[INFO] HBase - Prefix Tree ............................... SUCCESS [8.121s]
[INFO] HBase - Server .................................... FAILURE [5.490s]
[INFO] HBase - Testing Util .............................. SKIPPED
[INFO] HBase - Thrift .................................... SKIPPED
[INFO] HBase - Rest ...................................... SKIPPED
[INFO] HBase - Shell ..................................... SKIPPED
[INFO] HBase - Integration Tests ......................... SKIPPED
[INFO] HBase - Examples .................................. SKIPPED
[INFO] HBase - Assembly .................................. SKIPPED
[INFO] ------------------------------------------------------------------------
[INFO] BUILD FAILURE
[INFO] ------------------------------------------------------------------------
[INFO] Total time: 3:14.065s
[INFO] Finished at: Fri Feb 06 16:39:12 UTC 2015
[INFO] Final Memory: 75M/1098M
[INFO] ------------------------------------------------------------------------
[ERROR] Failed to execute goal org.apache.maven.plugins:maven-compiler-plugin:2.5.1:compile
(default-compile) on project hbase-server: Compilation failure: Compilation failure:
[ERROR] /x1/jenkins/jenkins-slave/workspace/HBase-1.1/hbase-server/src/main/java/org/apache/hadoop/hbase/replication/regionserver/RegionReplicaReplicationEndpoint.java:[50,37]
error: cannot find symbol
[ERROR] symbol:   class RegionAdminServiceCallable
[ERROR] location: package org.apache.hadoop.hbase.client
[ERROR] /x1/jenkins/jenkins-slave/workspace/HBase-1.1/hbase-server/src/main/java/org/apache/hadoop/hbase/replication/regionserver/RegionReplicaReplicationEndpoint.java:[455,12]
error: cannot find symbol
[ERROR] symbol:   class RegionAdminServiceCallable
[ERROR] location: class RegionReplicaReplicationEndpoint
[ERROR] /x1/jenkins/jenkins-slave/workspace/HBase-1.1/hbase-server/src/main/java/org/apache/hadoop/hbase/replication/regionserver/RegionReplicaReplicationEndpoint.java:[395,13]
error: constructor RetryingRpcCallable in class RetryingRpcCallable<V> cannot be applied
to given types;
[ERROR] required: RpcRetryingCallerFactory,RetryingCallable<ReplicateWALEntryResponse>,int
[ERROR] found: RpcRetryingCallerFactory,RegionReplicaReplayCallable,int
[ERROR] reason: actual argument RegionReplicaReplayCallable cannot be converted to RetryingCallable<ReplicateWALEntryResponse>
by method invocation conversion
[ERROR] where V is a type-variable:
[ERROR] V extends Object declared in class RetryingRpcCallable
[ERROR] /x1/jenkins/jenkins-slave/workspace/HBase-1.1/hbase-server/src/main/java/org/apache/hadoop/hbase/replication/regionserver/RegionReplicaReplicationEndpoint.java:[479,46]
error: non-static variable connection cannot be referenced from a static context
[ERROR] /x1/jenkins/jenkins-slave/workspace/HBase-1.1/hbase-server/src/main/java/org/apache/hadoop/hbase/replication/regionserver/RegionReplicaReplicationEndpoint.java:[479,58]
error: cannot find symbol
[ERROR] symbol:   variable tableName
[ERROR] location: class RegionReplicaReplayCallable
[ERROR] /x1/jenkins/jenkins-slave/workspace/HBase-1.1/hbase-server/src/main/java/org/apache/hadoop/hbase/replication/regionserver/RegionReplicaReplicationEndpoint.java:[479,69]
error: cannot find symbol
[ERROR] symbol:   variable row
[ERROR] location: class RegionReplicaReplayCallable
[ERROR] /x1/jenkins/jenkins-slave/workspace/HBase-1.1/hbase-server/src/main/java/org/apache/hadoop/hbase/replication/regionserver/RegionReplicaReplicationEndpoint.java:[483,6]
error: cannot find symbol
[ERROR] symbol:   variable location
[ERROR] location: class RegionReplicaReplayCallable
[ERROR] /x1/jenkins/jenkins-slave/workspace/HBase-1.1/hbase-server/src/main/java/org/apache/hadoop/hbase/replication/regionserver/RegionReplicaReplicationEndpoint.java:[484,10]
error: cannot find symbol
[ERROR] symbol:   variable location
[ERROR] location: class RegionReplicaReplayCallable
[ERROR] /x1/jenkins/jenkins-slave/workspace/HBase-1.1/hbase-server/src/main/java/org/apache/hadoop/hbase/replication/regionserver/RegionReplicaReplicationEndpoint.java:[491,24]
error: cannot find symbol
[ERROR] symbol:   variable location
[ERROR] location: class RegionReplicaReplayCallable
[ERROR] /x1/jenkins/jenkins-slave/workspace/HBase-1.1/hbase-server/src/main/java/org/apache/hadoop/hbase/replication/regionserver/RegionReplicaReplicationEndpoint.java:[497,13]
error: cannot find symbol
[ERROR] symbol:   variable location
[ERROR] location: class RegionReplicaReplayCallable
[ERROR] /x1/jenkins/jenkins-slave/workspace/HBase-1.1/hbase-server/src/main/java/org/apache/hadoop/hbase/replication/regionserver/RegionReplicaReplicationEndpoint.java:[477,4]
error: method does not override or implement a method from a supertype
[ERROR] /x1/jenkins/jenkins-slave/workspace/HBase-1.1/hbase-server/src/main/java/org/apache/hadoop/hbase/replication/regionserver/RegionReplicaReplicationEndpoint.java:[500,4]
error: method does not override or implement a method from a supertype
[ERROR] /x1/jenkins/jenkins-slave/workspace/HBase-1.1/hbase-server/src/main/java/org/apache/hadoop/hbase/replication/regionserver/RegionReplicaReplicationEndpoint.java:[518,26]
error: cannot find symbol
[ERROR] symbol:   variable location
[ERROR] location: class RegionReplicaReplayCallable
[ERROR] /x1/jenkins/jenkins-slave/workspace/HBase-1.1/hbase-server/src/main/java/org/apache/hadoop/hbase/replication/regionserver/RegionReplicaReplicationEndpoint.java:[522,31]
error: cannot find symbol
[ERROR] symbol:   variable tableName
[ERROR] location: class RegionReplicaReplayCallable
[ERROR] /x1/jenkins/jenkins-slave/workspace/HBase-1.1/hbase-server/src/main/java/org/apache/hadoop/hbase/replication/regionserver/RegionReplicaReplicationEndpoint.java:[523,15]
error: cannot find symbol
[ERROR] symbol:   variable stub
[ERROR] location: class RegionReplicaReplayCallable
[ERROR] /x1/jenkins/jenkins-slave/workspace/HBase-1.1/hbase-server/src/main/java/org/apache/hadoop/hbase/replication/regionserver/RegionReplicaReplicationEndpoint.java:[531,13]
error: non-static variable super cannot be referenced from a static context
[ERROR] /x1/jenkins/jenkins-slave/workspace/HBase-1.1/hbase-server/src/main/java/org/apache/hadoop/hbase/replication/regionserver/RegionReplicaReplicationEndpoint.java:[531,18]
error: cannot find symbol
[ERROR] symbol: method getExceptionMessage()
[ERROR] /x1/jenkins/jenkins-slave/workspace/HBase-1.1/hbase-server/src/main/java/org/apache/hadoop/hbase/replication/regionserver/RegionReplicaReplicationEndpoint.java:[531,55]
error: cannot find symbol
[ERROR] symbol:   variable tableName
[ERROR] location: class RegionReplicaReplayCallable
[ERROR] /x1/jenkins/jenkins-slave/workspace/HBase-1.1/hbase-server/src/main/java/org/apache/hadoop/hbase/replication/regionserver/RegionReplicaReplicationEndpoint.java:[532,71]
error: cannot find symbol
[ERROR] symbol:   variable row
[ERROR] location: class RegionReplicaReplayCallable
[ERROR] /x1/jenkins/jenkins-slave/workspace/HBase-1.1/hbase-server/src/main/java/org/apache/hadoop/hbase/replication/regionserver/RegionReplicaReplicationEndpoint.java:[529,4]
error: method does not override or implement a method from a supertype
[ERROR] -> [Help 1]
[ERROR] 
[ERROR] To see the full stack trace of the errors, re-run Maven with the -e switch.
[ERROR] Re-run Maven using the -X switch to enable full debug logging.
[ERROR] 
[ERROR] For more information about the errors and possible solutions, please read the following
articles:
[ERROR] [Help 1] http://cwiki.apache.org/confluence/display/MAVEN/MojoFailureException
[ERROR] 
[ERROR] After correcting the problems, you can resume the build with the command
[ERROR]   mvn <goals> -rf :hbase-server
Build step 'Invoke top-level Maven targets' marked build as failure
Performing Post build task...
Match found for :.* : True
Logical operation result is TRUE
Running script  :   ZOMBIE_TESTS_COUNT=`jps | grep surefirebooter | wc -l`
  if [[ $ZOMBIE_TESTS_COUNT != 0 ]] ; then
    #It seems sometimes the tests are not dying immediately. Let's give them 10s
    echo "Suspicious java process found - waiting 10s to see if there are just slow to stop"
    sleep 10   
    ZOMBIE_TESTS_COUNT=`jps | grep surefirebooter | wc -l`
    if [[ $ZOMBIE_TESTS_COUNT != 0 ]] ; then
      echo "There are $ZOMBIE_TESTS_COUNT zombie tests, they should have been killed by surefire
but survived"
      echo "************ BEGIN zombies jstack extract"
      ZB_STACK=`jps | grep surefirebooter | cut -d ' ' -f 1 | xargs -n 1 jstack | grep ".test"
| grep "\.java"`
      jps | grep surefirebooter | cut -d ' ' -f 1 | xargs -n 1 jstack
      echo "************ END  zombies jstack extract"
      JIRA_COMMENT="$JIRA_COMMENT

     {color:red}-1 core zombie tests{color}.  There are ${ZOMBIE_TESTS_COUNT} zombie test(s):
${ZB_STACK}"
      BAD=1
      jps | grep surefirebooter | cut -d ' ' -f 1 | xargs kill -9
    else
      echo "We're ok: there is no zombie test, but some tests took some time to stop"
    fi
  else
    echo "We're ok: there is no zombie test"
  fi
[HBase-1.1] $ /bin/bash -xe /tmp/hudson7307193870676762492.sh
++ jps
++ grep surefirebooter
++ wc -l
+ ZOMBIE_TESTS_COUNT=1
+ [[ 1 != 0 ]]
+ echo 'Suspicious java process found - waiting 10s to see if there are just slow to stop'
Suspicious java process found - waiting 10s to see if there are just slow to stop
+ sleep 10
++ jps
++ grep surefirebooter
++ wc -l
+ ZOMBIE_TESTS_COUNT=1
+ [[ 1 != 0 ]]
+ echo 'There are 1 zombie tests, they should have been killed by surefire but survived'
There are 1 zombie tests, they should have been killed by surefire but survived
+ echo '************ BEGIN zombies jstack extract'
************ BEGIN zombies jstack extract
++ jps
++ grep surefirebooter
++ cut -d ' ' -f 1
++ xargs -n 1 jstack
++ grep .test
++ grep '\.java'
18368: Unable to open socket file: target process not responding or HotSpot VM not loaded
The -F option can be used when the target process is not responding
+ ZB_STACK=
POST BUILD TASK : FAILURE
END OF POST BUILD TASK : 0
Archiving artifacts
Sending artifact delta relative to HBase-1.1 #140
Archived 267 artifacts
Archive block size is 32768
Received 3 blocks and 1595413 bytes
Compression is 5.8%
Took 3.5 sec
Recording test results
Updating HBASE-11568

Mime
View raw message