hbase-builds mailing list archives

Site index · List index
Message view « Date » · « Thread »
Top « Date » · « Thread »
From Apache Jenkins Server <jenk...@builds.apache.org>
Subject Build failed in Jenkins: HBase-TRUNK #6084
Date Wed, 04 Feb 2015 05:09:41 GMT
See <https://builds.apache.org/job/HBase-TRUNK/6084/changes>

Changes:

[tedyu] HBASE-12957 region_mover#isSuccessfulScan may be extremely slow on region with lots
of expired data (Hongyu Bi)

------------------------------------------
[...truncated 811 lines...]
[INFO] --- maven-jar-plugin:2.4:test-jar (default) @ hbase-prefix-tree ---
[INFO] Building jar: /x1/jenkins/jenkins-slave/workspace/HBase-TRUNK/hbase-prefix-tree/target/hbase-prefix-tree-2.0.0-SNAPSHOT-tests.jar
[INFO] 
[INFO] --- maven-jar-plugin:2.4:jar (default-jar) @ hbase-prefix-tree ---
[INFO] Building jar: /x1/jenkins/jenkins-slave/workspace/HBase-TRUNK/hbase-prefix-tree/target/hbase-prefix-tree-2.0.0-SNAPSHOT.jar
[INFO] 
[INFO] --- maven-install-plugin:2.3.1:install (default-install) @ hbase-prefix-tree ---
[INFO] Installing /x1/jenkins/jenkins-slave/workspace/HBase-TRUNK/hbase-prefix-tree/target/hbase-prefix-tree-2.0.0-SNAPSHOT.jar
to /home/jenkins/.m2/repository/org/apache/hbase/hbase-prefix-tree/2.0.0-SNAPSHOT/hbase-prefix-tree-2.0.0-SNAPSHOT.jar
[INFO] Installing /x1/jenkins/jenkins-slave/workspace/HBase-TRUNK/hbase-prefix-tree/pom.xml
to /home/jenkins/.m2/repository/org/apache/hbase/hbase-prefix-tree/2.0.0-SNAPSHOT/hbase-prefix-tree-2.0.0-SNAPSHOT.pom
[INFO] Installing /x1/jenkins/jenkins-slave/workspace/HBase-TRUNK/hbase-prefix-tree/target/hbase-prefix-tree-2.0.0-SNAPSHOT-sources.jar
to /home/jenkins/.m2/repository/org/apache/hbase/hbase-prefix-tree/2.0.0-SNAPSHOT/hbase-prefix-tree-2.0.0-SNAPSHOT-sources.jar
[INFO] Installing /x1/jenkins/jenkins-slave/workspace/HBase-TRUNK/hbase-prefix-tree/target/hbase-prefix-tree-2.0.0-SNAPSHOT-tests.jar
to /home/jenkins/.m2/repository/org/apache/hbase/hbase-prefix-tree/2.0.0-SNAPSHOT/hbase-prefix-tree-2.0.0-SNAPSHOT-tests.jar
[INFO]                                                                         
[INFO] ------------------------------------------------------------------------
[INFO] Building HBase - Server 2.0.0-SNAPSHOT
[INFO] ------------------------------------------------------------------------
[INFO] 
[INFO] --- maven-enforcer-plugin:1.0.1:enforce (enforce) @ hbase-server ---
[INFO] 
[INFO] --- jacoco-maven-plugin:0.6.2.201302030002:prepare-agent (prepare-agent) @ hbase-server
---
[INFO] Skipping JaCoCo execution
[INFO] argLine set to 
[INFO] 
[INFO] --- maven-antrun-plugin:1.6:run (generate) @ hbase-server ---
[INFO] Executing tasks

main:
    [mkdir] Created dir: /x1/jenkins/jenkins-slave/workspace/HBase-TRUNK/hbase-server/target/hbase-webapps
     [copy] Copying 20 files to /x1/jenkins/jenkins-slave/workspace/HBase-TRUNK/hbase-server/target/hbase-webapps
log4j:WARN No appenders could be found for logger (org.mortbay.log).
log4j:WARN Please initialize the log4j system properly.
log4j:WARN See http://logging.apache.org/log4j/1.2/faq.html#noconfig for more info.
    [mkdir] Created dir: /x1/jenkins/jenkins-slave/workspace/HBase-TRUNK/hbase-server/target/hbase-webapps/master/WEB-INF
    [mkdir] Created dir: /x1/jenkins/jenkins-slave/workspace/HBase-TRUNK/hbase-server/target/hbase-webapps/regionserver/WEB-INF
[INFO] Executed tasks
[INFO] 
[INFO] --- build-helper-maven-plugin:1.9.1:add-source (jspcSource-packageInfo-source) @ hbase-server
---
[INFO] Source directory: /x1/jenkins/jenkins-slave/workspace/HBase-TRUNK/hbase-server/target/generated-jamon
added.
[INFO] Source directory: /x1/jenkins/jenkins-slave/workspace/HBase-TRUNK/hbase-server/target/generated-sources/java
added.
[INFO] 
[INFO] --- jamon-maven-plugin:2.3.4:translate (default) @ hbase-server ---
[INFO] Translating 10 templates from /x1/jenkins/jenkins-slave/workspace/HBase-TRUNK/hbase-server/src/main/jamon
to /x1/jenkins/jenkins-slave/workspace/HBase-TRUNK/hbase-server/target/generated-jamon
[INFO] 
[INFO] --- maven-remote-resources-plugin:1.4:process (default) @ hbase-server ---
[INFO] 
[INFO] --- maven-resources-plugin:2.6:resources (default-resources) @ hbase-server ---
[INFO] Using 'UTF-8' encoding to copy filtered resources.
[INFO] Copying 22 resources
[INFO] Copying 3 resources
[INFO] 
[INFO] --- maven-compiler-plugin:3.2:compile (default-compile) @ hbase-server ---
[INFO] Compiling 723 source files to /x1/jenkins/jenkins-slave/workspace/HBase-TRUNK/hbase-server/target/classes
[WARNING] /x1/jenkins/jenkins-slave/workspace/HBase-TRUNK/hbase-server/src/main/java/org/apache/hadoop/hbase/regionserver/HStore.java:[1149,52]
[EmptyStatement] Empty statement
    (see http://code.google.com/p/error-prone/wiki/EmptyStatement)
  Did you mean 'CompactionRequest cr = compaction.getRequest();'?
[WARNING] /x1/jenkins/jenkins-slave/workspace/HBase-TRUNK/hbase-server/src/main/java/org/apache/hadoop/hbase/io/hfile/HFileBlock.java:[1876,52]
[EmptyStatement] Empty statement
    (see http://code.google.com/p/error-prone/wiki/EmptyStatement)
  Did you mean 'int compressedBlockSizeNoHeader = buf.getInt();'?
[WARNING] /x1/jenkins/jenkins-slave/workspace/HBase-TRUNK/hbase-server/src/main/java/org/apache/hadoop/hbase/io/hfile/HFileBlock.java:[1877,54]
[EmptyStatement] Empty statement
    (see http://code.google.com/p/error-prone/wiki/EmptyStatement)
  Did you mean 'int uncompressedBlockSizeNoHeader = buf.getInt();'?
[WARNING] /x1/jenkins/jenkins-slave/workspace/HBase-TRUNK/hbase-server/src/main/java/org/apache/hadoop/hbase/http/log/LogLevel.java:[171,67]
[EmptyStatement] Empty statement
    (see http://code.google.com/p/error-prone/wiki/EmptyStatement)
  Did you mean 'for(; (lev = log.getLevel()) == null; log = log.getParent())'?
[INFO] /x1/jenkins/jenkins-slave/workspace/HBase-TRUNK/hbase-server/src/main/java/org/apache/hadoop/hbase/mapreduce/replication/VerifyReplication.java:[-1,-1]
Some input files use or override a deprecated API.
[INFO] /x1/jenkins/jenkins-slave/workspace/HBase-TRUNK/hbase-server/src/main/java/org/apache/hadoop/hbase/mapreduce/replication/VerifyReplication.java:[-1,-1]
Recompile with -Xlint:deprecation for details.
[INFO] /x1/jenkins/jenkins-slave/workspace/HBase-TRUNK/hbase-server/src/main/java/org/apache/hadoop/hbase/coprocessor/CoprocessorHost.java:[-1,-1]
Some input files use unchecked or unsafe operations.
[INFO] /x1/jenkins/jenkins-slave/workspace/HBase-TRUNK/hbase-server/src/main/java/org/apache/hadoop/hbase/coprocessor/CoprocessorHost.java:[-1,-1]
Recompile with -Xlint:unchecked for details.
[INFO] 
[INFO] --- maven-dependency-plugin:2.1:build-classpath (create-mrapp-generated-classpath)
@ hbase-server ---
[INFO] Wrote classpath file '/x1/jenkins/jenkins-slave/workspace/HBase-TRUNK/hbase-server/target/test-classes/mrapp-generated-classpath'.
[INFO] 
[INFO] --- maven-resources-plugin:2.6:testResources (default-testResources) @ hbase-server
---
[INFO] Using 'UTF-8' encoding to copy filtered resources.
[INFO] Copying 12 resources
[INFO] Copying 3 resources
[INFO] 
[INFO] --- maven-compiler-plugin:3.2:testCompile (default-testCompile) @ hbase-server ---
[INFO] Compiling 649 source files to /x1/jenkins/jenkins-slave/workspace/HBase-TRUNK/hbase-server/target/test-classes
[INFO] /x1/jenkins/jenkins-slave/workspace/HBase-TRUNK/hbase-server/src/test/java/org/apache/hadoop/hbase/regionserver/TestScanner.java:
Some input files use or override a deprecated API.
[INFO] /x1/jenkins/jenkins-slave/workspace/HBase-TRUNK/hbase-server/src/test/java/org/apache/hadoop/hbase/regionserver/TestScanner.java:
Recompile with -Xlint:deprecation for details.
[INFO] /x1/jenkins/jenkins-slave/workspace/HBase-TRUNK/hbase-server/src/test/java/org/apache/hadoop/hbase/client/TestFromClientSide3.java:
Some input files use unchecked or unsafe operations.
[INFO] /x1/jenkins/jenkins-slave/workspace/HBase-TRUNK/hbase-server/src/test/java/org/apache/hadoop/hbase/client/TestFromClientSide3.java:
Recompile with -Xlint:unchecked for details.
[INFO] -------------------------------------------------------------
[WARNING] COMPILATION WARNING : 
[INFO] -------------------------------------------------------------
[WARNING] /x1/jenkins/jenkins-slave/workspace/HBase-TRUNK/hbase-server/src/test/java/org/apache/hadoop/hbase/http/ssl/KeyStoreTestUtil.java:[46,25]
sun.security.x509.AlgorithmId is internal proprietary API and may be removed in a future release
[WARNING] /x1/jenkins/jenkins-slave/workspace/HBase-TRUNK/hbase-server/src/test/java/org/apache/hadoop/hbase/http/ssl/KeyStoreTestUtil.java:[47,25]
sun.security.x509.CertificateAlgorithmId is internal proprietary API and may be removed in
a future release
[WARNING] /x1/jenkins/jenkins-slave/workspace/HBase-TRUNK/hbase-server/src/test/java/org/apache/hadoop/hbase/http/ssl/KeyStoreTestUtil.java:[48,25]
sun.security.x509.CertificateIssuerName is internal proprietary API and may be removed in
a future release
[WARNING] /x1/jenkins/jenkins-slave/workspace/HBase-TRUNK/hbase-server/src/test/java/org/apache/hadoop/hbase/http/ssl/KeyStoreTestUtil.java:[49,25]
sun.security.x509.CertificateSerialNumber is internal proprietary API and may be removed in
a future release
[WARNING] /x1/jenkins/jenkins-slave/workspace/HBase-TRUNK/hbase-server/src/test/java/org/apache/hadoop/hbase/http/ssl/KeyStoreTestUtil.java:[50,25]
sun.security.x509.CertificateSubjectName is internal proprietary API and may be removed in
a future release
[WARNING] /x1/jenkins/jenkins-slave/workspace/HBase-TRUNK/hbase-server/src/test/java/org/apache/hadoop/hbase/http/ssl/KeyStoreTestUtil.java:[51,25]
sun.security.x509.CertificateValidity is internal proprietary API and may be removed in a
future release
[WARNING] /x1/jenkins/jenkins-slave/workspace/HBase-TRUNK/hbase-server/src/test/java/org/apache/hadoop/hbase/http/ssl/KeyStoreTestUtil.java:[52,25]
sun.security.x509.CertificateVersion is internal proprietary API and may be removed in a future
release
[WARNING] /x1/jenkins/jenkins-slave/workspace/HBase-TRUNK/hbase-server/src/test/java/org/apache/hadoop/hbase/http/ssl/KeyStoreTestUtil.java:[53,25]
sun.security.x509.CertificateX509Key is internal proprietary API and may be removed in a future
release
[WARNING] /x1/jenkins/jenkins-slave/workspace/HBase-TRUNK/hbase-server/src/test/java/org/apache/hadoop/hbase/http/ssl/KeyStoreTestUtil.java:[54,25]
sun.security.x509.X500Name is internal proprietary API and may be removed in a future release
[WARNING] /x1/jenkins/jenkins-slave/workspace/HBase-TRUNK/hbase-server/src/test/java/org/apache/hadoop/hbase/http/ssl/KeyStoreTestUtil.java:[55,25]
sun.security.x509.X509CertImpl is internal proprietary API and may be removed in a future
release
[WARNING] /x1/jenkins/jenkins-slave/workspace/HBase-TRUNK/hbase-server/src/test/java/org/apache/hadoop/hbase/http/ssl/KeyStoreTestUtil.java:[56,25]
sun.security.x509.X509CertInfo is internal proprietary API and may be removed in a future
release
[WARNING] /x1/jenkins/jenkins-slave/workspace/HBase-TRUNK/hbase-server/src/test/java/org/apache/hadoop/hbase/http/ssl/KeyStoreTestUtil.java:[85,5]
sun.security.x509.X509CertInfo is internal proprietary API and may be removed in a future
release
[WARNING] /x1/jenkins/jenkins-slave/workspace/HBase-TRUNK/hbase-server/src/test/java/org/apache/hadoop/hbase/http/ssl/KeyStoreTestUtil.java:[85,29]
sun.security.x509.X509CertInfo is internal proprietary API and may be removed in a future
release
[WARNING] /x1/jenkins/jenkins-slave/workspace/HBase-TRUNK/hbase-server/src/test/java/org/apache/hadoop/hbase/http/ssl/KeyStoreTestUtil.java:[88,5]
sun.security.x509.CertificateValidity is internal proprietary API and may be removed in a
future release
[WARNING] /x1/jenkins/jenkins-slave/workspace/HBase-TRUNK/hbase-server/src/test/java/org/apache/hadoop/hbase/http/ssl/KeyStoreTestUtil.java:[88,40]
sun.security.x509.CertificateValidity is internal proprietary API and may be removed in a
future release
[WARNING] /x1/jenkins/jenkins-slave/workspace/HBase-TRUNK/hbase-server/src/test/java/org/apache/hadoop/hbase/http/ssl/KeyStoreTestUtil.java:[90,5]
sun.security.x509.X500Name is internal proprietary API and may be removed in a future release
[WARNING] /x1/jenkins/jenkins-slave/workspace/HBase-TRUNK/hbase-server/src/test/java/org/apache/hadoop/hbase/http/ssl/KeyStoreTestUtil.java:[90,26]
sun.security.x509.X500Name is internal proprietary API and may be removed in a future release
[WARNING] /x1/jenkins/jenkins-slave/workspace/HBase-TRUNK/hbase-server/src/test/java/org/apache/hadoop/hbase/http/ssl/KeyStoreTestUtil.java:[92,14]
sun.security.x509.X509CertInfo is internal proprietary API and may be removed in a future
release
[WARNING] /x1/jenkins/jenkins-slave/workspace/HBase-TRUNK/hbase-server/src/test/java/org/apache/hadoop/hbase/http/ssl/KeyStoreTestUtil.java:[93,14]
sun.security.x509.X509CertInfo is internal proprietary API and may be removed in a future
release
[WARNING] /x1/jenkins/jenkins-slave/workspace/HBase-TRUNK/hbase-server/src/test/java/org/apache/hadoop/hbase/http/ssl/KeyStoreTestUtil.java:[93,46]
sun.security.x509.CertificateSerialNumber is internal proprietary API and may be removed in
a future release
[WARNING] /x1/jenkins/jenkins-slave/workspace/HBase-TRUNK/hbase-server/src/test/java/org/apache/hadoop/hbase/http/ssl/KeyStoreTestUtil.java:[94,14]
sun.security.x509.X509CertInfo is internal proprietary API and may be removed in a future
release
[WARNING] /x1/jenkins/jenkins-slave/workspace/HBase-TRUNK/hbase-server/src/test/java/org/apache/hadoop/hbase/http/ssl/KeyStoreTestUtil.java:[94,40]
sun.security.x509.CertificateSubjectName is internal proprietary API and may be removed in
a future release
[WARNING] /x1/jenkins/jenkins-slave/workspace/HBase-TRUNK/hbase-server/src/test/java/org/apache/hadoop/hbase/http/ssl/KeyStoreTestUtil.java:[95,14]
sun.security.x509.X509CertInfo is internal proprietary API and may be removed in a future
release
[WARNING] /x1/jenkins/jenkins-slave/workspace/HBase-TRUNK/hbase-server/src/test/java/org/apache/hadoop/hbase/http/ssl/KeyStoreTestUtil.java:[95,39]
sun.security.x509.CertificateIssuerName is internal proprietary API and may be removed in
a future release
[WARNING] /x1/jenkins/jenkins-slave/workspace/HBase-TRUNK/hbase-server/src/test/java/org/apache/hadoop/hbase/http/ssl/KeyStoreTestUtil.java:[96,14]
sun.security.x509.X509CertInfo is internal proprietary API and may be removed in a future
release
[WARNING] /x1/jenkins/jenkins-slave/workspace/HBase-TRUNK/hbase-server/src/test/java/org/apache/hadoop/hbase/http/ssl/KeyStoreTestUtil.java:[96,36]
sun.security.x509.CertificateX509Key is internal proprietary API and may be removed in a future
release
[WARNING] /x1/jenkins/jenkins-slave/workspace/HBase-TRUNK/hbase-server/src/test/java/org/apache/hadoop/hbase/http/ssl/KeyStoreTestUtil.java:[98,12]
sun.security.x509.X509CertInfo is internal proprietary API and may be removed in a future
release
[WARNING] /x1/jenkins/jenkins-slave/workspace/HBase-TRUNK/hbase-server/src/test/java/org/apache/hadoop/hbase/http/ssl/KeyStoreTestUtil.java:[98,38]
sun.security.x509.CertificateVersion is internal proprietary API and may be removed in a future
release
[WARNING] /x1/jenkins/jenkins-slave/workspace/HBase-TRUNK/hbase-server/src/test/java/org/apache/hadoop/hbase/http/ssl/KeyStoreTestUtil.java:[98,57]
sun.security.x509.CertificateVersion is internal proprietary API and may be removed in a future
release
[WARNING] /x1/jenkins/jenkins-slave/workspace/HBase-TRUNK/hbase-server/src/test/java/org/apache/hadoop/hbase/http/ssl/KeyStoreTestUtil.java:[99,5]
sun.security.x509.AlgorithmId is internal proprietary API and may be removed in a future release
[WARNING] /x1/jenkins/jenkins-slave/workspace/HBase-TRUNK/hbase-server/src/test/java/org/apache/hadoop/hbase/http/ssl/KeyStoreTestUtil.java:[99,28]
sun.security.x509.AlgorithmId is internal proprietary API and may be removed in a future release
[WARNING] /x1/jenkins/jenkins-slave/workspace/HBase-TRUNK/hbase-server/src/test/java/org/apache/hadoop/hbase/http/ssl/KeyStoreTestUtil.java:[99,40]
sun.security.x509.AlgorithmId is internal proprietary API and may be removed in a future release
[WARNING] /x1/jenkins/jenkins-slave/workspace/HBase-TRUNK/hbase-server/src/test/java/org/apache/hadoop/hbase/http/ssl/KeyStoreTestUtil.java:[100,14]
sun.security.x509.X509CertInfo is internal proprietary API and may be removed in a future
release
[WARNING] /x1/jenkins/jenkins-slave/workspace/HBase-TRUNK/hbase-server/src/test/java/org/apache/hadoop/hbase/http/ssl/KeyStoreTestUtil.java:[100,45]
sun.security.x509.CertificateAlgorithmId is internal proprietary API and may be removed in
a future release
[WARNING] /x1/jenkins/jenkins-slave/workspace/HBase-TRUNK/hbase-server/src/test/java/org/apache/hadoop/hbase/http/ssl/KeyStoreTestUtil.java:[103,5]
sun.security.x509.X509CertImpl is internal proprietary API and may be removed in a future
release
[WARNING] /x1/jenkins/jenkins-slave/workspace/HBase-TRUNK/hbase-server/src/test/java/org/apache/hadoop/hbase/http/ssl/KeyStoreTestUtil.java:[103,29]
sun.security.x509.X509CertImpl is internal proprietary API and may be removed in a future
release
[WARNING] /x1/jenkins/jenkins-slave/workspace/HBase-TRUNK/hbase-server/src/test/java/org/apache/hadoop/hbase/http/ssl/KeyStoreTestUtil.java:[107,13]
sun.security.x509.AlgorithmId is internal proprietary API and may be removed in a future release
[WARNING] /x1/jenkins/jenkins-slave/workspace/HBase-TRUNK/hbase-server/src/test/java/org/apache/hadoop/hbase/http/ssl/KeyStoreTestUtil.java:[107,35]
sun.security.x509.X509CertImpl is internal proprietary API and may be removed in a future
release
[WARNING] /x1/jenkins/jenkins-slave/workspace/HBase-TRUNK/hbase-server/src/test/java/org/apache/hadoop/hbase/http/ssl/KeyStoreTestUtil.java:[109,12]
sun.security.x509.CertificateAlgorithmId is internal proprietary API and may be removed in
a future release
[WARNING] /x1/jenkins/jenkins-slave/workspace/HBase-TRUNK/hbase-server/src/test/java/org/apache/hadoop/hbase/http/ssl/KeyStoreTestUtil.java:[109,48]
sun.security.x509.CertificateAlgorithmId is internal proprietary API and may be removed in
a future release
[WARNING] /x1/jenkins/jenkins-slave/workspace/HBase-TRUNK/hbase-server/src/test/java/org/apache/hadoop/hbase/http/ssl/KeyStoreTestUtil.java:[111,16]
sun.security.x509.X509CertImpl is internal proprietary API and may be removed in a future
release
[INFO] 41 warnings 
[INFO] -------------------------------------------------------------
[INFO] -------------------------------------------------------------
[ERROR] COMPILATION ERROR : 
[INFO] -------------------------------------------------------------
[ERROR] /x1/jenkins/jenkins-slave/workspace/HBase-TRUNK/hbase-server/src/test/java/org/apache/hadoop/hbase/regionserver/TestRegionServerHostname.java:[51,51]
cannot find symbol
  symbol:   variable HOSTNAME_KEY
  location: class org.apache.hadoop.hbase.regionserver.HRegionServer
[ERROR] /x1/jenkins/jenkins-slave/workspace/HBase-TRUNK/hbase-server/src/test/java/org/apache/hadoop/hbase/regionserver/TestRegionServerHostname.java:[82,55]
cannot find symbol
  symbol:   variable HOSTNAME_KEY
  location: class org.apache.hadoop.hbase.regionserver.HRegionServer
[INFO] 2 errors 
[INFO] -------------------------------------------------------------
[INFO] ------------------------------------------------------------------------
[INFO] Reactor Summary:
[INFO] 
[INFO] HBase ............................................. SUCCESS [7.029s]
[INFO] HBase - Checkstyle ................................ SUCCESS [1.596s]
[INFO] HBase - Annotations ............................... SUCCESS [0.851s]
[INFO] HBase - Protocol .................................. SUCCESS [10.904s]
[INFO] HBase - Common .................................... SUCCESS [1:29.311s]
[INFO] HBase - Client .................................... SUCCESS [1:15.746s]
[INFO] HBase - Hadoop Compatibility ...................... SUCCESS [7.164s]
[INFO] HBase - Hadoop Two Compatibility .................. SUCCESS [7.082s]
[INFO] HBase - Prefix Tree ............................... SUCCESS [8.494s]
[INFO] HBase - Server .................................... FAILURE [16.125s]
[INFO] HBase - Testing Util .............................. SKIPPED
[INFO] HBase - Thrift .................................... SKIPPED
[INFO] HBase - Shell ..................................... SKIPPED
[INFO] HBase - Integration Tests ......................... SKIPPED
[INFO] HBase - Examples .................................. SKIPPED
[INFO] HBase - Rest ...................................... SKIPPED
[INFO] HBase - Assembly .................................. SKIPPED
[INFO] ------------------------------------------------------------------------
[INFO] BUILD FAILURE
[INFO] ------------------------------------------------------------------------
[INFO] Total time: 3:45.177s
[INFO] Finished at: Wed Feb 04 05:09:07 UTC 2015
[INFO] Final Memory: 87M/741M
[INFO] ------------------------------------------------------------------------
[ERROR] Failed to execute goal org.apache.maven.plugins:maven-compiler-plugin:3.2:testCompile
(default-testCompile) on project hbase-server: Compilation failure: Compilation failure:
[ERROR] /x1/jenkins/jenkins-slave/workspace/HBase-TRUNK/hbase-server/src/test/java/org/apache/hadoop/hbase/regionserver/TestRegionServerHostname.java:[51,51]
cannot find symbol
[ERROR] symbol:   variable HOSTNAME_KEY
[ERROR] location: class org.apache.hadoop.hbase.regionserver.HRegionServer
[ERROR] /x1/jenkins/jenkins-slave/workspace/HBase-TRUNK/hbase-server/src/test/java/org/apache/hadoop/hbase/regionserver/TestRegionServerHostname.java:[82,55]
cannot find symbol
[ERROR] symbol:   variable HOSTNAME_KEY
[ERROR] location: class org.apache.hadoop.hbase.regionserver.HRegionServer
[ERROR] -> [Help 1]
[ERROR] 
[ERROR] To see the full stack trace of the errors, re-run Maven with the -e switch.
[ERROR] Re-run Maven using the -X switch to enable full debug logging.
[ERROR] 
[ERROR] For more information about the errors and possible solutions, please read the following
articles:
[ERROR] [Help 1] http://cwiki.apache.org/confluence/display/MAVEN/MojoFailureException
[ERROR] 
[ERROR] After correcting the problems, you can resume the build with the command
[ERROR]   mvn <goals> -rf :hbase-server
Build step 'Invoke top-level Maven targets' marked build as failure
[FINDBUGS] Skipping publisher since build result is FAILURE
Performing Post build task...
Match found for :.* : True
Logical operation result is TRUE
Running script  :   ZOMBIE_TESTS_COUNT=`jps | grep surefirebooter | wc -l`
  if [[ $ZOMBIE_TESTS_COUNT != 0 ]] ; then
    #It seems sometimes the tests are not dying immediately. Let's give them 10s
    echo "Suspicious java process found - waiting 10s to see if there are just slow to stop"
    sleep 10   
    ZOMBIE_TESTS_COUNT=`jps | grep surefirebooter | wc -l`
    if [[ $ZOMBIE_TESTS_COUNT != 0 ]] ; then
      echo "There are $ZOMBIE_TESTS_COUNT zombie tests, they should have been killed by surefire
but survived"
      echo "************ BEGIN zombies jstack extract"
      ZB_STACK=`jps | grep surefirebooter | cut -d ' ' -f 1 | xargs -n 1 jstack | grep ".test"
| grep "\.java"`
      jps | grep surefirebooter | cut -d ' ' -f 1 | xargs -n 1 jstack
      echo "************ END  zombies jstack extract"
      JIRA_COMMENT="$JIRA_COMMENT

     {color:red}-1 core zombie tests{color}.  There are ${ZOMBIE_TESTS_COUNT} zombie test(s):
${ZB_STACK}"
      BAD=1
      jps | grep surefirebooter | cut -d ' ' -f 1 | xargs kill -9
    else
      echo "We're ok: there is no zombie test, but some tests took some time to stop"
    fi
  else
    echo "We're ok: there is no zombie test"
  fi
[HBase-TRUNK] $ /bin/bash -xe /tmp/hudson8777549265572963738.sh
++ jps
++ grep surefirebooter
++ wc -l
+ ZOMBIE_TESTS_COUNT=1
+ [[ 1 != 0 ]]
+ echo 'Suspicious java process found - waiting 10s to see if there are just slow to stop'
Suspicious java process found - waiting 10s to see if there are just slow to stop
+ sleep 10
++ jps
++ grep surefirebooter
++ wc -l
+ ZOMBIE_TESTS_COUNT=1
+ [[ 1 != 0 ]]
+ echo 'There are 1 zombie tests, they should have been killed by surefire but survived'
There are 1 zombie tests, they should have been killed by surefire but survived
+ echo '************ BEGIN zombies jstack extract'
************ BEGIN zombies jstack extract
++ jps
++ grep surefirebooter
++ cut -d ' ' -f 1
++ xargs -n 1 jstack
++ grep .test
++ grep '\.java'
18368: Unable to open socket file: target process not responding or HotSpot VM not loaded
The -F option can be used when the target process is not responding
+ ZB_STACK=
POST BUILD TASK : FAILURE
END OF POST BUILD TASK : 0
Archiving artifacts
Sending artifact delta relative to HBase-TRUNK #6068
Archived 270 artifacts
Archive block size is 32768
Received 7 blocks and 1596467 bytes
Compression is 12.6%
Took 14 sec
Recording test results
Updating HBASE-12957

Mime
View raw message