hbase-builds mailing list archives

Site index · List index
Message view « Date » · « Thread »
Top « Date » · « Thread »
From Apache Jenkins Server <jenk...@builds.apache.org>
Subject Build failed in Jenkins: HBase-1.0 #720
Date Sat, 07 Feb 2015 03:47:52 GMT
See <https://builds.apache.org/job/HBase-1.0/720/changes>

Changes:

[enis] HBASE-11567 Write bulk load COMMIT events to WAL (Only partial patch containing PB
changes)

------------------------------------------
[...truncated 1859 lines...]
Tests run: 1, Failures: 0, Errors: 0, Skipped: 0, Time elapsed: 0.29 sec - in org.apache.hadoop.hbase.regionserver.wal.TestReadOldRootAndMetaEdits
Running org.apache.hadoop.hbase.regionserver.wal.TestLogRollAbort
Running org.apache.hadoop.hbase.regionserver.wal.TestLogRollPeriod
Tests run: 6, Failures: 0, Errors: 0, Skipped: 0, Time elapsed: 4.719 sec - in org.apache.hadoop.hbase.regionserver.wal.TestFSHLog
Running org.apache.hadoop.hbase.regionserver.wal.TestSecureWALReplay
Running org.apache.hadoop.hbase.regionserver.wal.TestWALReplayCompressed
Tests run: 2, Failures: 0, Errors: 0, Skipped: 0, Time elapsed: 19.81 sec - in org.apache.hadoop.hbase.regionserver.wal.TestLogRollAbort
Running org.apache.hadoop.hbase.regionserver.wal.TestWALReplay
Tests run: 9, Failures: 0, Errors: 0, Skipped: 0, Time elapsed: 39.172 sec - in org.apache.hadoop.hbase.regionserver.wal.TestSecureWALReplay
Running org.apache.hadoop.hbase.regionserver.wal.TestDurability
Tests run: 9, Failures: 0, Errors: 0, Skipped: 0, Time elapsed: 36.885 sec - in org.apache.hadoop.hbase.regionserver.wal.TestWALReplayCompressed
Tests run: 2, Failures: 0, Errors: 0, Skipped: 0, Time elapsed: 2.225 sec - in org.apache.hadoop.hbase.regionserver.wal.TestDurability
Running org.apache.hadoop.hbase.regionserver.TestParallelPut
Tests run: 2, Failures: 0, Errors: 0, Skipped: 0, Time elapsed: 51.15 sec - in org.apache.hadoop.hbase.regionserver.wal.TestLogRollPeriod
Running org.apache.hadoop.hbase.regionserver.TestMajorCompaction
Running org.apache.hadoop.hbase.regionserver.wal.TestProtobufLog
Tests run: 1, Failures: 0, Errors: 0, Skipped: 0, Time elapsed: 1.372 sec - in org.apache.hadoop.hbase.regionserver.wal.TestProtobufLog
Running org.apache.hadoop.hbase.regionserver.TestRegionReplicas
Tests run: 9, Failures: 0, Errors: 0, Skipped: 0, Time elapsed: 36.719 sec - in org.apache.hadoop.hbase.regionserver.wal.TestWALReplay
Running org.apache.hadoop.hbase.regionserver.TestEncryptionKeyRotation
Tests run: 2, Failures: 0, Errors: 0, Skipped: 0, Time elapsed: 12.808 sec - in org.apache.hadoop.hbase.regionserver.TestEncryptionKeyRotation
Running org.apache.hadoop.hbase.regionserver.TestZKLessSplitOnCluster
Tests run: 7, Failures: 0, Errors: 0, Skipped: 0, Time elapsed: 49.324 sec - in org.apache.hadoop.hbase.regionserver.TestMajorCompaction
Running org.apache.hadoop.hbase.regionserver.TestCompactionState
Tests run: 16, Failures: 0, Errors: 0, Skipped: 0, Time elapsed: 33.568 sec - in org.apache.hadoop.hbase.regionserver.TestZKLessSplitOnCluster
Running org.apache.hadoop.hbase.regionserver.TestFSErrorsExposed
Tests run: 5, Failures: 0, Errors: 0, Skipped: 0, Time elapsed: 24.495 sec - in org.apache.hadoop.hbase.regionserver.TestCompactionState
Running org.apache.hadoop.hbase.regionserver.TestDefaultMemStore
Tests run: 2, Failures: 0, Errors: 0, Skipped: 0, Time elapsed: 88.067 sec - in org.apache.hadoop.hbase.regionserver.TestParallelPut
Running org.apache.hadoop.hbase.regionserver.TestRegionServerMetrics
Tests run: 9, Failures: 0, Errors: 0, Skipped: 0, Time elapsed: 6.097 sec - in org.apache.hadoop.hbase.regionserver.TestRegionServerMetrics
Tests run: 3, Failures: 0, Errors: 0, Skipped: 0, Time elapsed: 24.754 sec - in org.apache.hadoop.hbase.regionserver.TestFSErrorsExposed
Running org.apache.hadoop.hbase.regionserver.TestGetClosestAtOrBefore
Running org.apache.hadoop.hbase.regionserver.TestRSKilledWhenInitializing
Tests run: 3, Failures: 0, Errors: 0, Skipped: 0, Time elapsed: 1.77 sec - in org.apache.hadoop.hbase.regionserver.TestGetClosestAtOrBefore
Running org.apache.hadoop.hbase.regionserver.TestReversibleScanners
Tests run: 5, Failures: 0, Errors: 0, Skipped: 0, Time elapsed: 3.7 sec - in org.apache.hadoop.hbase.regionserver.TestReversibleScanners
Running org.apache.hadoop.hbase.regionserver.TestRecoveredEdits
Tests run: 1, Failures: 0, Errors: 0, Skipped: 0, Time elapsed: 9.22 sec - in org.apache.hadoop.hbase.regionserver.TestRecoveredEdits
Tests run: 1, Failures: 0, Errors: 0, Skipped: 0, Time elapsed: 17.065 sec - in org.apache.hadoop.hbase.regionserver.TestRSKilledWhenInitializing
Running org.apache.hadoop.hbase.regionserver.TestScannerWithBulkload
Tests run: 23, Failures: 0, Errors: 0, Skipped: 0, Time elapsed: 45.623 sec - in org.apache.hadoop.hbase.regionserver.TestDefaultMemStore
Running org.apache.hadoop.hbase.regionserver.TestRegionServerNoMaster
Running org.apache.hadoop.hbase.regionserver.TestClusterId
Tests run: 3, Failures: 0, Errors: 0, Skipped: 0, Time elapsed: 5.82 sec - in org.apache.hadoop.hbase.regionserver.TestScannerWithBulkload
Running org.apache.hadoop.hbase.regionserver.TestCompaction
Tests run: 9, Failures: 0, Errors: 0, Skipped: 0, Time elapsed: 17.202 sec - in org.apache.hadoop.hbase.regionserver.TestRegionServerNoMaster
Tests run: 2, Failures: 0, Errors: 0, Skipped: 0, Time elapsed: 23.502 sec - in org.apache.hadoop.hbase.regionserver.TestClusterId
Tests run: 5, Failures: 0, Errors: 0, Skipped: 0, Time elapsed: 20.688 sec - in org.apache.hadoop.hbase.regionserver.TestCompaction
Running org.apache.hadoop.hbase.regionserver.TestRegionFavoredNodes
Running org.apache.hadoop.hbase.regionserver.TestSeekOptimizations
Tests run: 5, Failures: 0, Errors: 0, Skipped: 0, Time elapsed: 221.194 sec - in org.apache.hadoop.hbase.regionserver.wal.TestLogRolling
Running org.apache.hadoop.hbase.regionserver.TestServerCustomProtocol
Running org.apache.hadoop.hbase.regionserver.TestHRegion
Tests run: 6, Failures: 0, Errors: 0, Skipped: 0, Time elapsed: 4.828 sec - in org.apache.hadoop.hbase.regionserver.TestSeekOptimizations
Running org.apache.hadoop.hbase.regionserver.TestAtomicOperation
Tests run: 7, Failures: 0, Errors: 0, Skipped: 0, Time elapsed: 157.643 sec - in org.apache.hadoop.hbase.regionserver.TestRegionReplicas
Tests run: 1, Failures: 0, Errors: 0, Skipped: 0, Time elapsed: 8.472 sec - in org.apache.hadoop.hbase.regionserver.TestRegionFavoredNodes
Running org.apache.hadoop.hbase.regionserver.TestCompactionWithCoprocessor
Running org.apache.hadoop.hbase.regionserver.TestSplitTransactionOnCluster
Tests run: 7, Failures: 0, Errors: 0, Skipped: 0, Time elapsed: 14.548 sec - in org.apache.hadoop.hbase.regionserver.TestServerCustomProtocol
Running org.apache.hadoop.hbase.regionserver.TestHRegionServerBulkLoad
Tests run: 5, Failures: 0, Errors: 0, Skipped: 0, Time elapsed: 27.589 sec - in org.apache.hadoop.hbase.regionserver.TestCompactionWithCoprocessor
Running org.apache.hadoop.hbase.regionserver.TestZKLessMergeOnCluster
Tests run: 6, Failures: 0, Errors: 0, Skipped: 0, Time elapsed: 42.545 sec - in org.apache.hadoop.hbase.regionserver.TestAtomicOperation
Tests run: 1, Failures: 0, Errors: 0, Skipped: 0, Time elapsed: 41.986 sec - in org.apache.hadoop.hbase.regionserver.TestHRegionServerBulkLoad
Tests run: 3, Failures: 0, Errors: 0, Skipped: 0, Time elapsed: 13.039 sec - in org.apache.hadoop.hbase.regionserver.TestZKLessMergeOnCluster
Running org.apache.hadoop.hbase.regionserver.TestRegionServerOnlineConfigChange
Tests run: 2, Failures: 0, Errors: 0, Skipped: 0, Time elapsed: 1.397 sec - in org.apache.hadoop.hbase.regionserver.TestRegionServerOnlineConfigChange
Running org.apache.hadoop.hbase.TestRegionRebalancing
Running org.apache.hadoop.hbase.regionserver.TestEndToEndSplitTransaction
Running org.apache.hadoop.hbase.regionserver.TestEncryptionRandomKeying
Tests run: 1, Failures: 0, Errors: 0, Skipped: 0, Time elapsed: 1.561 sec - in org.apache.hadoop.hbase.regionserver.TestEncryptionRandomKeying
Running org.apache.hadoop.hbase.io.encoding.TestEncodedSeekers
Tests run: 2, Failures: 0, Errors: 0, Skipped: 0, Time elapsed: 13.208 sec - in org.apache.hadoop.hbase.regionserver.TestEndToEndSplitTransaction
Running org.apache.hadoop.hbase.io.encoding.TestDataBlockEncoders
Tests run: 2, Failures: 0, Errors: 0, Skipped: 0, Time elapsed: 27.252 sec - in org.apache.hadoop.hbase.TestRegionRebalancing
Tests run: 91, Failures: 0, Errors: 0, Skipped: 0, Time elapsed: 97.464 sec - in org.apache.hadoop.hbase.regionserver.TestHRegion
Running org.apache.hadoop.hbase.io.encoding.TestLoadAndSwitchEncodeOnDisk
Running org.apache.hadoop.hbase.io.encoding.TestChangingEncoding
Tests run: 1, Failures: 0, Errors: 0, Skipped: 0, Time elapsed: 21.149 sec - in org.apache.hadoop.hbase.io.encoding.TestLoadAndSwitchEncodeOnDisk
Running org.apache.hadoop.hbase.io.encoding.TestBufferedDataBlockEncoder
Tests run: 1, Failures: 0, Errors: 0, Skipped: 0, Time elapsed: 26.19 sec - in org.apache.hadoop.hbase.io.encoding.TestBufferedDataBlockEncoder
Running org.apache.hadoop.hbase.io.hfile.TestCacheOnWrite
Tests run: 16, Failures: 0, Errors: 0, Skipped: 0, Time elapsed: 148.728 sec - in org.apache.hadoop.hbase.regionserver.TestSplitTransactionOnCluster
Tests run: 20, Failures: 0, Errors: 0, Skipped: 0, Time elapsed: 94.195 sec - in org.apache.hadoop.hbase.io.encoding.TestEncodedSeekers
Running org.apache.hadoop.hbase.io.hfile.TestCacheConfig
Tests run: 6, Failures: 0, Errors: 0, Skipped: 0, Time elapsed: 1.79 sec - in org.apache.hadoop.hbase.io.hfile.TestCacheConfig
Running org.apache.hadoop.hbase.io.hfile.TestHFileSeek
Tests run: 1, Failures: 0, Errors: 0, Skipped: 0, Time elapsed: 1.985 sec - in org.apache.hadoop.hbase.io.hfile.TestHFileSeek
Running org.apache.hadoop.hbase.io.hfile.TestHFileBlock
Running org.apache.hadoop.hbase.io.hfile.TestForceCacheImportantBlocks
Tests run: 3, Failures: 0, Errors: 0, Skipped: 0, Time elapsed: 99.165 sec - in org.apache.hadoop.hbase.io.encoding.TestChangingEncoding
Running org.apache.hadoop.hbase.io.hfile.TestScannerSelectionUsingTTL
Tests run: 4, Failures: 0, Errors: 0, Skipped: 0, Time elapsed: 37.685 sec - in org.apache.hadoop.hbase.io.hfile.TestForceCacheImportantBlocks
Running org.apache.hadoop.hbase.io.hfile.TestHFileBlockIndex
Tests run: 4, Failures: 0, Errors: 0, Skipped: 0, Time elapsed: 2.736 sec - in org.apache.hadoop.hbase.io.hfile.TestHFileBlockIndex
Running org.apache.hadoop.hbase.io.TestFileLink
Tests run: 3, Failures: 0, Errors: 0, Skipped: 0, Time elapsed: 14.803 sec - in org.apache.hadoop.hbase.io.TestFileLink
Running org.apache.hadoop.hbase.security.access.TestAccessController
Tests run: 28, Failures: 0, Errors: 0, Skipped: 0, Time elapsed: 93.098 sec - in org.apache.hadoop.hbase.io.hfile.TestHFileBlock
Tests run: 6, Failures: 0, Errors: 0, Skipped: 0, Time elapsed: 63.012 sec - in org.apache.hadoop.hbase.io.hfile.TestScannerSelectionUsingTTL
Running org.apache.hadoop.hbase.security.access.TestTablePermissions
Running org.apache.hadoop.hbase.security.access.TestCellACLs
Tests run: 2, Failures: 0, Errors: 0, Skipped: 0, Time elapsed: 9.066 sec - in org.apache.hadoop.hbase.security.access.TestCellACLs
Running org.apache.hadoop.hbase.security.access.TestAccessControlFilter
Tests run: 1, Failures: 0, Errors: 0, Skipped: 0, Time elapsed: 3.002 sec - in org.apache.hadoop.hbase.security.access.TestAccessControlFilter
Tests run: 7, Failures: 0, Errors: 0, Skipped: 0, Time elapsed: 32.335 sec - in org.apache.hadoop.hbase.security.access.TestTablePermissions
Running org.apache.hadoop.hbase.security.access.TestNamespaceCommands
Running org.apache.hadoop.hbase.security.access.TestCellACLWithMultipleVersions
Tests run: 7, Failures: 0, Errors: 0, Skipped: 0, Time elapsed: 11.23 sec - in org.apache.hadoop.hbase.security.access.TestNamespaceCommands
Tests run: 28, Failures: 0, Errors: 0, Skipped: 0, Time elapsed: 244.085 sec - in org.apache.hadoop.hbase.io.encoding.TestDataBlockEncoders
Running org.apache.hadoop.hbase.security.access.TestAccessController2
Running org.apache.hadoop.hbase.security.access.TestZKPermissionsWatcher
Tests run: 1, Failures: 0, Errors: 0, Skipped: 0, Time elapsed: 3.527 sec - in org.apache.hadoop.hbase.security.access.TestZKPermissionsWatcher
Tests run: 2, Failures: 0, Errors: 0, Skipped: 0, Time elapsed: 10.164 sec - in org.apache.hadoop.hbase.security.access.TestAccessController2
Tests run: 8, Failures: 0, Errors: 0, Skipped: 0, Time elapsed: 24.591 sec - in org.apache.hadoop.hbase.security.access.TestCellACLWithMultipleVersions
Running org.apache.hadoop.hbase.security.access.TestScanEarlyTermination
Running org.apache.hadoop.hbase.security.visibility.TestVisibilityLablesWithGroups
Running org.apache.hadoop.hbase.security.visibility.TestVisibilityLabelsWithDeletes
Tests run: 1, Failures: 0, Errors: 0, Skipped: 0, Time elapsed: 2.18 sec - in org.apache.hadoop.hbase.security.visibility.TestVisibilityLablesWithGroups
Tests run: 1, Failures: 0, Errors: 0, Skipped: 0, Time elapsed: 4.948 sec - in org.apache.hadoop.hbase.security.access.TestScanEarlyTermination
Running org.apache.hadoop.hbase.security.visibility.TestVisibilityLabelsWithDefaultVisLabelService
Running org.apache.hadoop.hbase.security.visibility.TestVisibilityLabelsWithCustomVisLabService
Tests run: 19, Failures: 0, Errors: 0, Skipped: 0, Time elapsed: 16.361 sec - in org.apache.hadoop.hbase.security.visibility.TestVisibilityLabelsWithCustomVisLabService
Tests run: 23, Failures: 0, Errors: 0, Skipped: 0, Time elapsed: 17.423 sec - in org.apache.hadoop.hbase.security.visibility.TestVisibilityLabelsWithDefaultVisLabelService
Running org.apache.hadoop.hbase.security.visibility.TestDefaultScanLabelGeneratorStack
Running org.apache.hadoop.hbase.security.visibility.TestVisibilityWithCheckAuths
Tests run: 1, Failures: 0, Errors: 0, Skipped: 0, Time elapsed: 2.061 sec - in org.apache.hadoop.hbase.security.visibility.TestDefaultScanLabelGeneratorStack
Tests run: 2, Failures: 0, Errors: 0, Skipped: 0, Time elapsed: 3.915 sec - in org.apache.hadoop.hbase.security.visibility.TestVisibilityWithCheckAuths
Running org.apache.hadoop.hbase.security.visibility.TestVisibilityLabelsWithDistributedLogReplay
Running org.apache.hadoop.hbase.security.visibility.TestVisibilityLabelsOpWithDifferentUsersNoACL
Tests run: 37, Failures: 0, Errors: 0, Skipped: 0, Time elapsed: 51.168 sec - in org.apache.hadoop.hbase.security.visibility.TestVisibilityLabelsWithDeletes
Tests run: 1, Failures: 0, Errors: 0, Skipped: 0, Time elapsed: 2.727 sec - in org.apache.hadoop.hbase.security.visibility.TestVisibilityLabelsOpWithDifferentUsersNoACL
Running org.apache.hadoop.hbase.security.visibility.TestVisibilityLabelsWithSLGStack
Tests run: 1, Failures: 0, Errors: 0, Skipped: 0, Time elapsed: 1.81 sec - in org.apache.hadoop.hbase.security.visibility.TestVisibilityLabelsWithSLGStack
Running org.apache.hadoop.hbase.security.visibility.TestEnforcingScanLabelGenerator
Running org.apache.hadoop.hbase.security.visibility.TestVisibilityLabelsReplication
Tests run: 1, Failures: 0, Errors: 0, Skipped: 0, Time elapsed: 2.056 sec - in org.apache.hadoop.hbase.security.visibility.TestEnforcingScanLabelGenerator
Running org.apache.hadoop.hbase.security.visibility.TestVisibilityLabelReplicationWithExpAsString
Tests run: 1, Failures: 0, Errors: 0, Skipped: 0, Time elapsed: 18.097 sec - in org.apache.hadoop.hbase.security.visibility.TestVisibilityLabelsReplication
Tests run: 1, Failures: 0, Errors: 0, Skipped: 0, Time elapsed: 18.665 sec - in org.apache.hadoop.hbase.security.visibility.TestVisibilityLabelReplicationWithExpAsString
Running org.apache.hadoop.hbase.security.token.TestZKSecretWatcher
Running org.apache.hadoop.hbase.security.visibility.TestVisibilityLabelsWithACL
Tests run: 5, Failures: 0, Errors: 0, Skipped: 0, Time elapsed: 7.031 sec - in org.apache.hadoop.hbase.security.visibility.TestVisibilityLabelsWithACL
Tests run: 1, Failures: 0, Errors: 0, Skipped: 0, Time elapsed: 13.235 sec - in org.apache.hadoop.hbase.security.token.TestZKSecretWatcher
Running org.apache.hadoop.hbase.security.token.TestTokenAuthentication
Tests run: 3, Failures: 0, Errors: 0, Skipped: 0, Time elapsed: 0.48 sec - in org.apache.hadoop.hbase.security.token.TestTokenAuthentication
Tests run: 216, Failures: 0, Errors: 0, Skipped: 0, Time elapsed: 338.682 sec - in org.apache.hadoop.hbase.io.hfile.TestCacheOnWrite
Tests run: 55, Failures: 0, Errors: 0, Skipped: 0, Time elapsed: 250.059 sec - in org.apache.hadoop.hbase.security.access.TestAccessController
Tests run: 23, Failures: 0, Errors: 0, Skipped: 0, Time elapsed: 122.063 sec - in org.apache.hadoop.hbase.security.visibility.TestVisibilityLabelsWithDistributedLogReplay

Results :

Failed tests: 
  TestReplicationEndpoint.testWALEntryFilterFromReplicationEndpoint:174 Waiting timed out
after [60,000] msec

Tests in error: 
  TestTableSnapshotInputFormat.testInitTableSnapshotMapperJobConfig:99->TableSnapshotInputFormatTestBase.setupCluster:53
ยป RetriesExhausted


Tests run: 2311, Failures: 1, Errors: 1, Skipped: 18

[INFO] ------------------------------------------------------------------------
[INFO] Reactor Summary:
[INFO] 
[INFO] HBase ............................................. SUCCESS [3.353s]
[INFO] HBase - Checkstyle ................................ SUCCESS [0.690s]
[INFO] HBase - Annotations ............................... SUCCESS [0.855s]
[INFO] HBase - Common .................................... SUCCESS [59.296s]
[INFO] HBase - Protocol .................................. SUCCESS [9.128s]
[INFO] HBase - Client .................................... SUCCESS [1:14.270s]
[INFO] HBase - Hadoop Compatibility ...................... SUCCESS [7.022s]
[INFO] HBase - Hadoop Two Compatibility .................. SUCCESS [6.208s]
[INFO] HBase - Prefix Tree ............................... SUCCESS [8.324s]
[INFO] HBase - Server .................................... FAILURE [1:03:28.904s]
[INFO] HBase - Testing Util .............................. SKIPPED
[INFO] HBase - Thrift .................................... SKIPPED
[INFO] HBase - Rest ...................................... SKIPPED
[INFO] HBase - Shell ..................................... SKIPPED
[INFO] HBase - Integration Tests ......................... SKIPPED
[INFO] HBase - Examples .................................. SKIPPED
[INFO] HBase - Assembly .................................. SKIPPED
[INFO] ------------------------------------------------------------------------
[INFO] BUILD FAILURE
[INFO] ------------------------------------------------------------------------
[INFO] Total time: 1:06:18.876s
[INFO] Finished at: Sat Feb 07 03:46:03 UTC 2015
[INFO] Final Memory: 46M/824M
[INFO] ------------------------------------------------------------------------
[ERROR] Failed to execute goal org.apache.maven.plugins:maven-surefire-plugin:2.18:test (secondPartTestsExecution)
on project hbase-server: There are test failures.
[ERROR] 
[ERROR] Please refer to <https://builds.apache.org/job/HBase-1.0/ws/hbase-server/target/surefire-reports>
for the individual test results.
[ERROR] -> [Help 1]
[ERROR] 
[ERROR] To see the full stack trace of the errors, re-run Maven with the -e switch.
[ERROR] Re-run Maven using the -X switch to enable full debug logging.
[ERROR] 
[ERROR] For more information about the errors and possible solutions, please read the following
articles:
[ERROR] [Help 1] http://cwiki.apache.org/confluence/display/MAVEN/MojoFailureException
[ERROR] 
[ERROR] After correcting the problems, you can resume the build with the command
[ERROR]   mvn <goals> -rf :hbase-server
Build step 'Invoke top-level Maven targets' marked build as failure
Performing Post build task...
Match found for :.* : True
Logical operation result is TRUE
Running script  :   ZOMBIE_TESTS_COUNT=`jps | grep surefirebooter | wc -l`
  if [[ $ZOMBIE_TESTS_COUNT != 0 ]] ; then
    #It seems sometimes the tests are not dying immediately. Let's give them 10s
    echo "Suspicious java process found - waiting 10s to see if there are just slow to stop"
    sleep 10   
    ZOMBIE_TESTS_COUNT=`jps | grep surefirebooter | wc -l`
    if [[ $ZOMBIE_TESTS_COUNT != 0 ]] ; then
      echo "There are $ZOMBIE_TESTS_COUNT zombie tests, they should have been killed by surefire
but survived"
      echo "************ BEGIN zombies jstack extract"
      ZB_STACK=`jps | grep surefirebooter | cut -d ' ' -f 1 | xargs -n 1 jstack | grep ".test"
| grep "\.java"`
      jps | grep surefirebooter | cut -d ' ' -f 1 | xargs -n 1 jstack
      echo "************ END  zombies jstack extract"
      JIRA_COMMENT="$JIRA_COMMENT

     {color:red}-1 core zombie tests{color}.  There are ${ZOMBIE_TESTS_COUNT} zombie test(s):
${ZB_STACK}"
      BAD=1
      jps | grep surefirebooter | cut -d ' ' -f 1 | xargs kill -9
    else
      echo "We're ok: there is no zombie test, but some tests took some time to stop"
    fi
  else
    echo "We're ok: there is no zombie test"
  fi
[HBase-1.0] $ /bin/bash -xe /tmp/hudson7867144634394509767.sh
++ jps
++ wc -l
++ grep surefirebooter
+ ZOMBIE_TESTS_COUNT=0
+ [[ 0 != 0 ]]
+ echo 'We'\''re ok: there is no zombie test'
We're ok: there is no zombie test
POST BUILD TASK : SUCCESS
END OF POST BUILD TASK : 0
Archiving artifacts
Sending artifact delta relative to HBase-1.0 #718
Archived 1854 artifacts
Archive block size is 32768
Received 27 blocks and 398123464 bytes
Compression is 0.2%
Took 1 min 48 sec
Recording test results
Updating HBASE-11567

Mime
View raw message