hbase-builds mailing list archives

Site index · List index
Message view « Date » · « Thread »
Top « Date » · « Thread »
From Stack <st...@duboce.net>
Subject Re: Build failed in Jenkins: HBase-1.0 #713
Date Fri, 06 Feb 2015 02:14:05 GMT
Maybe it is related given this failed in two places.  Let me run again and
see.
St.Ack

On Thu, Feb 5, 2015 at 6:05 PM, Apache Jenkins Server <
jenkins@builds.apache.org> wrote:

> See <https://builds.apache.org/job/HBase-1.0/713/changes>
>
> Changes:
>
> [stack] HBASE-12958 SSH doing hbase:meta get but hbase:meta not assigned;
> REAPPLY
>
> ------------------------------------------
> [...truncated 1815 lines...]
> Tests run: 18, Failures: 0, Errors: 0, Skipped: 0, Time elapsed: 13.437
> sec - in org.apache.hadoop.hbase.regionserver.TestStore
> Running
> org.apache.hadoop.hbase.regionserver.wal.TestReadOldRootAndMetaEdits
> Tests run: 1, Failures: 0, Errors: 0, Skipped: 0, Time elapsed: 0.296 sec
> - in org.apache.hadoop.hbase.regionserver.wal.TestReadOldRootAndMetaEdits
> Running org.apache.hadoop.hbase.regionserver.wal.TestLogRollPeriod
> Running org.apache.hadoop.hbase.regionserver.wal.TestLogRollAbort
> Tests run: 6, Failures: 0, Errors: 0, Skipped: 0, Time elapsed: 4.267 sec
> - in org.apache.hadoop.hbase.regionserver.wal.TestFSHLog
> Running org.apache.hadoop.hbase.regionserver.wal.TestSecureWALReplay
> Running org.apache.hadoop.hbase.regionserver.wal.TestWALReplayCompressed
> Tests run: 2, Failures: 0, Errors: 0, Skipped: 0, Time elapsed: 20.931 sec
> - in org.apache.hadoop.hbase.regionserver.wal.TestLogRollAbort
> Running org.apache.hadoop.hbase.regionserver.wal.TestWALReplay
> Tests run: 9, Failures: 0, Errors: 0, Skipped: 0, Time elapsed: 39.151 sec
> - in org.apache.hadoop.hbase.regionserver.wal.TestSecureWALReplay
> Tests run: 9, Failures: 0, Errors: 0, Skipped: 0, Time elapsed: 36.28 sec
> - in org.apache.hadoop.hbase.regionserver.wal.TestWALReplayCompressed
> Running org.apache.hadoop.hbase.regionserver.wal.TestDurability
> Tests run: 2, Failures: 0, Errors: 0, Skipped: 0, Time elapsed: 2.217 sec
> - in org.apache.hadoop.hbase.regionserver.wal.TestDurability
> Tests run: 2, Failures: 0, Errors: 0, Skipped: 0, Time elapsed: 51.219 sec
> - in org.apache.hadoop.hbase.regionserver.wal.TestLogRollPeriod
> Running org.apache.hadoop.hbase.regionserver.wal.TestProtobufLog
> Running org.apache.hadoop.hbase.regionserver.TestParallelPut
> Tests run: 1, Failures: 0, Errors: 0, Skipped: 0, Time elapsed: 1.299 sec
> - in org.apache.hadoop.hbase.regionserver.wal.TestProtobufLog
> Running org.apache.hadoop.hbase.regionserver.TestMajorCompaction
> Running org.apache.hadoop.hbase.regionserver.TestRegionReplicas
> Tests run: 9, Failures: 0, Errors: 0, Skipped: 0, Time elapsed: 36.251 sec
> - in org.apache.hadoop.hbase.regionserver.wal.TestWALReplay
> Running org.apache.hadoop.hbase.regionserver.TestEncryptionKeyRotation
> Tests run: 2, Failures: 0, Errors: 0, Skipped: 0, Time elapsed: 13.446 sec
> - in org.apache.hadoop.hbase.regionserver.TestEncryptionKeyRotation
> Running org.apache.hadoop.hbase.regionserver.TestZKLessSplitOnCluster
> Tests run: 7, Failures: 0, Errors: 0, Skipped: 0, Time elapsed: 45.259 sec
> - in org.apache.hadoop.hbase.regionserver.TestMajorCompaction
> Running org.apache.hadoop.hbase.regionserver.TestCompactionState
> Tests run: 2, Failures: 0, Errors: 0, Skipped: 0, Time elapsed: 78.995 sec
> - in org.apache.hadoop.hbase.regionserver.TestParallelPut
> Tests run: 16, Failures: 0, Errors: 0, Skipped: 0, Time elapsed: 32.962
> sec - in org.apache.hadoop.hbase.regionserver.TestZKLessSplitOnCluster
> Tests run: 5, Failures: 0, Errors: 0, Skipped: 0, Time elapsed: 22.468 sec
> - in org.apache.hadoop.hbase.regionserver.TestCompactionState
> Running org.apache.hadoop.hbase.regionserver.TestFSErrorsExposed
> Running org.apache.hadoop.hbase.regionserver.TestDefaultMemStore
> Running org.apache.hadoop.hbase.regionserver.TestRegionServerMetrics
> Tests run: 9, Failures: 0, Errors: 0, Skipped: 0, Time elapsed: 6.332 sec
> - in org.apache.hadoop.hbase.regionserver.TestRegionServerMetrics
> Running org.apache.hadoop.hbase.regionserver.TestGetClosestAtOrBefore
> Tests run: 3, Failures: 0, Errors: 0, Skipped: 0, Time elapsed: 1.673 sec
> - in org.apache.hadoop.hbase.regionserver.TestGetClosestAtOrBefore
> Running org.apache.hadoop.hbase.regionserver.TestRSKilledWhenInitializing
> Tests run: 3, Failures: 0, Errors: 0, Skipped: 0, Time elapsed: 24.517 sec
> - in org.apache.hadoop.hbase.regionserver.TestFSErrorsExposed
> Running org.apache.hadoop.hbase.regionserver.TestReversibleScanners
> Tests run: 5, Failures: 0, Errors: 0, Skipped: 0, Time elapsed: 3.836 sec
> - in org.apache.hadoop.hbase.regionserver.TestReversibleScanners
> Running org.apache.hadoop.hbase.regionserver.TestRecoveredEdits
> Tests run: 1, Failures: 0, Errors: 0, Skipped: 0, Time elapsed: 16.848 sec
> - in org.apache.hadoop.hbase.regionserver.TestRSKilledWhenInitializing
> Tests run: 1, Failures: 0, Errors: 0, Skipped: 0, Time elapsed: 9.76 sec -
> in org.apache.hadoop.hbase.regionserver.TestRecoveredEdits
> Tests run: 23, Failures: 0, Errors: 0, Skipped: 0, Time elapsed: 45.875
> sec - in org.apache.hadoop.hbase.regionserver.TestDefaultMemStore
> Running org.apache.hadoop.hbase.regionserver.TestClusterId
> Running org.apache.hadoop.hbase.regionserver.TestRegionServerNoMaster
> Running org.apache.hadoop.hbase.regionserver.TestScannerWithBulkload
> Tests run: 3, Failures: 0, Errors: 0, Skipped: 0, Time elapsed: 4.729 sec
> - in org.apache.hadoop.hbase.regionserver.TestScannerWithBulkload
> Running org.apache.hadoop.hbase.regionserver.TestCompaction
> Tests run: 9, Failures: 0, Errors: 0, Skipped: 0, Time elapsed: 17.538 sec
> - in org.apache.hadoop.hbase.regionserver.TestRegionServerNoMaster
> Tests run: 2, Failures: 0, Errors: 0, Skipped: 0, Time elapsed: 23.872 sec
> - in org.apache.hadoop.hbase.regionserver.TestClusterId
> Tests run: 5, Failures: 0, Errors: 0, Skipped: 0, Time elapsed: 20.767 sec
> - in org.apache.hadoop.hbase.regionserver.TestCompaction
> Running org.apache.hadoop.hbase.regionserver.TestRegionFavoredNodes
> Running org.apache.hadoop.hbase.regionserver.TestSeekOptimizations
> Running org.apache.hadoop.hbase.regionserver.TestServerCustomProtocol
> Tests run: 6, Failures: 0, Errors: 0, Skipped: 0, Time elapsed: 4.754 sec
> - in org.apache.hadoop.hbase.regionserver.TestSeekOptimizations
> Running org.apache.hadoop.hbase.regionserver.TestHRegion
> Tests run: 7, Failures: 0, Errors: 0, Skipped: 0, Time elapsed: 154.899
> sec - in org.apache.hadoop.hbase.regionserver.TestRegionReplicas
> Tests run: 1, Failures: 0, Errors: 0, Skipped: 0, Time elapsed: 7.3 sec -
> in org.apache.hadoop.hbase.regionserver.TestRegionFavoredNodes
> Running org.apache.hadoop.hbase.regionserver.TestAtomicOperation
> Tests run: 5, Failures: 0, Errors: 0, Skipped: 0, Time elapsed: 230.674
> sec - in org.apache.hadoop.hbase.regionserver.wal.TestLogRolling
> Running org.apache.hadoop.hbase.regionserver.TestCompactionWithCoprocessor
> Tests run: 7, Failures: 0, Errors: 0, Skipped: 0, Time elapsed: 14.672 sec
> - in org.apache.hadoop.hbase.regionserver.TestServerCustomProtocol
> Running org.apache.hadoop.hbase.regionserver.TestSplitTransactionOnCluster
> Running org.apache.hadoop.hbase.regionserver.TestHRegionServerBulkLoad
> Tests run: 5, Failures: 0, Errors: 0, Skipped: 0, Time elapsed: 29.201 sec
> - in org.apache.hadoop.hbase.regionserver.TestCompactionWithCoprocessor
> Tests run: 6, Failures: 0, Errors: 0, Skipped: 0, Time elapsed: 46.098 sec
> - in org.apache.hadoop.hbase.regionserver.TestAtomicOperation
> Running org.apache.hadoop.hbase.regionserver.TestZKLessMergeOnCluster
> Tests run: 1, Failures: 0, Errors: 0, Skipped: 0, Time elapsed: 42.755 sec
> - in org.apache.hadoop.hbase.regionserver.TestHRegionServerBulkLoad
> Tests run: 16, Failures: 0, Errors: 0, Skipped: 0, Time elapsed: 48.289
> sec - in org.apache.hadoop.hbase.regionserver.TestSplitTransactionOnCluster
> Tests run: 3, Failures: 0, Errors: 0, Skipped: 0, Time elapsed: 12.84 sec
> - in org.apache.hadoop.hbase.regionserver.TestZKLessMergeOnCluster
> Running
> org.apache.hadoop.hbase.regionserver.TestRegionServerOnlineConfigChange
> Running org.apache.hadoop.hbase.TestRegionRebalancing
> Tests run: 2, Failures: 0, Errors: 0, Skipped: 0, Time elapsed: 1.232 sec
> - in org.apache.hadoop.hbase.regionserver.TestRegionServerOnlineConfigChange
> Running org.apache.hadoop.hbase.regionserver.TestEncryptionRandomKeying
> Running org.apache.hadoop.hbase.io.encoding.TestEncodedSeekers
> Tests run: 1, Failures: 0, Errors: 0, Skipped: 0, Time elapsed: 1.464 sec
> - in org.apache.hadoop.hbase.regionserver.TestEncryptionRandomKeying
> Running org.apache.hadoop.hbase.regionserver.TestEndToEndSplitTransaction
> Running org.apache.hadoop.hbase.io.encoding.TestDataBlockEncoders
> Tests run: 2, Failures: 0, Errors: 0, Skipped: 0, Time elapsed: 14.494 sec
> - in org.apache.hadoop.hbase.regionserver.TestEndToEndSplitTransaction
> Running org.apache.hadoop.hbase.io.encoding.TestChangingEncoding
> Tests run: 91, Failures: 0, Errors: 0, Skipped: 0, Time elapsed: 93.169
> sec - in org.apache.hadoop.hbase.regionserver.TestHRegion
> Tests run: 2, Failures: 0, Errors: 0, Skipped: 0, Time elapsed: 28.736 sec
> - in org.apache.hadoop.hbase.TestRegionRebalancing
> Running org.apache.hadoop.hbase.io.encoding.TestLoadAndSwitchEncodeOnDisk
> Running org.apache.hadoop.hbase.io.encoding.TestBufferedDataBlockEncoder
> Tests run: 1, Failures: 0, Errors: 0, Skipped: 0, Time elapsed: 22.216 sec
> - in org.apache.hadoop.hbase.io.encoding.TestLoadAndSwitchEncodeOnDisk
> Running org.apache.hadoop.hbase.io.hfile.TestCacheOnWrite
> Tests run: 1, Failures: 0, Errors: 0, Skipped: 0, Time elapsed: 27.385 sec
> - in org.apache.hadoop.hbase.io.encoding.TestBufferedDataBlockEncoder
> Running org.apache.hadoop.hbase.io.hfile.TestCacheConfig
> Tests run: 6, Failures: 0, Errors: 0, Skipped: 0, Time elapsed: 1.714 sec
> - in org.apache.hadoop.hbase.io.hfile.TestCacheConfig
> Running org.apache.hadoop.hbase.io.hfile.TestHFileSeek
> Tests run: 1, Failures: 0, Errors: 0, Skipped: 0, Time elapsed: 1.899 sec
> - in org.apache.hadoop.hbase.io.hfile.TestHFileSeek
> Running org.apache.hadoop.hbase.io.hfile.TestHFileBlock
> Tests run: 20, Failures: 0, Errors: 0, Skipped: 0, Time elapsed: 98.658
> sec - in org.apache.hadoop.hbase.io.encoding.TestEncodedSeekers
> Running org.apache.hadoop.hbase.io.hfile.TestForceCacheImportantBlocks
> Tests run: 3, Failures: 0, Errors: 0, Skipped: 0, Time elapsed: 102.227
> sec - in org.apache.hadoop.hbase.io.encoding.TestChangingEncoding
> Running org.apache.hadoop.hbase.io.hfile.TestScannerSelectionUsingTTL
> Tests run: 4, Failures: 0, Errors: 0, Skipped: 0, Time elapsed: 39.309 sec
> - in org.apache.hadoop.hbase.io.hfile.TestForceCacheImportantBlocks
> Running org.apache.hadoop.hbase.io.hfile.TestHFileBlockIndex
> Tests run: 4, Failures: 0, Errors: 0, Skipped: 0, Time elapsed: 2.656 sec
> - in org.apache.hadoop.hbase.io.hfile.TestHFileBlockIndex
> Running org.apache.hadoop.hbase.io.TestFileLink
> Tests run: 3, Failures: 0, Errors: 0, Skipped: 0, Time elapsed: 15.434 sec
> - in org.apache.hadoop.hbase.io.TestFileLink
> Tests run: 28, Failures: 0, Errors: 0, Skipped: 0, Time elapsed: 93.425
> sec - in org.apache.hadoop.hbase.io.hfile.TestHFileBlock
> Running org.apache.hadoop.hbase.security.access.TestAccessController
> Running org.apache.hadoop.hbase.security.access.TestTablePermissions
> Tests run: 6, Failures: 0, Errors: 0, Skipped: 0, Time elapsed: 62.862 sec
> - in org.apache.hadoop.hbase.io.hfile.TestScannerSelectionUsingTTL
> Running org.apache.hadoop.hbase.security.access.TestCellACLs
> Tests run: 7, Failures: 0, Errors: 0, Skipped: 0, Time elapsed: 31.401 sec
> - in org.apache.hadoop.hbase.security.access.TestTablePermissions
> Tests run: 2, Failures: 0, Errors: 0, Skipped: 0, Time elapsed: 9.518 sec
> - in org.apache.hadoop.hbase.security.access.TestCellACLs
> Running org.apache.hadoop.hbase.security.access.TestAccessControlFilter
> Tests run: 1, Failures: 0, Errors: 0, Skipped: 0, Time elapsed: 2.724 sec
> - in org.apache.hadoop.hbase.security.access.TestAccessControlFilter
> Running
> org.apache.hadoop.hbase.security.access.TestCellACLWithMultipleVersions
> Running org.apache.hadoop.hbase.security.access.TestNamespaceCommands
> Tests run: 7, Failures: 0, Errors: 0, Skipped: 0, Time elapsed: 11.474 sec
> - in org.apache.hadoop.hbase.security.access.TestNamespaceCommands
> Running org.apache.hadoop.hbase.security.access.TestAccessController2
> Tests run: 8, Failures: 0, Errors: 0, Skipped: 0, Time elapsed: 26.973 sec
> - in org.apache.hadoop.hbase.security.access.TestCellACLWithMultipleVersions
> Tests run: 28, Failures: 0, Errors: 0, Skipped: 0, Time elapsed: 251.6 sec
> - in org.apache.hadoop.hbase.io.encoding.TestDataBlockEncoders
> Tests run: 2, Failures: 0, Errors: 0, Skipped: 0, Time elapsed: 9.968 sec
> - in org.apache.hadoop.hbase.security.access.TestAccessController2
> Running org.apache.hadoop.hbase.security.access.TestZKPermissionsWatcher
> Running org.apache.hadoop.hbase.security.access.TestScanEarlyTermination
> Tests run: 1, Failures: 0, Errors: 0, Skipped: 0, Time elapsed: 3.399 sec
> - in org.apache.hadoop.hbase.security.access.TestZKPermissionsWatcher
> Running
> org.apache.hadoop.hbase.security.visibility.TestVisibilityLablesWithGroups
> Tests run: 1, Failures: 0, Errors: 0, Skipped: 0, Time elapsed: 4.598 sec
> - in org.apache.hadoop.hbase.security.access.TestScanEarlyTermination
> Tests run: 1, Failures: 0, Errors: 0, Skipped: 0, Time elapsed: 2.647 sec
> - in
> org.apache.hadoop.hbase.security.visibility.TestVisibilityLablesWithGroups
> Running
> org.apache.hadoop.hbase.security.visibility.TestVisibilityLabelsWithDeletes
> Running
> org.apache.hadoop.hbase.security.visibility.TestVisibilityLabelsWithDefaultVisLabelService
> Running
> org.apache.hadoop.hbase.security.visibility.TestVisibilityLabelsWithCustomVisLabService
> Tests run: 19, Failures: 0, Errors: 0, Skipped: 0, Time elapsed: 14.551
> sec - in
> org.apache.hadoop.hbase.security.visibility.TestVisibilityLabelsWithCustomVisLabService
> Tests run: 23, Failures: 0, Errors: 0, Skipped: 0, Time elapsed: 17.337
> sec - in
> org.apache.hadoop.hbase.security.visibility.TestVisibilityLabelsWithDefaultVisLabelService
> Running
> org.apache.hadoop.hbase.security.visibility.TestDefaultScanLabelGeneratorStack
> Running
> org.apache.hadoop.hbase.security.visibility.TestVisibilityWithCheckAuths
> Tests run: 1, Failures: 0, Errors: 0, Skipped: 0, Time elapsed: 2.466 sec
> - in
> org.apache.hadoop.hbase.security.visibility.TestDefaultScanLabelGeneratorStack
> Tests run: 2, Failures: 0, Errors: 0, Skipped: 0, Time elapsed: 3.519 sec
> - in
> org.apache.hadoop.hbase.security.visibility.TestVisibilityWithCheckAuths
> Running
> org.apache.hadoop.hbase.security.visibility.TestVisibilityLabelsWithDistributedLogReplay
> Running
> org.apache.hadoop.hbase.security.visibility.TestVisibilityLabelsOpWithDifferentUsersNoACL
> Tests run: 1, Failures: 0, Errors: 0, Skipped: 0, Time elapsed: 2.603 sec
> - in
> org.apache.hadoop.hbase.security.visibility.TestVisibilityLabelsOpWithDifferentUsersNoACL
> Tests run: 37, Failures: 0, Errors: 0, Skipped: 0, Time elapsed: 50.819
> sec - in
> org.apache.hadoop.hbase.security.visibility.TestVisibilityLabelsWithDeletes
> Running
> org.apache.hadoop.hbase.security.visibility.TestVisibilityLabelsWithSLGStack
> Tests run: 1, Failures: 0, Errors: 0, Skipped: 0, Time elapsed: 2.207 sec
> - in
> org.apache.hadoop.hbase.security.visibility.TestVisibilityLabelsWithSLGStack
> Running
> org.apache.hadoop.hbase.security.visibility.TestVisibilityLabelsReplication
> Running
> org.apache.hadoop.hbase.security.visibility.TestEnforcingScanLabelGenerator
> Tests run: 1, Failures: 0, Errors: 0, Skipped: 0, Time elapsed: 2.042 sec
> - in
> org.apache.hadoop.hbase.security.visibility.TestEnforcingScanLabelGenerator
> Running
> org.apache.hadoop.hbase.security.visibility.TestVisibilityLabelReplicationWithExpAsString
> Tests run: 1, Failures: 0, Errors: 0, Skipped: 0, Time elapsed: 17.073 sec
> - in
> org.apache.hadoop.hbase.security.visibility.TestVisibilityLabelsReplication
> Tests run: 1, Failures: 0, Errors: 0, Skipped: 0, Time elapsed: 18.178 sec
> - in
> org.apache.hadoop.hbase.security.visibility.TestVisibilityLabelReplicationWithExpAsString
> Running
> org.apache.hadoop.hbase.security.visibility.TestVisibilityLabelsWithACL
> Running org.apache.hadoop.hbase.security.token.TestZKSecretWatcher
> Tests run: 5, Failures: 0, Errors: 0, Skipped: 0, Time elapsed: 6.747 sec
> - in org.apache.hadoop.hbase.security.visibility.TestVisibilityLabelsWithACL
> Running org.apache.hadoop.hbase.security.token.TestTokenAuthentication
> Tests run: 3, Failures: 0, Errors: 0, Skipped: 0, Time elapsed: 0.471 sec
> - in org.apache.hadoop.hbase.security.token.TestTokenAuthentication
> Tests run: 1, Failures: 0, Errors: 0, Skipped: 0, Time elapsed: 13.23 sec
> - in org.apache.hadoop.hbase.security.token.TestZKSecretWatcher
> Tests run: 216, Failures: 0, Errors: 0, Skipped: 0, Time elapsed: 352.986
> sec - in org.apache.hadoop.hbase.io.hfile.TestCacheOnWrite
> Tests run: 55, Failures: 0, Errors: 0, Skipped: 0, Time elapsed: 247.664
> sec - in org.apache.hadoop.hbase.security.access.TestAccessController
> Tests run: 23, Failures: 0, Errors: 0, Skipped: 0, Time elapsed: 121.469
> sec - in
> org.apache.hadoop.hbase.security.visibility.TestVisibilityLabelsWithDistributedLogReplay
>
> Results :
>
> Failed tests:
>   TestSplitLogManager.testGetPreviousRecoveryMode:656 Mode4=LOG_SPLITTING
>
>
>
> Tests run: 2309, Failures: 1, Errors: 0, Skipped: 18
>
> [INFO]
> ------------------------------------------------------------------------
> [INFO] Reactor Summary:
> [INFO]
> [INFO] HBase ............................................. SUCCESS [3.025s]
> [INFO] HBase - Checkstyle ................................ SUCCESS [0.610s]
> [INFO] HBase - Annotations ............................... SUCCESS [0.814s]
> [INFO] HBase - Common .................................... SUCCESS
> [56.225s]
> [INFO] HBase - Protocol .................................. SUCCESS [9.197s]
> [INFO] HBase - Client .................................... SUCCESS
> [1:14.360s]
> [INFO] HBase - Hadoop Compatibility ...................... SUCCESS [6.975s]
> [INFO] HBase - Hadoop Two Compatibility .................. SUCCESS [6.089s]
> [INFO] HBase - Prefix Tree ............................... SUCCESS [8.271s]
> [INFO] HBase - Server .................................... FAILURE
> [1:03:30.206s]
> [INFO] HBase - Testing Util .............................. SKIPPED
> [INFO] HBase - Thrift .................................... SKIPPED
> [INFO] HBase - Rest ...................................... SKIPPED
> [INFO] HBase - Shell ..................................... SKIPPED
> [INFO] HBase - Integration Tests ......................... SKIPPED
> [INFO] HBase - Examples .................................. SKIPPED
> [INFO] HBase - Assembly .................................. SKIPPED
> [INFO]
> ------------------------------------------------------------------------
> [INFO] BUILD FAILURE
> [INFO]
> ------------------------------------------------------------------------
> [INFO] Total time: 1:06:16.566s
> [INFO] Finished at: Fri Feb 06 02:03:31 UTC 2015
> [INFO] Final Memory: 46M/948M
> [INFO]
> ------------------------------------------------------------------------
> [ERROR] Failed to execute goal
> org.apache.maven.plugins:maven-surefire-plugin:2.18:test
> (secondPartTestsExecution) on project hbase-server: There are test failures.
> [ERROR]
> [ERROR] Please refer to <
> https://builds.apache.org/job/HBase-1.0/ws/hbase-server/target/surefire-reports>
> for the individual test results.
> [ERROR] -> [Help 1]
> [ERROR]
> [ERROR] To see the full stack trace of the errors, re-run Maven with the
> -e switch.
> [ERROR] Re-run Maven using the -X switch to enable full debug logging.
> [ERROR]
> [ERROR] For more information about the errors and possible solutions,
> please read the following articles:
> [ERROR] [Help 1]
> http://cwiki.apache.org/confluence/display/MAVEN/MojoFailureException
> [ERROR]
> [ERROR] After correcting the problems, you can resume the build with the
> command
> [ERROR]   mvn <goals> -rf :hbase-server
> Build step 'Invoke top-level Maven targets' marked build as failure
> Performing Post build task...
> Match found for :.* : True
> Logical operation result is TRUE
> Running script  :   ZOMBIE_TESTS_COUNT=`jps | grep surefirebooter | wc -l`
>   if [[ $ZOMBIE_TESTS_COUNT != 0 ]] ; then
>     #It seems sometimes the tests are not dying immediately. Let's give
> them 10s
>     echo "Suspicious java process found - waiting 10s to see if there are
> just slow to stop"
>     sleep 10
>     ZOMBIE_TESTS_COUNT=`jps | grep surefirebooter | wc -l`
>     if [[ $ZOMBIE_TESTS_COUNT != 0 ]] ; then
>       echo "There are $ZOMBIE_TESTS_COUNT zombie tests, they should have
> been killed by surefire but survived"
>       echo "************ BEGIN zombies jstack extract"
>       ZB_STACK=`jps | grep surefirebooter | cut -d ' ' -f 1 | xargs -n 1
> jstack | grep ".test" | grep "\.java"`
>       jps | grep surefirebooter | cut -d ' ' -f 1 | xargs -n 1 jstack
>       echo "************ END  zombies jstack extract"
>       JIRA_COMMENT="$JIRA_COMMENT
>
>      {color:red}-1 core zombie tests{color}.  There are
> ${ZOMBIE_TESTS_COUNT} zombie test(s): ${ZB_STACK}"
>       BAD=1
>       jps | grep surefirebooter | cut -d ' ' -f 1 | xargs kill -9
>     else
>       echo "We're ok: there is no zombie test, but some tests took some
> time to stop"
>     fi
>   else
>     echo "We're ok: there is no zombie test"
>   fi
> [HBase-1.0] $ /bin/bash -xe /tmp/hudson1719086990535615249.sh
> ++ jps
> ++ wc -l
> ++ grep surefirebooter
> + ZOMBIE_TESTS_COUNT=0
> + [[ 0 != 0 ]]
> + echo 'We'\''re ok: there is no zombie test'
> We're ok: there is no zombie test
> POST BUILD TASK : SUCCESS
> END OF POST BUILD TASK : 0
> Archiving artifacts
> Sending artifact delta relative to HBase-1.0 #712
> Archived 1854 artifacts
> Archive block size is 32768
> Received 27 blocks and 402412102 bytes
> Compression is 0.2%
> Took 2 min 0 sec
> Recording test results
> Updating HBASE-12958
>

Mime
  • Unnamed multipart/alternative (inline, None, 0 bytes)
View raw message