hbase-builds mailing list archives

Site index · List index
Message view « Date » · « Thread »
Top « Date » · « Thread »
From Stack <st...@duboce.net>
Subject Re: Build failed in Jenkins: HBase-1.1 #146
Date Fri, 06 Feb 2015 06:46:37 GMT
DLR failed.

On Thu, Feb 5, 2015 at 7:25 PM, Apache Jenkins Server <
jenkins@builds.apache.org> wrote:

> See <https://builds.apache.org/job/HBase-1.1/146/>
>
> ------------------------------------------
> [...truncated 1824 lines...]
> Running org.apache.hadoop.hbase.replication.TestReplicationWithTags
> Tests run: 1, Failures: 0, Errors: 0, Skipped: 0, Time elapsed: 3.231 sec
> - in org.apache.hadoop.hbase.replication.TestReplicationWithTags
> Tests run: 1, Failures: 0, Errors: 0, Skipped: 0, Time elapsed: 18.61 sec
> - in
> org.apache.hadoop.hbase.security.visibility.TestVisibilityLabelReplicationWithExpAsString
> Running
> org.apache.hadoop.hbase.security.visibility.TestVisibilityLabelsWithDistributedLogReplay
> Running
> org.apache.hadoop.hbase.security.visibility.TestVisibilityLabelsWithSLGStack
> Tests run: 1, Failures: 0, Errors: 0, Skipped: 0, Time elapsed: 2.044 sec
> - in
> org.apache.hadoop.hbase.security.visibility.TestVisibilityLabelsWithSLGStack
> Tests run: 3, Failures: 0, Errors: 0, Skipped: 0, Time elapsed: 58.539 sec
> - in org.apache.hadoop.hbase.replication.TestMasterReplication
> Running
> org.apache.hadoop.hbase.security.visibility.TestVisibilityLabelsReplication
> Tests run: 9, Failures: 0, Errors: 0, Skipped: 0, Time elapsed: 43.932 sec
> - in org.apache.hadoop.hbase.replication.TestReplicationSmallTests
> Tests run: 23, Failures: 0, Errors: 0, Skipped: 0, Time elapsed: 16.64 sec
> - in
> org.apache.hadoop.hbase.security.visibility.TestVisibilityLabelsWithDistributedLogReplay
> Running
> org.apache.hadoop.hbase.security.visibility.TestVisibilityLabelsWithDeletes
> Running
> org.apache.hadoop.hbase.security.visibility.TestEnforcingScanLabelGenerator
> Tests run: 1, Failures: 0, Errors: 0, Skipped: 0, Time elapsed: 1.734 sec
> - in
> org.apache.hadoop.hbase.security.visibility.TestEnforcingScanLabelGenerator
> Running
> org.apache.hadoop.hbase.security.visibility.TestDefaultScanLabelGeneratorStack
> Tests run: 1, Failures: 0, Errors: 0, Skipped: 0, Time elapsed: 2.217 sec
> - in
> org.apache.hadoop.hbase.security.visibility.TestDefaultScanLabelGeneratorStack
> Tests run: 1, Failures: 0, Errors: 0, Skipped: 0, Time elapsed: 18.412 sec
> - in
> org.apache.hadoop.hbase.security.visibility.TestVisibilityLabelsReplication
> Running
> org.apache.hadoop.hbase.security.visibility.TestVisibilityWithCheckAuths
> Running
> org.apache.hadoop.hbase.security.visibility.TestVisibilityLabelsOpWithDifferentUsersNoACL
> Tests run: 2, Failures: 0, Errors: 0, Skipped: 0, Time elapsed: 3.463 sec
> - in
> org.apache.hadoop.hbase.security.visibility.TestVisibilityWithCheckAuths
> Tests run: 1, Failures: 0, Errors: 0, Skipped: 0, Time elapsed: 2.644 sec
> - in
> org.apache.hadoop.hbase.security.visibility.TestVisibilityLabelsOpWithDifferentUsersNoACL
> Running
> org.apache.hadoop.hbase.security.visibility.TestVisibilityLabelsWithDefaultVisLabelService
> Running
> org.apache.hadoop.hbase.security.visibility.TestVisibilityLabelsWithACL
> Running
> org.apache.hadoop.hbase.security.visibility.TestVisibilityLablesWithGroups
> Tests run: 1, Failures: 0, Errors: 0, Skipped: 0, Time elapsed: 2.645 sec
> - in
> org.apache.hadoop.hbase.security.visibility.TestVisibilityLablesWithGroups
> Tests run: 5, Failures: 0, Errors: 0, Skipped: 0, Time elapsed: 7.125 sec
> - in org.apache.hadoop.hbase.security.visibility.TestVisibilityLabelsWithACL
> Running
> org.apache.hadoop.hbase.security.visibility.TestVisibilityLabelsWithCustomVisLabService
> Tests run: 23, Failures: 0, Errors: 0, Skipped: 0, Time elapsed: 18.191
> sec - in
> org.apache.hadoop.hbase.security.visibility.TestVisibilityLabelsWithDefaultVisLabelService
> Running org.apache.hadoop.hbase.security.access.TestAccessController2
> Running org.apache.hadoop.hbase.security.access.TestAccessController
> Tests run: 37, Failures: 0, Errors: 0, Skipped: 0, Time elapsed: 51.615
> sec - in
> org.apache.hadoop.hbase.security.visibility.TestVisibilityLabelsWithDeletes
> Tests run: 19, Failures: 0, Errors: 0, Skipped: 0, Time elapsed: 14.417
> sec - in
> org.apache.hadoop.hbase.security.visibility.TestVisibilityLabelsWithCustomVisLabService
> Tests run: 2, Failures: 0, Errors: 0, Skipped: 0, Time elapsed: 10.873 sec
> - in org.apache.hadoop.hbase.security.access.TestAccessController2
> Running org.apache.hadoop.hbase.security.access.TestTablePermissions
> Running org.apache.hadoop.hbase.security.access.TestAccessControlFilter
> Running org.apache.hadoop.hbase.security.access.TestCellACLs
> Tests run: 1, Failures: 0, Errors: 0, Skipped: 0, Time elapsed: 3.279 sec
> - in org.apache.hadoop.hbase.security.access.TestAccessControlFilter
> Tests run: 2, Failures: 0, Errors: 0, Skipped: 0, Time elapsed: 9.771 sec
> - in org.apache.hadoop.hbase.security.access.TestCellACLs
> Running org.apache.hadoop.hbase.security.access.TestNamespaceCommands
> Running org.apache.hadoop.hbase.security.access.TestZKPermissionsWatcher
> Tests run: 8, Failures: 0, Errors: 0, Skipped: 0, Time elapsed: 223.444
> sec - in
> org.apache.hadoop.hbase.replication.regionserver.TestReplicationWALReaderManager
> Tests run: 1, Failures: 0, Errors: 0, Skipped: 0, Time elapsed: 3.523 sec
> - in org.apache.hadoop.hbase.security.access.TestZKPermissionsWatcher
> Tests run: 7, Failures: 0, Errors: 0, Skipped: 0, Time elapsed: 12.189 sec
> - in org.apache.hadoop.hbase.security.access.TestNamespaceCommands
> Tests run: 7, Failures: 0, Errors: 0, Skipped: 0, Time elapsed: 32.476 sec
> - in org.apache.hadoop.hbase.security.access.TestTablePermissions
> Running org.apache.hadoop.hbase.security.access.TestScanEarlyTermination
> Running org.apache.hadoop.hbase.security.token.TestZKSecretWatcher
> Running
> org.apache.hadoop.hbase.security.access.TestCellACLWithMultipleVersions
> Running org.apache.hadoop.hbase.security.token.TestTokenAuthentication
> Tests run: 3, Failures: 0, Errors: 0, Skipped: 0, Time elapsed: 0.536 sec
> - in org.apache.hadoop.hbase.security.token.TestTokenAuthentication
> Running org.apache.hadoop.hbase.TestMetaTableAccessorNoCluster
> Tests run: 1, Failures: 0, Errors: 0, Skipped: 0, Time elapsed: 4.29 sec -
> in org.apache.hadoop.hbase.security.access.TestScanEarlyTermination
> Running org.apache.hadoop.hbase.TestMetaTableLocator
> Tests run: 2, Failures: 0, Errors: 0, Skipped: 0, Time elapsed: 3.543 sec
> - in org.apache.hadoop.hbase.TestMetaTableAccessorNoCluster
> Tests run: 7, Failures: 0, Errors: 0, Skipped: 0, Time elapsed: 3.544 sec
> - in org.apache.hadoop.hbase.TestMetaTableLocator
> Running org.apache.hadoop.hbase.TestHBaseTestingUtility
> Running org.apache.hadoop.hbase.TestZooKeeper
> Tests run: 1, Failures: 0, Errors: 0, Skipped: 0, Time elapsed: 13.263 sec
> - in org.apache.hadoop.hbase.security.token.TestZKSecretWatcher
> Running org.apache.hadoop.hbase.snapshot.TestSnapshotDescriptionUtils
> Tests run: 2, Failures: 0, Errors: 0, Skipped: 0, Time elapsed: 0.18 sec -
> in org.apache.hadoop.hbase.snapshot.TestSnapshotDescriptionUtils
> Tests run: 8, Failures: 0, Errors: 0, Skipped: 0, Time elapsed: 26.226 sec
> - in org.apache.hadoop.hbase.security.access.TestCellACLWithMultipleVersions
> Running org.apache.hadoop.hbase.snapshot.TestFlushSnapshotFromClient
> Running org.apache.hadoop.hbase.snapshot.TestSecureExportSnapshot
> Tests run: 7, Failures: 0, Errors: 0, Skipped: 0, Time elapsed: 38.004 sec
> - in org.apache.hadoop.hbase.TestHBaseTestingUtility
> Tests run: 9, Failures: 0, Errors: 0, Skipped: 0, Time elapsed: 38.561 sec
> - in org.apache.hadoop.hbase.snapshot.TestFlushSnapshotFromClient
> Running org.apache.hadoop.hbase.snapshot.TestExportSnapshot
> Running org.apache.hadoop.hbase.snapshot.TestRestoreFlushSnapshotFromClient
> Tests run: 5, Failures: 0, Errors: 0, Skipped: 0, Time elapsed: 56.994 sec
> - in org.apache.hadoop.hbase.snapshot.TestRestoreFlushSnapshotFromClient
> Running org.apache.hadoop.hbase.TestInfoServers
> Tests run: 3, Failures: 0, Errors: 0, Skipped: 0, Time elapsed: 1.918 sec
> - in org.apache.hadoop.hbase.TestInfoServers
> Running org.apache.hadoop.hbase.procedure.TestZKProcedureControllers
> Tests run: 4, Failures: 0, Errors: 0, Skipped: 0, Time elapsed: 1.596 sec
> - in org.apache.hadoop.hbase.procedure.TestZKProcedureControllers
> Running org.apache.hadoop.hbase.procedure.TestZKProcedure
> Tests run: 4, Failures: 0, Errors: 0, Skipped: 0, Time elapsed: 1.926 sec
> - in org.apache.hadoop.hbase.procedure.TestZKProcedure
> Running org.apache.hadoop.hbase.io.hfile.TestCacheOnWrite
> Tests run: 11, Failures: 0, Errors: 0, Skipped: 0, Time elapsed: 155.652
> sec - in org.apache.hadoop.hbase.TestZooKeeper
> Running org.apache.hadoop.hbase.io.hfile.TestForceCacheImportantBlocks
> Tests run: 55, Failures: 0, Errors: 0, Skipped: 0, Time elapsed: 248.893
> sec - in org.apache.hadoop.hbase.security.access.TestAccessController
> Running org.apache.hadoop.hbase.io.hfile.TestHFileBlock
> Tests run: 4, Failures: 0, Errors: 0, Skipped: 0, Time elapsed: 39.785 sec
> - in org.apache.hadoop.hbase.io.hfile.TestForceCacheImportantBlocks
> Running org.apache.hadoop.hbase.io.hfile.TestHFileBlockIndex
> Tests run: 4, Failures: 0, Errors: 0, Skipped: 0, Time elapsed: 3.402 sec
> - in org.apache.hadoop.hbase.io.hfile.TestHFileBlockIndex
> Running org.apache.hadoop.hbase.io.hfile.TestHFileSeek
> Tests run: 1, Failures: 0, Errors: 0, Skipped: 0, Time elapsed: 2.684 sec
> - in org.apache.hadoop.hbase.io.hfile.TestHFileSeek
> Running org.apache.hadoop.hbase.io.hfile.TestScannerSelectionUsingTTL
> Tests run: 6, Failures: 0, Errors: 0, Skipped: 0, Time elapsed: 63.138 sec
> - in org.apache.hadoop.hbase.io.hfile.TestScannerSelectionUsingTTL
> Running org.apache.hadoop.hbase.io.hfile.TestCacheConfig
> Tests run: 6, Failures: 0, Errors: 0, Skipped: 0, Time elapsed: 2.073 sec
> - in org.apache.hadoop.hbase.io.hfile.TestCacheConfig
> Tests run: 28, Failures: 0, Errors: 0, Skipped: 0, Time elapsed: 94.997
> sec - in org.apache.hadoop.hbase.io.hfile.TestHFileBlock
> Running org.apache.hadoop.hbase.io.encoding.TestDataBlockEncoders
> Running org.apache.hadoop.hbase.io.encoding.TestEncodedSeekers
> Tests run: 9, Failures: 0, Errors: 0, Skipped: 0, Time elapsed: 282.304
> sec - in org.apache.hadoop.hbase.snapshot.TestSecureExportSnapshot
> Running org.apache.hadoop.hbase.io.encoding.TestBufferedDataBlockEncoder
> Tests run: 1, Failures: 0, Errors: 0, Skipped: 0, Time elapsed: 25.07 sec
> - in org.apache.hadoop.hbase.io.encoding.TestBufferedDataBlockEncoder
> Running org.apache.hadoop.hbase.io.encoding.TestChangingEncoding
> Tests run: 9, Failures: 0, Errors: 0, Skipped: 0, Time elapsed: 286.038
> sec - in org.apache.hadoop.hbase.snapshot.TestExportSnapshot
> Running org.apache.hadoop.hbase.io.encoding.TestLoadAndSwitchEncodeOnDisk
> Tests run: 1, Failures: 0, Errors: 0, Skipped: 0, Time elapsed: 22.873 sec
> - in org.apache.hadoop.hbase.io.encoding.TestLoadAndSwitchEncodeOnDisk
> Running org.apache.hadoop.hbase.io.TestFileLink
> Tests run: 20, Failures: 0, Errors: 0, Skipped: 0, Time elapsed: 95.56 sec
> - in org.apache.hadoop.hbase.io.encoding.TestEncodedSeekers
> Tests run: 3, Failures: 0, Errors: 0, Skipped: 0, Time elapsed: 14.078 sec
> - in org.apache.hadoop.hbase.io.TestFileLink
> Running org.apache.hadoop.hbase.wal.TestWALFiltering
> Running org.apache.hadoop.hbase.wal.TestWALFactory
> Tests run: 9, Failures: 0, Errors: 0, Skipped: 0, Time elapsed: 15.565 sec
> - in org.apache.hadoop.hbase.wal.TestWALFactory
> Running org.apache.hadoop.hbase.wal.TestWALReaderOnSecureWAL
> Tests run: 2, Failures: 0, Errors: 0, Skipped: 0, Time elapsed: 1.555 sec
> - in org.apache.hadoop.hbase.wal.TestWALReaderOnSecureWAL
> Tests run: 1, Failures: 0, Errors: 0, Skipped: 0, Time elapsed: 23.236 sec
> - in org.apache.hadoop.hbase.wal.TestWALFiltering
> Running org.apache.hadoop.hbase.wal.TestDefaultWALProvider
> Running org.apache.hadoop.hbase.wal.TestWALSplit
> Tests run: 5, Failures: 0, Errors: 0, Skipped: 0, Time elapsed: 6.435 sec
> - in org.apache.hadoop.hbase.wal.TestDefaultWALProvider
> Running org.apache.hadoop.hbase.wal.TestSecureWAL
> Tests run: 1, Failures: 0, Errors: 0, Skipped: 0, Time elapsed: 1.275 sec
> - in org.apache.hadoop.hbase.wal.TestSecureWAL
> Running org.apache.hadoop.hbase.wal.TestDefaultWALProviderWithHLogKey
> Tests run: 5, Failures: 0, Errors: 0, Skipped: 0, Time elapsed: 6.028 sec
> - in org.apache.hadoop.hbase.wal.TestDefaultWALProviderWithHLogKey
> Running org.apache.hadoop.hbase.wal.TestBoundedRegionGroupingProvider
> Tests run: 3, Failures: 0, Errors: 0, Skipped: 0, Time elapsed: 104.433
> sec - in org.apache.hadoop.hbase.io.encoding.TestChangingEncoding
> Running org.apache.hadoop.hbase.wal.TestWALSplitCompressed
> Tests run: 5, Failures: 0, Errors: 0, Skipped: 0, Time elapsed: 18.973 sec
> - in org.apache.hadoop.hbase.wal.TestBoundedRegionGroupingProvider
> Running org.apache.hadoop.hbase.zookeeper.TestZooKeeperACL
> Tests run: 6, Failures: 0, Errors: 0, Skipped: 0, Time elapsed: 0.263 sec
> - in org.apache.hadoop.hbase.zookeeper.TestZooKeeperACL
> Running org.apache.hadoop.hbase.zookeeper.TestZKLeaderManager
> Tests run: 1, Failures: 0, Errors: 0, Skipped: 0, Time elapsed: 0.138 sec
> - in org.apache.hadoop.hbase.zookeeper.TestZKLeaderManager
> Running org.apache.hadoop.hbase.zookeeper.TestZooKeeperNodeTracker
> Tests run: 3, Failures: 0, Errors: 0, Skipped: 0, Time elapsed: 0.802 sec
> - in org.apache.hadoop.hbase.zookeeper.TestZooKeeperNodeTracker
> Running org.apache.hadoop.hbase.zookeeper.TestRecoverableZooKeeper
> Tests run: 1, Failures: 0, Errors: 0, Skipped: 0, Time elapsed: 1.211 sec
> - in org.apache.hadoop.hbase.zookeeper.TestRecoverableZooKeeper
> Running org.apache.hadoop.hbase.zookeeper.TestZKTableStateManager
> Tests run: 1, Failures: 0, Errors: 0, Skipped: 0, Time elapsed: 0.683 sec
> - in org.apache.hadoop.hbase.zookeeper.TestZKTableStateManager
> Running org.apache.hadoop.hbase.zookeeper.TestZKMulti
> Tests run: 8, Failures: 0, Errors: 0, Skipped: 0, Time elapsed: 0.527 sec
> - in org.apache.hadoop.hbase.zookeeper.TestZKMulti
> Running
> org.apache.hadoop.hbase.zookeeper.lock.TestZKInterProcessReadWriteLock
> Tests run: 216, Failures: 0, Errors: 0, Skipped: 0, Time elapsed: 341.629
> sec - in org.apache.hadoop.hbase.io.hfile.TestCacheOnWrite
> Running org.apache.hadoop.hbase.zookeeper.TestHQuorumPeer
> Tests run: 3, Failures: 0, Errors: 0, Skipped: 0, Time elapsed: 1.317 sec
> - in org.apache.hadoop.hbase.zookeeper.TestHQuorumPeer
> Running org.apache.hadoop.hbase.TestIOFencing
> Tests run: 6, Failures: 0, Errors: 0, Skipped: 0, Time elapsed: 24.539 sec
> - in org.apache.hadoop.hbase.zookeeper.lock.TestZKInterProcessReadWriteLock
> Running org.apache.hadoop.hbase.constraint.TestConstraint
> Tests run: 5, Failures: 0, Errors: 0, Skipped: 0, Time elapsed: 6.392 sec
> - in org.apache.hadoop.hbase.constraint.TestConstraint
> Tests run: 28, Failures: 0, Errors: 0, Skipped: 0, Time elapsed: 240.628
> sec - in org.apache.hadoop.hbase.io.encoding.TestDataBlockEncoders
> Running org.apache.hadoop.hbase.backup.TestHFileArchiving
> Running
> org.apache.hadoop.hbase.backup.example.TestZooKeeperTableArchiveClient
> Tests run: 3, Failures: 0, Errors: 0, Skipped: 0, Time elapsed: 3.871 sec
> - in org.apache.hadoop.hbase.backup.example.TestZooKeeperTableArchiveClient
> Running org.apache.hadoop.hbase.TestHColumnDescriptorDefaultVersions
> Tests run: 3, Failures: 0, Errors: 0, Skipped: 0, Time elapsed: 12.339 sec
> - in org.apache.hadoop.hbase.TestHColumnDescriptorDefaultVersions
> Running org.apache.hadoop.hbase.ipc.TestProtoBufRpc
> Tests run: 1, Failures: 0, Errors: 0, Skipped: 0, Time elapsed: 1.62 sec -
> in org.apache.hadoop.hbase.ipc.TestProtoBufRpc
> Running org.apache.hadoop.hbase.ipc.TestDelayedRpc
> Tests run: 4, Failures: 0, Errors: 0, Skipped: 0, Time elapsed: 3.619 sec
> - in org.apache.hadoop.hbase.ipc.TestDelayedRpc
> Running org.apache.hadoop.hbase.ipc.TestHBaseClient
> Tests run: 1, Failures: 0, Errors: 0, Skipped: 0, Time elapsed: 0.398 sec
> - in org.apache.hadoop.hbase.ipc.TestHBaseClient
> Tests run: 5, Failures: 0, Errors: 0, Skipped: 0, Time elapsed: 37.951 sec
> - in org.apache.hadoop.hbase.backup.TestHFileArchiving
> Running org.apache.hadoop.hbase.TestNamespace
> Tests run: 9, Failures: 0, Errors: 0, Skipped: 1, Time elapsed: 6.346 sec
> - in org.apache.hadoop.hbase.TestNamespace
> Tests run: 31, Failures: 0, Errors: 0, Skipped: 0, Time elapsed: 188.806
> sec - in org.apache.hadoop.hbase.wal.TestWALSplit
> Tests run: 31, Failures: 0, Errors: 0, Skipped: 0, Time elapsed: 185.249
> sec - in org.apache.hadoop.hbase.wal.TestWALSplitCompressed
> Tests run: 2, Failures: 0, Errors: 0, Skipped: 0, Time elapsed: 203.192
> sec - in org.apache.hadoop.hbase.TestIOFencing
>
> Results :
>
> Failed tests:
>   TestDistributedLogSplitting.testThreeRSAbort:1063 Timedout
>
>
>
> Tests run: 2364, Failures: 1, Errors: 0, Skipped: 18
>
> [INFO]
> ------------------------------------------------------------------------
> [INFO] Reactor Summary:
> [INFO]
> [INFO] HBase ............................................. SUCCESS [3.058s]
> [INFO] HBase - Checkstyle ................................ SUCCESS [0.576s]
> [INFO] HBase - Annotations ............................... SUCCESS [0.808s]
> [INFO] HBase - Common .................................... SUCCESS
> [1:13.823s]
> [INFO] HBase - Protocol .................................. SUCCESS [9.038s]
> [INFO] HBase - Client .................................... SUCCESS
> [1:14.683s]
> [INFO] HBase - Hadoop Compatibility ...................... SUCCESS [6.979s]
> [INFO] HBase - Hadoop Two Compatibility .................. SUCCESS [6.104s]
> [INFO] HBase - Prefix Tree ............................... SUCCESS [8.223s]
> [INFO] HBase - Server .................................... FAILURE
> [1:04:42.557s]
> [INFO] HBase - Testing Util .............................. SKIPPED
> [INFO] HBase - Thrift .................................... SKIPPED
> [INFO] HBase - Rest ...................................... SKIPPED
> [INFO] HBase - Shell ..................................... SKIPPED
> [INFO] HBase - Integration Tests ......................... SKIPPED
> [INFO] HBase - Examples .................................. SKIPPED
> [INFO] HBase - Assembly .................................. SKIPPED
> [INFO]
> ------------------------------------------------------------------------
> [INFO] BUILD FAILURE
> [INFO]
> ------------------------------------------------------------------------
> [INFO] Total time: 1:07:46.646s
> [INFO] Finished at: Fri Feb 06 03:22:45 UTC 2015
> [INFO] Final Memory: 46M/714M
> [INFO]
> ------------------------------------------------------------------------
> [ERROR] Failed to execute goal
> org.apache.maven.plugins:maven-surefire-plugin:2.18:test
> (secondPartTestsExecution) on project hbase-server: There are test failures.
> [ERROR]
> [ERROR] Please refer to <
> https://builds.apache.org/job/HBase-1.1/ws/hbase-server/target/surefire-reports>
> for the individual test results.
> [ERROR] -> [Help 1]
> [ERROR]
> [ERROR] To see the full stack trace of the errors, re-run Maven with the
> -e switch.
> [ERROR] Re-run Maven using the -X switch to enable full debug logging.
> [ERROR]
> [ERROR] For more information about the errors and possible solutions,
> please read the following articles:
> [ERROR] [Help 1]
> http://cwiki.apache.org/confluence/display/MAVEN/MojoFailureException
> [ERROR]
> [ERROR] After correcting the problems, you can resume the build with the
> command
> [ERROR]   mvn <goals> -rf :hbase-server
> Build step 'Invoke top-level Maven targets' marked build as failure
> Performing Post build task...
> Match found for :.* : True
> Logical operation result is TRUE
> Running script  :   ZOMBIE_TESTS_COUNT=`jps | grep surefirebooter | wc -l`
>   if [[ $ZOMBIE_TESTS_COUNT != 0 ]] ; then
>     #It seems sometimes the tests are not dying immediately. Let's give
> them 10s
>     echo "Suspicious java process found - waiting 10s to see if there are
> just slow to stop"
>     sleep 10
>     ZOMBIE_TESTS_COUNT=`jps | grep surefirebooter | wc -l`
>     if [[ $ZOMBIE_TESTS_COUNT != 0 ]] ; then
>       echo "There are $ZOMBIE_TESTS_COUNT zombie tests, they should have
> been killed by surefire but survived"
>       echo "************ BEGIN zombies jstack extract"
>       ZB_STACK=`jps | grep surefirebooter | cut -d ' ' -f 1 | xargs -n 1
> jstack | grep ".test" | grep "\.java"`
>       jps | grep surefirebooter | cut -d ' ' -f 1 | xargs -n 1 jstack
>       echo "************ END  zombies jstack extract"
>       JIRA_COMMENT="$JIRA_COMMENT
>
>      {color:red}-1 core zombie tests{color}.  There are
> ${ZOMBIE_TESTS_COUNT} zombie test(s): ${ZB_STACK}"
>       BAD=1
>       jps | grep surefirebooter | cut -d ' ' -f 1 | xargs kill -9
>     else
>       echo "We're ok: there is no zombie test, but some tests took some
> time to stop"
>     fi
>   else
>     echo "We're ok: there is no zombie test"
>   fi
> [HBase-1.1] $ /bin/bash -xe /tmp/hudson9164788736713383924.sh
> ++ jps
> ++ grep surefirebooter
> ++ wc -l
> + ZOMBIE_TESTS_COUNT=0
> + [[ 0 != 0 ]]
> + echo 'We'\''re ok: there is no zombie test'
> We're ok: there is no zombie test
> POST BUILD TASK : SUCCESS
> END OF POST BUILD TASK : 0
> Archiving artifacts
> Sending artifact delta relative to HBase-1.1 #140
> Archived 1869 artifacts
> Archive block size is 32768
> Received 27 blocks and 416943501 bytes
> Compression is 0.2%
> Took 2 min 12 sec
> Recording test results
>

Mime
  • Unnamed multipart/alternative (inline, None, 0 bytes)
View raw message