hbase-builds mailing list archives

Site index · List index
Message view « Date » · « Thread »
Top « Date » · « Thread »
From Stack <st...@duboce.net>
Subject Re: Build failed in Jenkins: HBase-1.0 #714
Date Fri, 06 Feb 2015 06:47:11 GMT
Seems totally random.

On Thu, Feb 5, 2015 at 7:22 PM, Apache Jenkins Server <
jenkins@builds.apache.org> wrote:

> See <https://builds.apache.org/job/HBase-1.0/714/>
>
> ------------------------------------------
> [...truncated 1818 lines...]
> Running org.apache.hadoop.hbase.regionserver.wal.TestLogRolling
> Running
> org.apache.hadoop.hbase.regionserver.wal.TestReadOldRootAndMetaEdits
> Tests run: 1, Failures: 0, Errors: 0, Skipped: 0, Time elapsed: 0.406 sec
> - in org.apache.hadoop.hbase.regionserver.wal.TestReadOldRootAndMetaEdits
> Running org.apache.hadoop.hbase.regionserver.wal.TestFSHLog
> Running org.apache.hadoop.hbase.regionserver.wal.TestLogRollAbort
> Running org.apache.hadoop.hbase.regionserver.wal.TestLogRollPeriod
> Tests run: 6, Failures: 0, Errors: 0, Skipped: 0, Time elapsed: 4.403 sec
> - in org.apache.hadoop.hbase.regionserver.wal.TestFSHLog
> Running org.apache.hadoop.hbase.regionserver.wal.TestSecureWALReplay
> Running org.apache.hadoop.hbase.regionserver.wal.TestWALReplayCompressed
> Tests run: 2, Failures: 0, Errors: 0, Skipped: 0, Time elapsed: 20.55 sec
> - in org.apache.hadoop.hbase.regionserver.wal.TestLogRollAbort
> Running org.apache.hadoop.hbase.regionserver.wal.TestWALReplay
> Tests run: 9, Failures: 0, Errors: 0, Skipped: 0, Time elapsed: 39.923 sec
> - in org.apache.hadoop.hbase.regionserver.wal.TestSecureWALReplay
> Tests run: 9, Failures: 0, Errors: 0, Skipped: 0, Time elapsed: 35.099 sec
> - in org.apache.hadoop.hbase.regionserver.wal.TestWALReplayCompressed
> Running org.apache.hadoop.hbase.regionserver.wal.TestDurability
> Tests run: 2, Failures: 0, Errors: 0, Skipped: 0, Time elapsed: 2.091 sec
> - in org.apache.hadoop.hbase.regionserver.wal.TestDurability
> Running org.apache.hadoop.hbase.regionserver.wal.TestProtobufLog
> Tests run: 2, Failures: 0, Errors: 0, Skipped: 0, Time elapsed: 51.382 sec
> - in org.apache.hadoop.hbase.regionserver.wal.TestLogRollPeriod
> Running org.apache.hadoop.hbase.regionserver.TestParallelPut
> Tests run: 1, Failures: 0, Errors: 0, Skipped: 0, Time elapsed: 1.397 sec
> - in org.apache.hadoop.hbase.regionserver.wal.TestProtobufLog
> Running org.apache.hadoop.hbase.regionserver.TestMajorCompaction
> Running org.apache.hadoop.hbase.regionserver.TestRegionReplicas
> Tests run: 9, Failures: 0, Errors: 0, Skipped: 0, Time elapsed: 35.905 sec
> - in org.apache.hadoop.hbase.regionserver.wal.TestWALReplay
> Running org.apache.hadoop.hbase.regionserver.TestEncryptionKeyRotation
> Tests run: 2, Failures: 0, Errors: 0, Skipped: 0, Time elapsed: 13.132 sec
> - in org.apache.hadoop.hbase.regionserver.TestEncryptionKeyRotation
> Running org.apache.hadoop.hbase.regionserver.TestZKLessSplitOnCluster
> Tests run: 7, Failures: 0, Errors: 0, Skipped: 0, Time elapsed: 46.221 sec
> - in org.apache.hadoop.hbase.regionserver.TestMajorCompaction
> Running org.apache.hadoop.hbase.regionserver.TestCompactionState
> Tests run: 16, Failures: 0, Errors: 0, Skipped: 0, Time elapsed: 32.828
> sec - in org.apache.hadoop.hbase.regionserver.TestZKLessSplitOnCluster
> Tests run: 2, Failures: 0, Errors: 0, Skipped: 0, Time elapsed: 77.791 sec
> - in org.apache.hadoop.hbase.regionserver.TestParallelPut
> Running org.apache.hadoop.hbase.regionserver.TestFSErrorsExposed
> Running org.apache.hadoop.hbase.regionserver.TestDefaultMemStore
> Tests run: 5, Failures: 0, Errors: 0, Skipped: 0, Time elapsed: 21.53 sec
> - in org.apache.hadoop.hbase.regionserver.TestCompactionState
> Running org.apache.hadoop.hbase.regionserver.TestRegionServerMetrics
> Tests run: 9, Failures: 0, Errors: 0, Skipped: 0, Time elapsed: 6.549 sec
> - in org.apache.hadoop.hbase.regionserver.TestRegionServerMetrics
> Running org.apache.hadoop.hbase.regionserver.TestGetClosestAtOrBefore
> Tests run: 3, Failures: 0, Errors: 0, Skipped: 0, Time elapsed: 1.739 sec
> - in org.apache.hadoop.hbase.regionserver.TestGetClosestAtOrBefore
> Running org.apache.hadoop.hbase.regionserver.TestRSKilledWhenInitializing
> Tests run: 3, Failures: 0, Errors: 0, Skipped: 0, Time elapsed: 37.101 sec
> - in org.apache.hadoop.hbase.regionserver.TestFSErrorsExposed
> Running org.apache.hadoop.hbase.regionserver.TestReversibleScanners
> Tests run: 1, Failures: 0, Errors: 0, Skipped: 0, Time elapsed: 16.61 sec
> - in org.apache.hadoop.hbase.regionserver.TestRSKilledWhenInitializing
> Running org.apache.hadoop.hbase.regionserver.TestRecoveredEdits
> Tests run: 5, Failures: 0, Errors: 0, Skipped: 0, Time elapsed: 3.665 sec
> - in org.apache.hadoop.hbase.regionserver.TestReversibleScanners
> Tests run: 23, Failures: 0, Errors: 0, Skipped: 0, Time elapsed: 45.048
> sec - in org.apache.hadoop.hbase.regionserver.TestDefaultMemStore
> Tests run: 1, Failures: 0, Errors: 0, Skipped: 0, Time elapsed: 10.512 sec
> - in org.apache.hadoop.hbase.regionserver.TestRecoveredEdits
> Running org.apache.hadoop.hbase.regionserver.TestClusterId
> Running org.apache.hadoop.hbase.regionserver.TestRegionServerNoMaster
> Running org.apache.hadoop.hbase.regionserver.TestScannerWithBulkload
> Tests run: 3, Failures: 0, Errors: 0, Skipped: 0, Time elapsed: 5.447 sec
> - in org.apache.hadoop.hbase.regionserver.TestScannerWithBulkload
> Running org.apache.hadoop.hbase.regionserver.TestCompaction
> Tests run: 9, Failures: 0, Errors: 0, Skipped: 0, Time elapsed: 17.982 sec
> - in org.apache.hadoop.hbase.regionserver.TestRegionServerNoMaster
> Tests run: 2, Failures: 0, Errors: 0, Skipped: 0, Time elapsed: 25.604 sec
> - in org.apache.hadoop.hbase.regionserver.TestClusterId
> Tests run: 5, Failures: 0, Errors: 0, Skipped: 0, Time elapsed: 20.625 sec
> - in org.apache.hadoop.hbase.regionserver.TestCompaction
> Running org.apache.hadoop.hbase.regionserver.TestRegionFavoredNodes
> Running org.apache.hadoop.hbase.regionserver.TestSeekOptimizations
> Tests run: 7, Failures: 0, Errors: 0, Skipped: 0, Time elapsed: 154.439
> sec - in org.apache.hadoop.hbase.regionserver.TestRegionReplicas
> Running org.apache.hadoop.hbase.regionserver.TestServerCustomProtocol
> Running org.apache.hadoop.hbase.regionserver.TestHRegion
> Tests run: 6, Failures: 0, Errors: 0, Skipped: 0, Time elapsed: 4.902 sec
> - in org.apache.hadoop.hbase.regionserver.TestSeekOptimizations
> Tests run: 1, Failures: 0, Errors: 0, Skipped: 0, Time elapsed: 7.841 sec
> - in org.apache.hadoop.hbase.regionserver.TestRegionFavoredNodes
> Running org.apache.hadoop.hbase.regionserver.TestAtomicOperation
> Tests run: 7, Failures: 0, Errors: 0, Skipped: 0, Time elapsed: 13.281 sec
> - in org.apache.hadoop.hbase.regionserver.TestServerCustomProtocol
> Running org.apache.hadoop.hbase.regionserver.TestCompactionWithCoprocessor
> Running org.apache.hadoop.hbase.regionserver.TestSplitTransactionOnCluster
> Tests run: 5, Failures: 0, Errors: 0, Skipped: 0, Time elapsed: 260.512
> sec - in org.apache.hadoop.hbase.regionserver.wal.TestLogRolling
> Running org.apache.hadoop.hbase.regionserver.TestHRegionServerBulkLoad
> Tests run: 5, Failures: 0, Errors: 0, Skipped: 0, Time elapsed: 25.03 sec
> - in org.apache.hadoop.hbase.regionserver.TestCompactionWithCoprocessor
> Tests run: 6, Failures: 0, Errors: 0, Skipped: 0, Time elapsed: 38.803 sec
> - in org.apache.hadoop.hbase.regionserver.TestAtomicOperation
> Running org.apache.hadoop.hbase.regionserver.TestZKLessMergeOnCluster
> Tests run: 16, Failures: 0, Errors: 0, Skipped: 0, Time elapsed: 46.956
> sec - in org.apache.hadoop.hbase.regionserver.TestSplitTransactionOnCluster
> Running
> org.apache.hadoop.hbase.regionserver.TestRegionServerOnlineConfigChange
> Tests run: 3, Failures: 0, Errors: 0, Skipped: 0, Time elapsed: 13.364 sec
> - in org.apache.hadoop.hbase.regionserver.TestZKLessMergeOnCluster
> Tests run: 2, Failures: 0, Errors: 0, Skipped: 0, Time elapsed: 1.573 sec
> - in org.apache.hadoop.hbase.regionserver.TestRegionServerOnlineConfigChange
> Running org.apache.hadoop.hbase.TestRegionRebalancing
> Running org.apache.hadoop.hbase.regionserver.TestEncryptionRandomKeying
> Running org.apache.hadoop.hbase.regionserver.TestEndToEndSplitTransaction
> Tests run: 1, Failures: 0, Errors: 0, Skipped: 0, Time elapsed: 1.676 sec
> - in org.apache.hadoop.hbase.regionserver.TestEncryptionRandomKeying
> Running org.apache.hadoop.hbase.io.encoding.TestEncodedSeekers
> Tests run: 1, Failures: 0, Errors: 0, Skipped: 0, Time elapsed: 42.534 sec
> - in org.apache.hadoop.hbase.regionserver.TestHRegionServerBulkLoad
> Running org.apache.hadoop.hbase.io.encoding.TestDataBlockEncoders
> Tests run: 2, Failures: 0, Errors: 0, Skipped: 0, Time elapsed: 13.711 sec
> - in org.apache.hadoop.hbase.regionserver.TestEndToEndSplitTransaction
> Running org.apache.hadoop.hbase.io.encoding.TestChangingEncoding
> Tests run: 2, Failures: 0, Errors: 0, Skipped: 0, Time elapsed: 30.442 sec
> - in org.apache.hadoop.hbase.TestRegionRebalancing
> Running org.apache.hadoop.hbase.io.encoding.TestLoadAndSwitchEncodeOnDisk
> Tests run: 91, Failures: 0, Errors: 0, Skipped: 0, Time elapsed: 103.567
> sec - in org.apache.hadoop.hbase.regionserver.TestHRegion
> Running org.apache.hadoop.hbase.io.encoding.TestBufferedDataBlockEncoder
> Tests run: 1, Failures: 0, Errors: 0, Skipped: 0, Time elapsed: 22.236 sec
> - in org.apache.hadoop.hbase.io.encoding.TestLoadAndSwitchEncodeOnDisk
> Running org.apache.hadoop.hbase.io.hfile.TestCacheOnWrite
> Tests run: 1, Failures: 0, Errors: 0, Skipped: 0, Time elapsed: 26.929 sec
> - in org.apache.hadoop.hbase.io.encoding.TestBufferedDataBlockEncoder
> Running org.apache.hadoop.hbase.io.hfile.TestCacheConfig
> Tests run: 6, Failures: 0, Errors: 0, Skipped: 0, Time elapsed: 1.656 sec
> - in org.apache.hadoop.hbase.io.hfile.TestCacheConfig
> Running org.apache.hadoop.hbase.io.hfile.TestHFileSeek
> Tests run: 1, Failures: 0, Errors: 0, Skipped: 0, Time elapsed: 1.837 sec
> - in org.apache.hadoop.hbase.io.hfile.TestHFileSeek
> Running org.apache.hadoop.hbase.io.hfile.TestHFileBlock
> Tests run: 20, Failures: 0, Errors: 0, Skipped: 0, Time elapsed: 102.083
> sec - in org.apache.hadoop.hbase.io.encoding.TestEncodedSeekers
> Running org.apache.hadoop.hbase.io.hfile.TestForceCacheImportantBlocks
> Tests run: 3, Failures: 0, Errors: 0, Skipped: 0, Time elapsed: 101.1 sec
> - in org.apache.hadoop.hbase.io.encoding.TestChangingEncoding
> Running org.apache.hadoop.hbase.io.hfile.TestScannerSelectionUsingTTL
> Tests run: 4, Failures: 0, Errors: 0, Skipped: 0, Time elapsed: 39.065 sec
> - in org.apache.hadoop.hbase.io.hfile.TestForceCacheImportantBlocks
> Running org.apache.hadoop.hbase.io.hfile.TestHFileBlockIndex
> Tests run: 4, Failures: 0, Errors: 0, Skipped: 0, Time elapsed: 2.883 sec
> - in org.apache.hadoop.hbase.io.hfile.TestHFileBlockIndex
> Running org.apache.hadoop.hbase.io.TestFileLink
> Tests run: 3, Failures: 0, Errors: 0, Skipped: 0, Time elapsed: 15.166 sec
> - in org.apache.hadoop.hbase.io.TestFileLink
> Tests run: 28, Failures: 0, Errors: 0, Skipped: 0, Time elapsed: 93.232
> sec - in org.apache.hadoop.hbase.io.hfile.TestHFileBlock
> Running org.apache.hadoop.hbase.security.access.TestAccessController
> Running org.apache.hadoop.hbase.security.access.TestTablePermissions
> Tests run: 6, Failures: 0, Errors: 0, Skipped: 0, Time elapsed: 63.067 sec
> - in org.apache.hadoop.hbase.io.hfile.TestScannerSelectionUsingTTL
> Running org.apache.hadoop.hbase.security.access.TestCellACLs
> Tests run: 7, Failures: 0, Errors: 0, Skipped: 0, Time elapsed: 31.838 sec
> - in org.apache.hadoop.hbase.security.access.TestTablePermissions
> Tests run: 2, Failures: 0, Errors: 0, Skipped: 0, Time elapsed: 9.657 sec
> - in org.apache.hadoop.hbase.security.access.TestCellACLs
> Running org.apache.hadoop.hbase.security.access.TestAccessControlFilter
> Tests run: 1, Failures: 0, Errors: 0, Skipped: 0, Time elapsed: 3.383 sec
> - in org.apache.hadoop.hbase.security.access.TestAccessControlFilter
> Running org.apache.hadoop.hbase.security.access.TestNamespaceCommands
> Running
> org.apache.hadoop.hbase.security.access.TestCellACLWithMultipleVersions
> Tests run: 7, Failures: 0, Errors: 0, Skipped: 0, Time elapsed: 11.36 sec
> - in org.apache.hadoop.hbase.security.access.TestNamespaceCommands
> Running org.apache.hadoop.hbase.security.access.TestAccessController2
> Tests run: 2, Failures: 0, Errors: 0, Skipped: 0, Time elapsed: 9.678 sec
> - in org.apache.hadoop.hbase.security.access.TestAccessController2
> Tests run: 28, Failures: 0, Errors: 0, Skipped: 0, Time elapsed: 243.75
> sec - in org.apache.hadoop.hbase.io.encoding.TestDataBlockEncoders
> Tests run: 8, Failures: 0, Errors: 0, Skipped: 0, Time elapsed: 26.929 sec
> - in org.apache.hadoop.hbase.security.access.TestCellACLWithMultipleVersions
> Running org.apache.hadoop.hbase.security.access.TestZKPermissionsWatcher
> Running org.apache.hadoop.hbase.security.access.TestScanEarlyTermination
> Tests run: 1, Failures: 0, Errors: 0, Skipped: 0, Time elapsed: 3.54 sec -
> in org.apache.hadoop.hbase.security.access.TestZKPermissionsWatcher
> Running
> org.apache.hadoop.hbase.security.visibility.TestVisibilityLablesWithGroups
> Tests run: 1, Failures: 0, Errors: 0, Skipped: 0, Time elapsed: 4.286 sec
> - in org.apache.hadoop.hbase.security.access.TestScanEarlyTermination
> Tests run: 1, Failures: 0, Errors: 0, Skipped: 0, Time elapsed: 2.581 sec
> - in
> org.apache.hadoop.hbase.security.visibility.TestVisibilityLablesWithGroups
> Running
> org.apache.hadoop.hbase.security.visibility.TestVisibilityLabelsWithDeletes
> Running
> org.apache.hadoop.hbase.security.visibility.TestVisibilityLabelsWithDefaultVisLabelService
> Running
> org.apache.hadoop.hbase.security.visibility.TestVisibilityLabelsWithCustomVisLabService
> Tests run: 19, Failures: 0, Errors: 0, Skipped: 0, Time elapsed: 15.436
> sec - in
> org.apache.hadoop.hbase.security.visibility.TestVisibilityLabelsWithCustomVisLabService
> Tests run: 23, Failures: 0, Errors: 0, Skipped: 0, Time elapsed: 17.77 sec
> - in
> org.apache.hadoop.hbase.security.visibility.TestVisibilityLabelsWithDefaultVisLabelService
> Running
> org.apache.hadoop.hbase.security.visibility.TestDefaultScanLabelGeneratorStack
> Running
> org.apache.hadoop.hbase.security.visibility.TestVisibilityWithCheckAuths
> Tests run: 1, Failures: 0, Errors: 0, Skipped: 0, Time elapsed: 2.432 sec
> - in
> org.apache.hadoop.hbase.security.visibility.TestDefaultScanLabelGeneratorStack
> Tests run: 2, Failures: 0, Errors: 0, Skipped: 0, Time elapsed: 3.929 sec
> - in
> org.apache.hadoop.hbase.security.visibility.TestVisibilityWithCheckAuths
> Running
> org.apache.hadoop.hbase.security.visibility.TestVisibilityLabelsWithDistributedLogReplay
> Running
> org.apache.hadoop.hbase.security.visibility.TestVisibilityLabelsOpWithDifferentUsersNoACL
> Tests run: 1, Failures: 0, Errors: 0, Skipped: 0, Time elapsed: 2.67 sec -
> in
> org.apache.hadoop.hbase.security.visibility.TestVisibilityLabelsOpWithDifferentUsersNoACL
> Tests run: 37, Failures: 0, Errors: 0, Skipped: 0, Time elapsed: 49.804
> sec - in
> org.apache.hadoop.hbase.security.visibility.TestVisibilityLabelsWithDeletes
> Running
> org.apache.hadoop.hbase.security.visibility.TestVisibilityLabelsWithSLGStack
> Tests run: 23, Failures: 0, Errors: 0, Skipped: 0, Time elapsed: 16.709
> sec - in
> org.apache.hadoop.hbase.security.visibility.TestVisibilityLabelsWithDistributedLogReplay
> Tests run: 1, Failures: 0, Errors: 0, Skipped: 0, Time elapsed: 2.04 sec -
> in
> org.apache.hadoop.hbase.security.visibility.TestVisibilityLabelsWithSLGStack
> Running
> org.apache.hadoop.hbase.security.visibility.TestVisibilityLabelsReplication
> Running
> org.apache.hadoop.hbase.security.visibility.TestVisibilityLabelReplicationWithExpAsString
> Running
> org.apache.hadoop.hbase.security.visibility.TestEnforcingScanLabelGenerator
> Tests run: 1, Failures: 0, Errors: 0, Skipped: 0, Time elapsed: 2.024 sec
> - in
> org.apache.hadoop.hbase.security.visibility.TestEnforcingScanLabelGenerator
> Running
> org.apache.hadoop.hbase.security.visibility.TestVisibilityLabelsWithACL
> Tests run: 1, Failures: 0, Errors: 0, Skipped: 0, Time elapsed: 17.497 sec
> - in
> org.apache.hadoop.hbase.security.visibility.TestVisibilityLabelReplicationWithExpAsString
> Tests run: 1, Failures: 0, Errors: 0, Skipped: 0, Time elapsed: 18.717 sec
> - in
> org.apache.hadoop.hbase.security.visibility.TestVisibilityLabelsReplication
> Tests run: 5, Failures: 0, Errors: 0, Skipped: 0, Time elapsed: 6.963 sec
> - in org.apache.hadoop.hbase.security.visibility.TestVisibilityLabelsWithACL
> Running org.apache.hadoop.hbase.security.token.TestZKSecretWatcher
> Running org.apache.hadoop.hbase.security.token.TestTokenAuthentication
> Tests run: 3, Failures: 0, Errors: 0, Skipped: 0, Time elapsed: 0.478 sec
> - in org.apache.hadoop.hbase.security.token.TestTokenAuthentication
> Tests run: 1, Failures: 0, Errors: 0, Skipped: 0, Time elapsed: 13.251 sec
> - in org.apache.hadoop.hbase.security.token.TestZKSecretWatcher
> Tests run: 216, Failures: 0, Errors: 0, Skipped: 0, Time elapsed: 335.406
> sec - in org.apache.hadoop.hbase.io.hfile.TestCacheOnWrite
> Tests run: 55, Failures: 0, Errors: 0, Skipped: 0, Time elapsed: 245.131
> sec - in org.apache.hadoop.hbase.security.access.TestAccessController
>
> Results :
>
> Failed tests:
>   TestEnableTableHandler.testEnableTableWithNoRegionServers:94 Waiting
> timed out after [60,000] msec
>
>
>
> Tests run: 2309, Failures: 1, Errors: 0, Skipped: 18
>
> [INFO]
> ------------------------------------------------------------------------
> [INFO] Reactor Summary:
> [INFO]
> [INFO] HBase ............................................. SUCCESS [3.013s]
> [INFO] HBase - Checkstyle ................................ SUCCESS [0.659s]
> [INFO] HBase - Annotations ............................... SUCCESS [0.825s]
> [INFO] HBase - Common .................................... SUCCESS
> [55.560s]
> [INFO] HBase - Protocol .................................. SUCCESS [9.166s]
> [INFO] HBase - Client .................................... SUCCESS
> [1:14.086s]
> [INFO] HBase - Hadoop Compatibility ...................... SUCCESS [7.142s]
> [INFO] HBase - Hadoop Two Compatibility .................. SUCCESS [6.103s]
> [INFO] HBase - Prefix Tree ............................... SUCCESS [8.169s]
> [INFO] HBase - Server .................................... FAILURE
> [1:02:31.984s]
> [INFO] HBase - Testing Util .............................. SKIPPED
> [INFO] HBase - Thrift .................................... SKIPPED
> [INFO] HBase - Rest ...................................... SKIPPED
> [INFO] HBase - Shell ..................................... SKIPPED
> [INFO] HBase - Integration Tests ......................... SKIPPED
> [INFO] HBase - Examples .................................. SKIPPED
> [INFO] HBase - Assembly .................................. SKIPPED
> [INFO]
> ------------------------------------------------------------------------
> [INFO] BUILD FAILURE
> [INFO]
> ------------------------------------------------------------------------
> [INFO] Total time: 1:05:17.490s
> [INFO] Finished at: Fri Feb 06 03:20:09 UTC 2015
> [INFO] Final Memory: 46M/444M
> [INFO]
> ------------------------------------------------------------------------
> [ERROR] Failed to execute goal
> org.apache.maven.plugins:maven-surefire-plugin:2.18:test
> (secondPartTestsExecution) on project hbase-server: There are test failures.
> [ERROR]
> [ERROR] Please refer to <
> https://builds.apache.org/job/HBase-1.0/ws/hbase-server/target/surefire-reports>
> for the individual test results.
> [ERROR] -> [Help 1]
> [ERROR]
> [ERROR] To see the full stack trace of the errors, re-run Maven with the
> -e switch.
> [ERROR] Re-run Maven using the -X switch to enable full debug logging.
> [ERROR]
> [ERROR] For more information about the errors and possible solutions,
> please read the following articles:
> [ERROR] [Help 1]
> http://cwiki.apache.org/confluence/display/MAVEN/MojoFailureException
> [ERROR]
> [ERROR] After correcting the problems, you can resume the build with the
> command
> [ERROR]   mvn <goals> -rf :hbase-server
> Build step 'Invoke top-level Maven targets' marked build as failure
> Performing Post build task...
> Match found for :.* : True
> Logical operation result is TRUE
> Running script  :   ZOMBIE_TESTS_COUNT=`jps | grep surefirebooter | wc -l`
>   if [[ $ZOMBIE_TESTS_COUNT != 0 ]] ; then
>     #It seems sometimes the tests are not dying immediately. Let's give
> them 10s
>     echo "Suspicious java process found - waiting 10s to see if there are
> just slow to stop"
>     sleep 10
>     ZOMBIE_TESTS_COUNT=`jps | grep surefirebooter | wc -l`
>     if [[ $ZOMBIE_TESTS_COUNT != 0 ]] ; then
>       echo "There are $ZOMBIE_TESTS_COUNT zombie tests, they should have
> been killed by surefire but survived"
>       echo "************ BEGIN zombies jstack extract"
>       ZB_STACK=`jps | grep surefirebooter | cut -d ' ' -f 1 | xargs -n 1
> jstack | grep ".test" | grep "\.java"`
>       jps | grep surefirebooter | cut -d ' ' -f 1 | xargs -n 1 jstack
>       echo "************ END  zombies jstack extract"
>       JIRA_COMMENT="$JIRA_COMMENT
>
>      {color:red}-1 core zombie tests{color}.  There are
> ${ZOMBIE_TESTS_COUNT} zombie test(s): ${ZB_STACK}"
>       BAD=1
>       jps | grep surefirebooter | cut -d ' ' -f 1 | xargs kill -9
>     else
>       echo "We're ok: there is no zombie test, but some tests took some
> time to stop"
>     fi
>   else
>     echo "We're ok: there is no zombie test"
>   fi
> [HBase-1.0] $ /bin/bash -xe /tmp/hudson2891383032588018222.sh
> ++ jps
> ++ grep surefirebooter
> ++ wc -l
> + ZOMBIE_TESTS_COUNT=0
> + [[ 0 != 0 ]]
> + echo 'We'\''re ok: there is no zombie test'
> We're ok: there is no zombie test
> POST BUILD TASK : SUCCESS
> END OF POST BUILD TASK : 0
> Archiving artifacts
> Sending artifact delta relative to HBase-1.0 #712
> Archived 1854 artifacts
> Archive block size is 32768
> Received 27 blocks and 402094332 bytes
> Compression is 0.2%
> Took 2 min 10 sec
> Recording test results
>

Mime
  • Unnamed multipart/alternative (inline, None, 0 bytes)
View raw message