hbase-builds mailing list archives

Site index · List index
Message view « Date » · « Thread »
Top « Date » · « Thread »
From Stack <st...@duboce.net>
Subject Re: Build failed in Jenkins: HBase-1.1 #145
Date Fri, 06 Feb 2015 02:13:00 GMT
This is TestSplitLogManager which seems unrelated and a common failure.

On Thu, Feb 5, 2015 at 6:08 PM, Apache Jenkins Server <
jenkins@builds.apache.org> wrote:

> See <https://builds.apache.org/job/HBase-1.1/145/changes>
>
> Changes:
>
> [stack] HBASE-12958 SSH doing hbase:meta get but hbase:meta not assigned;
> REAPPLY
>
> ------------------------------------------
> [...truncated 1829 lines...]
> Tests run: 1, Failures: 0, Errors: 0, Skipped: 0, Time elapsed: 3.351 sec
> - in org.apache.hadoop.hbase.replication.TestReplicationWithTags
> Tests run: 1, Failures: 0, Errors: 0, Skipped: 0, Time elapsed: 17.944 sec
> - in
> org.apache.hadoop.hbase.security.visibility.TestVisibilityLabelReplicationWithExpAsString
> Running
> org.apache.hadoop.hbase.security.visibility.TestVisibilityLabelsWithDistributedLogReplay
> Tests run: 9, Failures: 0, Errors: 0, Skipped: 0, Time elapsed: 43.921 sec
> - in org.apache.hadoop.hbase.replication.TestReplicationSmallTests
> Running
> org.apache.hadoop.hbase.security.visibility.TestVisibilityLabelsWithSLGStack
> Tests run: 1, Failures: 0, Errors: 0, Skipped: 0, Time elapsed: 1.436 sec
> - in
> org.apache.hadoop.hbase.security.visibility.TestVisibilityLabelsWithSLGStack
> Running
> org.apache.hadoop.hbase.security.visibility.TestVisibilityLabelsReplication
> Running
> org.apache.hadoop.hbase.security.visibility.TestVisibilityLabelsWithDeletes
> Tests run: 3, Failures: 0, Errors: 0, Skipped: 0, Time elapsed: 59.396 sec
> - in org.apache.hadoop.hbase.replication.TestMasterReplication
> Running
> org.apache.hadoop.hbase.security.visibility.TestEnforcingScanLabelGenerator
> Tests run: 1, Failures: 0, Errors: 0, Skipped: 0, Time elapsed: 2.284 sec
> - in
> org.apache.hadoop.hbase.security.visibility.TestEnforcingScanLabelGenerator
> Tests run: 1, Failures: 0, Errors: 0, Skipped: 0, Time elapsed: 18.038 sec
> - in
> org.apache.hadoop.hbase.security.visibility.TestVisibilityLabelsReplication
> Running
> org.apache.hadoop.hbase.security.visibility.TestDefaultScanLabelGeneratorStack
> Tests run: 1, Failures: 0, Errors: 0, Skipped: 0, Time elapsed: 1.964 sec
> - in
> org.apache.hadoop.hbase.security.visibility.TestDefaultScanLabelGeneratorStack
> Running
> org.apache.hadoop.hbase.security.visibility.TestVisibilityWithCheckAuths
> Tests run: 2, Failures: 0, Errors: 0, Skipped: 0, Time elapsed: 3.373 sec
> - in
> org.apache.hadoop.hbase.security.visibility.TestVisibilityWithCheckAuths
> Running
> org.apache.hadoop.hbase.security.visibility.TestVisibilityLabelsOpWithDifferentUsersNoACL
> Tests run: 1, Failures: 0, Errors: 0, Skipped: 0, Time elapsed: 2.693 sec
> - in
> org.apache.hadoop.hbase.security.visibility.TestVisibilityLabelsOpWithDifferentUsersNoACL
> Running
> org.apache.hadoop.hbase.security.visibility.TestVisibilityLabelsWithDefaultVisLabelService
> Running
> org.apache.hadoop.hbase.security.visibility.TestVisibilityLabelsWithACL
> Tests run: 37, Failures: 0, Errors: 0, Skipped: 0, Time elapsed: 52.661
> sec - in
> org.apache.hadoop.hbase.security.visibility.TestVisibilityLabelsWithDeletes
> Tests run: 5, Failures: 0, Errors: 0, Skipped: 0, Time elapsed: 7.551 sec
> - in org.apache.hadoop.hbase.security.visibility.TestVisibilityLabelsWithACL
> Tests run: 23, Failures: 0, Errors: 0, Skipped: 0, Time elapsed: 16.99 sec
> - in
> org.apache.hadoop.hbase.security.visibility.TestVisibilityLabelsWithDefaultVisLabelService
> Running
> org.apache.hadoop.hbase.security.visibility.TestVisibilityLablesWithGroups
> Running
> org.apache.hadoop.hbase.security.visibility.TestVisibilityLabelsWithCustomVisLabService
> Tests run: 1, Failures: 0, Errors: 0, Skipped: 0, Time elapsed: 2.627 sec
> - in
> org.apache.hadoop.hbase.security.visibility.TestVisibilityLablesWithGroups
> Running org.apache.hadoop.hbase.security.access.TestAccessController2
> Running org.apache.hadoop.hbase.security.access.TestAccessController
> Tests run: 2, Failures: 0, Errors: 0, Skipped: 0, Time elapsed: 10.326 sec
> - in org.apache.hadoop.hbase.security.access.TestAccessController2
> Tests run: 19, Failures: 0, Errors: 0, Skipped: 0, Time elapsed: 16.103
> sec - in
> org.apache.hadoop.hbase.security.visibility.TestVisibilityLabelsWithCustomVisLabService
> Running org.apache.hadoop.hbase.security.access.TestTablePermissions
> Running org.apache.hadoop.hbase.security.access.TestAccessControlFilter
> Tests run: 1, Failures: 0, Errors: 0, Skipped: 0, Time elapsed: 3.267 sec
> - in org.apache.hadoop.hbase.security.access.TestAccessControlFilter
> Tests run: 8, Failures: 0, Errors: 0, Skipped: 0, Time elapsed: 221.019
> sec - in
> org.apache.hadoop.hbase.replication.regionserver.TestReplicationWALReaderManager
> Running org.apache.hadoop.hbase.security.access.TestCellACLs
> Tests run: 2, Failures: 0, Errors: 0, Skipped: 0, Time elapsed: 9.521 sec
> - in org.apache.hadoop.hbase.security.access.TestCellACLs
> Running org.apache.hadoop.hbase.security.access.TestNamespaceCommands
> Tests run: 23, Failures: 0, Errors: 0, Skipped: 0, Time elapsed: 123.271
> sec - in
> org.apache.hadoop.hbase.security.visibility.TestVisibilityLabelsWithDistributedLogReplay
> Running org.apache.hadoop.hbase.security.access.TestZKPermissionsWatcher
> Tests run: 7, Failures: 0, Errors: 0, Skipped: 0, Time elapsed: 32.684 sec
> - in org.apache.hadoop.hbase.security.access.TestTablePermissions
> Running org.apache.hadoop.hbase.security.access.TestScanEarlyTermination
> Tests run: 1, Failures: 0, Errors: 0, Skipped: 0, Time elapsed: 3.585 sec
> - in org.apache.hadoop.hbase.security.access.TestZKPermissionsWatcher
> Tests run: 7, Failures: 0, Errors: 0, Skipped: 0, Time elapsed: 11.859 sec
> - in org.apache.hadoop.hbase.security.access.TestNamespaceCommands
> Running org.apache.hadoop.hbase.security.token.TestZKSecretWatcher
> Tests run: 1, Failures: 0, Errors: 0, Skipped: 0, Time elapsed: 4.871 sec
> - in org.apache.hadoop.hbase.security.access.TestScanEarlyTermination
> Running org.apache.hadoop.hbase.security.token.TestTokenAuthentication
> Tests run: 3, Failures: 0, Errors: 0, Skipped: 0, Time elapsed: 0.411 sec
> - in org.apache.hadoop.hbase.security.token.TestTokenAuthentication
> Running org.apache.hadoop.hbase.TestMetaTableAccessorNoCluster
> Running
> org.apache.hadoop.hbase.security.access.TestCellACLWithMultipleVersions
> Running org.apache.hadoop.hbase.TestMetaTableLocator
> Tests run: 2, Failures: 0, Errors: 0, Skipped: 0, Time elapsed: 3.302 sec
> - in org.apache.hadoop.hbase.TestMetaTableAccessorNoCluster
> Tests run: 7, Failures: 0, Errors: 0, Skipped: 0, Time elapsed: 3.333 sec
> - in org.apache.hadoop.hbase.TestMetaTableLocator
> Running org.apache.hadoop.hbase.TestHBaseTestingUtility
> Running org.apache.hadoop.hbase.TestZooKeeper
> Tests run: 1, Failures: 0, Errors: 0, Skipped: 0, Time elapsed: 13.239 sec
> - in org.apache.hadoop.hbase.security.token.TestZKSecretWatcher
> Running org.apache.hadoop.hbase.snapshot.TestSnapshotDescriptionUtils
> Tests run: 2, Failures: 0, Errors: 0, Skipped: 0, Time elapsed: 0.185 sec
> - in org.apache.hadoop.hbase.snapshot.TestSnapshotDescriptionUtils
> Tests run: 8, Failures: 0, Errors: 0, Skipped: 0, Time elapsed: 24.974 sec
> - in org.apache.hadoop.hbase.security.access.TestCellACLWithMultipleVersions
> Running org.apache.hadoop.hbase.snapshot.TestFlushSnapshotFromClient
> Running org.apache.hadoop.hbase.snapshot.TestSecureExportSnapshot
> Tests run: 7, Failures: 0, Errors: 0, Skipped: 0, Time elapsed: 36.476 sec
> - in org.apache.hadoop.hbase.TestHBaseTestingUtility
> Running org.apache.hadoop.hbase.snapshot.TestExportSnapshot
> Tests run: 9, Failures: 0, Errors: 0, Skipped: 0, Time elapsed: 38.897 sec
> - in org.apache.hadoop.hbase.snapshot.TestFlushSnapshotFromClient
> Running org.apache.hadoop.hbase.snapshot.TestRestoreFlushSnapshotFromClient
> Tests run: 5, Failures: 0, Errors: 0, Skipped: 0, Time elapsed: 50.957 sec
> - in org.apache.hadoop.hbase.snapshot.TestRestoreFlushSnapshotFromClient
> Running org.apache.hadoop.hbase.TestInfoServers
> Tests run: 3, Failures: 0, Errors: 0, Skipped: 0, Time elapsed: 1.924 sec
> - in org.apache.hadoop.hbase.TestInfoServers
> Running org.apache.hadoop.hbase.procedure.TestZKProcedureControllers
> Tests run: 4, Failures: 0, Errors: 0, Skipped: 0, Time elapsed: 1.575 sec
> - in org.apache.hadoop.hbase.procedure.TestZKProcedureControllers
> Running org.apache.hadoop.hbase.procedure.TestZKProcedure
> Tests run: 4, Failures: 0, Errors: 0, Skipped: 0, Time elapsed: 1.936 sec
> - in org.apache.hadoop.hbase.procedure.TestZKProcedure
> Running org.apache.hadoop.hbase.io.hfile.TestCacheOnWrite
> Tests run: 11, Failures: 0, Errors: 0, Skipped: 0, Time elapsed: 155.453
> sec - in org.apache.hadoop.hbase.TestZooKeeper
> Running org.apache.hadoop.hbase.io.hfile.TestForceCacheImportantBlocks
> Tests run: 55, Failures: 0, Errors: 0, Skipped: 0, Time elapsed: 245.497
> sec - in org.apache.hadoop.hbase.security.access.TestAccessController
> Running org.apache.hadoop.hbase.io.hfile.TestHFileBlock
> Tests run: 4, Failures: 0, Errors: 0, Skipped: 0, Time elapsed: 40.5 sec -
> in org.apache.hadoop.hbase.io.hfile.TestForceCacheImportantBlocks
> Running org.apache.hadoop.hbase.io.hfile.TestHFileBlockIndex
> Tests run: 4, Failures: 0, Errors: 0, Skipped: 0, Time elapsed: 3 sec - in
> org.apache.hadoop.hbase.io.hfile.TestHFileBlockIndex
> Running org.apache.hadoop.hbase.io.hfile.TestHFileSeek
> Tests run: 1, Failures: 0, Errors: 0, Skipped: 0, Time elapsed: 1.868 sec
> - in org.apache.hadoop.hbase.io.hfile.TestHFileSeek
> Running org.apache.hadoop.hbase.io.hfile.TestScannerSelectionUsingTTL
> Tests run: 6, Failures: 0, Errors: 0, Skipped: 0, Time elapsed: 63.022 sec
> - in org.apache.hadoop.hbase.io.hfile.TestScannerSelectionUsingTTL
> Tests run: 28, Failures: 0, Errors: 0, Skipped: 0, Time elapsed: 93.968
> sec - in org.apache.hadoop.hbase.io.hfile.TestHFileBlock
> Running org.apache.hadoop.hbase.io.hfile.TestCacheConfig
> Tests run: 6, Failures: 0, Errors: 0, Skipped: 0, Time elapsed: 2.238 sec
> - in org.apache.hadoop.hbase.io.hfile.TestCacheConfig
> Running org.apache.hadoop.hbase.io.encoding.TestDataBlockEncoders
> Running org.apache.hadoop.hbase.io.encoding.TestEncodedSeekers
> Tests run: 9, Failures: 0, Errors: 0, Skipped: 0, Time elapsed: 284.989
> sec - in org.apache.hadoop.hbase.snapshot.TestSecureExportSnapshot
> Running org.apache.hadoop.hbase.io.encoding.TestBufferedDataBlockEncoder
> Tests run: 1, Failures: 0, Errors: 0, Skipped: 0, Time elapsed: 24.356 sec
> - in org.apache.hadoop.hbase.io.encoding.TestBufferedDataBlockEncoder
> Tests run: 9, Failures: 0, Errors: 0, Skipped: 0, Time elapsed: 280.048
> sec - in org.apache.hadoop.hbase.snapshot.TestExportSnapshot
> Running org.apache.hadoop.hbase.io.encoding.TestLoadAndSwitchEncodeOnDisk
> Running org.apache.hadoop.hbase.io.encoding.TestChangingEncoding
> Tests run: 1, Failures: 0, Errors: 0, Skipped: 0, Time elapsed: 21.597 sec
> - in org.apache.hadoop.hbase.io.encoding.TestLoadAndSwitchEncodeOnDisk
> Running org.apache.hadoop.hbase.io.TestFileLink
> Tests run: 20, Failures: 0, Errors: 0, Skipped: 0, Time elapsed: 93.3 sec
> - in org.apache.hadoop.hbase.io.encoding.TestEncodedSeekers
> Tests run: 3, Failures: 0, Errors: 0, Skipped: 0, Time elapsed: 14.116 sec
> - in org.apache.hadoop.hbase.io.TestFileLink
> Running org.apache.hadoop.hbase.wal.TestWALFiltering
> Running org.apache.hadoop.hbase.wal.TestWALFactory
> Tests run: 9, Failures: 0, Errors: 0, Skipped: 0, Time elapsed: 15.231 sec
> - in org.apache.hadoop.hbase.wal.TestWALFactory
> Running org.apache.hadoop.hbase.wal.TestWALReaderOnSecureWAL
> Tests run: 2, Failures: 0, Errors: 0, Skipped: 0, Time elapsed: 1.66 sec -
> in org.apache.hadoop.hbase.wal.TestWALReaderOnSecureWAL
> Tests run: 1, Failures: 0, Errors: 0, Skipped: 0, Time elapsed: 23.457 sec
> - in org.apache.hadoop.hbase.wal.TestWALFiltering
> Running org.apache.hadoop.hbase.wal.TestDefaultWALProvider
> Running org.apache.hadoop.hbase.wal.TestWALSplit
> Tests run: 5, Failures: 0, Errors: 0, Skipped: 0, Time elapsed: 6.44 sec -
> in org.apache.hadoop.hbase.wal.TestDefaultWALProvider
> Running org.apache.hadoop.hbase.wal.TestSecureWAL
> Tests run: 1, Failures: 0, Errors: 0, Skipped: 0, Time elapsed: 1.258 sec
> - in org.apache.hadoop.hbase.wal.TestSecureWAL
> Running org.apache.hadoop.hbase.wal.TestDefaultWALProviderWithHLogKey
> Tests run: 5, Failures: 0, Errors: 0, Skipped: 0, Time elapsed: 6.385 sec
> - in org.apache.hadoop.hbase.wal.TestDefaultWALProviderWithHLogKey
> Running org.apache.hadoop.hbase.wal.TestBoundedRegionGroupingProvider
> Tests run: 3, Failures: 0, Errors: 0, Skipped: 0, Time elapsed: 101.413
> sec - in org.apache.hadoop.hbase.io.encoding.TestChangingEncoding
> Tests run: 5, Failures: 0, Errors: 0, Skipped: 0, Time elapsed: 18.63 sec
> - in org.apache.hadoop.hbase.wal.TestBoundedRegionGroupingProvider
> Running org.apache.hadoop.hbase.wal.TestWALSplitCompressed
> Running org.apache.hadoop.hbase.zookeeper.TestZooKeeperACL
> Tests run: 6, Failures: 0, Errors: 0, Skipped: 0, Time elapsed: 0.261 sec
> - in org.apache.hadoop.hbase.zookeeper.TestZooKeeperACL
> Running org.apache.hadoop.hbase.zookeeper.TestZKLeaderManager
> Tests run: 1, Failures: 0, Errors: 0, Skipped: 0, Time elapsed: 0.119 sec
> - in org.apache.hadoop.hbase.zookeeper.TestZKLeaderManager
> Running org.apache.hadoop.hbase.zookeeper.TestZooKeeperNodeTracker
> Tests run: 3, Failures: 0, Errors: 0, Skipped: 0, Time elapsed: 0.911 sec
> - in org.apache.hadoop.hbase.zookeeper.TestZooKeeperNodeTracker
> Running org.apache.hadoop.hbase.zookeeper.TestRecoverableZooKeeper
> Tests run: 1, Failures: 0, Errors: 0, Skipped: 0, Time elapsed: 1.227 sec
> - in org.apache.hadoop.hbase.zookeeper.TestRecoverableZooKeeper
> Running org.apache.hadoop.hbase.zookeeper.TestZKTableStateManager
> Tests run: 1, Failures: 0, Errors: 0, Skipped: 0, Time elapsed: 0.683 sec
> - in org.apache.hadoop.hbase.zookeeper.TestZKTableStateManager
> Running org.apache.hadoop.hbase.zookeeper.TestZKMulti
> Tests run: 8, Failures: 0, Errors: 0, Skipped: 0, Time elapsed: 0.557 sec
> - in org.apache.hadoop.hbase.zookeeper.TestZKMulti
> Running
> org.apache.hadoop.hbase.zookeeper.lock.TestZKInterProcessReadWriteLock
> Tests run: 6, Failures: 0, Errors: 0, Skipped: 0, Time elapsed: 24.436 sec
> - in org.apache.hadoop.hbase.zookeeper.lock.TestZKInterProcessReadWriteLock
> Running org.apache.hadoop.hbase.zookeeper.TestHQuorumPeer
> Tests run: 216, Failures: 0, Errors: 0, Skipped: 0, Time elapsed: 350.686
> sec - in org.apache.hadoop.hbase.io.hfile.TestCacheOnWrite
> Tests run: 3, Failures: 0, Errors: 0, Skipped: 0, Time elapsed: 1.295 sec
> - in org.apache.hadoop.hbase.zookeeper.TestHQuorumPeer
> Running org.apache.hadoop.hbase.TestIOFencing
> Running org.apache.hadoop.hbase.constraint.TestConstraint
> Tests run: 5, Failures: 0, Errors: 0, Skipped: 0, Time elapsed: 6.428 sec
> - in org.apache.hadoop.hbase.constraint.TestConstraint
> Running org.apache.hadoop.hbase.backup.TestHFileArchiving
> Tests run: 28, Failures: 0, Errors: 0, Skipped: 0, Time elapsed: 242.933
> sec - in org.apache.hadoop.hbase.io.encoding.TestDataBlockEncoders
> Running
> org.apache.hadoop.hbase.backup.example.TestZooKeeperTableArchiveClient
> Tests run: 3, Failures: 0, Errors: 0, Skipped: 0, Time elapsed: 4.279 sec
> - in org.apache.hadoop.hbase.backup.example.TestZooKeeperTableArchiveClient
> Running org.apache.hadoop.hbase.TestHColumnDescriptorDefaultVersions
> Tests run: 3, Failures: 0, Errors: 0, Skipped: 0, Time elapsed: 12.496 sec
> - in org.apache.hadoop.hbase.TestHColumnDescriptorDefaultVersions
> Running org.apache.hadoop.hbase.ipc.TestProtoBufRpc
> Tests run: 1, Failures: 0, Errors: 0, Skipped: 0, Time elapsed: 1.555 sec
> - in org.apache.hadoop.hbase.ipc.TestProtoBufRpc
> Running org.apache.hadoop.hbase.ipc.TestDelayedRpc
> Tests run: 5, Failures: 0, Errors: 0, Skipped: 0, Time elapsed: 36.437 sec
> - in org.apache.hadoop.hbase.backup.TestHFileArchiving
> Tests run: 4, Failures: 0, Errors: 0, Skipped: 0, Time elapsed: 3.546 sec
> - in org.apache.hadoop.hbase.ipc.TestDelayedRpc
> Running org.apache.hadoop.hbase.ipc.TestHBaseClient
> Tests run: 1, Failures: 0, Errors: 0, Skipped: 0, Time elapsed: 0.376 sec
> - in org.apache.hadoop.hbase.ipc.TestHBaseClient
> Running org.apache.hadoop.hbase.TestNamespace
> Tests run: 9, Failures: 0, Errors: 0, Skipped: 1, Time elapsed: 6.969 sec
> - in org.apache.hadoop.hbase.TestNamespace
> Tests run: 31, Failures: 0, Errors: 0, Skipped: 0, Time elapsed: 178.969
> sec - in org.apache.hadoop.hbase.wal.TestWALSplit
> Tests run: 31, Failures: 0, Errors: 0, Skipped: 0, Time elapsed: 189.176
> sec - in org.apache.hadoop.hbase.wal.TestWALSplitCompressed
> Tests run: 2, Failures: 0, Errors: 0, Skipped: 0, Time elapsed: 206.298
> sec - in org.apache.hadoop.hbase.TestIOFencing
>
> Results :
>
> Failed tests:
>
> TestSplitLogManager.testUnassignedTimeout:490->waitForCounter:241->waitForCounter:248
> Waiting timed out after [6,200] msec
>
>
>
> Tests run: 2364, Failures: 1, Errors: 0, Skipped: 18
>
> [INFO]
> ------------------------------------------------------------------------
> [INFO] Reactor Summary:
> [INFO]
> [INFO] HBase ............................................. SUCCESS [3.207s]
> [INFO] HBase - Checkstyle ................................ SUCCESS [0.662s]
> [INFO] HBase - Annotations ............................... SUCCESS [0.817s]
> [INFO] HBase - Common .................................... SUCCESS
> [1:49.473s]
> [INFO] HBase - Protocol .................................. SUCCESS [9.115s]
> [INFO] HBase - Client .................................... SUCCESS
> [1:14.721s]
> [INFO] HBase - Hadoop Compatibility ...................... SUCCESS [6.953s]
> [INFO] HBase - Hadoop Two Compatibility .................. SUCCESS [6.087s]
> [INFO] HBase - Prefix Tree ............................... SUCCESS [8.362s]
> [INFO] HBase - Server .................................... FAILURE
> [1:05:10.876s]
> [INFO] HBase - Testing Util .............................. SKIPPED
> [INFO] HBase - Thrift .................................... SKIPPED
> [INFO] HBase - Rest ...................................... SKIPPED
> [INFO] HBase - Shell ..................................... SKIPPED
> [INFO] HBase - Integration Tests ......................... SKIPPED
> [INFO] HBase - Examples .................................. SKIPPED
> [INFO] HBase - Assembly .................................. SKIPPED
> [INFO]
> ------------------------------------------------------------------------
> [INFO] BUILD FAILURE
> [INFO]
> ------------------------------------------------------------------------
> [INFO] Total time: 1:08:51.065s
> [INFO] Finished at: Fri Feb 06 02:06:03 UTC 2015
> [INFO] Final Memory: 46M/872M
> [INFO]
> ------------------------------------------------------------------------
> [ERROR] Failed to execute goal
> org.apache.maven.plugins:maven-surefire-plugin:2.18:test
> (secondPartTestsExecution) on project hbase-server: There are test failures.
> [ERROR]
> [ERROR] Please refer to <
> https://builds.apache.org/job/HBase-1.1/ws/hbase-server/target/surefire-reports>
> for the individual test results.
> [ERROR] -> [Help 1]
> [ERROR]
> [ERROR] To see the full stack trace of the errors, re-run Maven with the
> -e switch.
> [ERROR] Re-run Maven using the -X switch to enable full debug logging.
> [ERROR]
> [ERROR] For more information about the errors and possible solutions,
> please read the following articles:
> [ERROR] [Help 1]
> http://cwiki.apache.org/confluence/display/MAVEN/MojoFailureException
> [ERROR]
> [ERROR] After correcting the problems, you can resume the build with the
> command
> [ERROR]   mvn <goals> -rf :hbase-server
> Build step 'Invoke top-level Maven targets' marked build as failure
> Performing Post build task...
> Match found for :.* : True
> Logical operation result is TRUE
> Running script  :   ZOMBIE_TESTS_COUNT=`jps | grep surefirebooter | wc -l`
>   if [[ $ZOMBIE_TESTS_COUNT != 0 ]] ; then
>     #It seems sometimes the tests are not dying immediately. Let's give
> them 10s
>     echo "Suspicious java process found - waiting 10s to see if there are
> just slow to stop"
>     sleep 10
>     ZOMBIE_TESTS_COUNT=`jps | grep surefirebooter | wc -l`
>     if [[ $ZOMBIE_TESTS_COUNT != 0 ]] ; then
>       echo "There are $ZOMBIE_TESTS_COUNT zombie tests, they should have
> been killed by surefire but survived"
>       echo "************ BEGIN zombies jstack extract"
>       ZB_STACK=`jps | grep surefirebooter | cut -d ' ' -f 1 | xargs -n 1
> jstack | grep ".test" | grep "\.java"`
>       jps | grep surefirebooter | cut -d ' ' -f 1 | xargs -n 1 jstack
>       echo "************ END  zombies jstack extract"
>       JIRA_COMMENT="$JIRA_COMMENT
>
>      {color:red}-1 core zombie tests{color}.  There are
> ${ZOMBIE_TESTS_COUNT} zombie test(s): ${ZB_STACK}"
>       BAD=1
>       jps | grep surefirebooter | cut -d ' ' -f 1 | xargs kill -9
>     else
>       echo "We're ok: there is no zombie test, but some tests took some
> time to stop"
>     fi
>   else
>     echo "We're ok: there is no zombie test"
>   fi
> [HBase-1.1] $ /bin/bash -xe /tmp/hudson1876035079707337666.sh
> ++ jps
> ++ grep surefirebooter
> ++ wc -l
> + ZOMBIE_TESTS_COUNT=0
> + [[ 0 != 0 ]]
> + echo 'We'\''re ok: there is no zombie test'
> We're ok: there is no zombie test
> POST BUILD TASK : SUCCESS
> END OF POST BUILD TASK : 0
> Archiving artifacts
> Sending artifact delta relative to HBase-1.1 #140
> Archived 1869 artifacts
> Archive block size is 32768
> Received 27 blocks and 422094051 bytes
> Compression is 0.2%
> Took 2 min 15 sec
> Recording test results
> Updating HBASE-12958
>

Mime
  • Unnamed multipart/alternative (inline, None, 0 bytes)
View raw message