hbase-builds mailing list archives

Site index · List index
Message view « Date » · « Thread »
Top « Date » · « Thread »
From Apache Jenkins Server <jenk...@builds.apache.org>
Subject Build failed in Jenkins: HBase-1.1 #266
Date Tue, 10 Mar 2015 05:34:04 GMT
See <https://builds.apache.org/job/HBase-1.1/266/changes>

Changes:

[zhangduo] HBASE-12405 WAL accounting by Store

------------------------------------------
[...truncated 60 lines...]
[INFO]                                                                         
[INFO] ------------------------------------------------------------------------
[INFO] Building HBase 1.1.0-SNAPSHOT
[INFO] ------------------------------------------------------------------------
Downloading: https://repository.apache.org/content/repositories/releases/org/jmock/jmock-junit4/2.6.0/jmock-junit4-2.6.0.pom

[WARNING] Failed to create parent directories for resolution tracking file /home/jenkins/.m2/repository/org/jmock/jmock-junit4/2.6.0/jmock-junit4-2.6.0.pom.lastUpdated
Downloading: http://download.java.net/maven/2/org/jmock/jmock-junit4/2.6.0/jmock-junit4-2.6.0.pom

[WARNING] Failed to create parent directories for resolution tracking file /home/jenkins/.m2/repository/org/jmock/jmock-junit4/2.6.0/jmock-junit4-2.6.0.pom.lastUpdated
Downloading: http://repository.codehaus.org/org/jmock/jmock-junit4/2.6.0/jmock-junit4-2.6.0.pom

[WARNING] Failed to create parent directories for resolution tracking file /home/jenkins/.m2/repository/org/jmock/jmock-junit4/2.6.0/jmock-junit4-2.6.0.pom.lastUpdated
Downloading: http://repository.jboss.org/nexus/content/groups/public-jboss/org/jmock/jmock-junit4/2.6.0/jmock-junit4-2.6.0.pom

[WARNING] Failed to create parent directories for resolution tracking file /home/jenkins/.m2/repository/org/jmock/jmock-junit4/2.6.0/jmock-junit4-2.6.0.pom.lastUpdated
Downloading: http://people.apache.org/~garyh/mvn/org/jmock/jmock-junit4/2.6.0/jmock-junit4-2.6.0.pom

[WARNING] Failed to create parent directories for resolution tracking file /home/jenkins/.m2/repository/org/jmock/jmock-junit4/2.6.0/jmock-junit4-2.6.0.pom.lastUpdated
Downloading: http://repo1.maven.org/maven2/org/jmock/jmock-junit4/2.6.0/jmock-junit4-2.6.0.pom

[WARNING] Failed to create parent directories for resolution tracking file /home/jenkins/.m2/repository/org/jmock/jmock-junit4/2.6.0/jmock-junit4-2.6.0.pom.lastUpdated
[INFO] ------------------------------------------------------------------------
[INFO] Reactor Summary:
[INFO] 
[INFO] HBase ............................................. FAILURE [13.160s]
[INFO] HBase - Checkstyle ................................ SKIPPED
[INFO] HBase - Annotations ............................... SKIPPED
[INFO] HBase - Common .................................... SKIPPED
[INFO] HBase - Protocol .................................. SKIPPED
[INFO] HBase - Client .................................... SKIPPED
[INFO] HBase - Hadoop Compatibility ...................... SKIPPED
[INFO] HBase - Hadoop Two Compatibility .................. SKIPPED
[INFO] HBase - Prefix Tree ............................... SKIPPED
[INFO] HBase - Server .................................... SKIPPED
[INFO] HBase - Testing Util .............................. SKIPPED
[INFO] HBase - Thrift .................................... SKIPPED
[INFO] HBase - Rest ...................................... SKIPPED
[INFO] HBase - Shell ..................................... SKIPPED
[INFO] HBase - Integration Tests ......................... SKIPPED
[INFO] HBase - Examples .................................. SKIPPED
[INFO] HBase - Assembly .................................. SKIPPED
[INFO] ------------------------------------------------------------------------
[INFO] BUILD FAILURE
[INFO] ------------------------------------------------------------------------
[INFO] Total time: 15.370s
[INFO] Finished at: Tue Mar 10 05:32:43 UTC 2015
[INFO] Final Memory: 16M/723M
[INFO] ------------------------------------------------------------------------
[ERROR] Failed to execute goal on project hbase: Could not resolve dependencies for project
org.apache.hbase:hbase:pom:1.1.0-SNAPSHOT: Failed to collect dependencies for [com.github.stephenc.findbugs:findbugs-annotations:jar:1.3.9-1
(compile), log4j:log4j:jar:1.2.17 (compile), junit:junit:jar:4.11 (compile), org.mockito:mockito-all:jar:1.10.8
(test), org.jmock:jmock-junit4:jar:2.6.0 (test)]: Failed to read artifact descriptor for org.jmock:jmock-junit4:jar:2.6.0:
Could not transfer artifact org.jmock:jmock-junit4:pom:2.6.0 from/to repository.jboss.org
(http://repository.jboss.org/nexus/content/groups/public-jboss/): Specified destination directory
cannot be created: /home/jenkins/.m2/repository/org/jmock/jmock-junit4/2.6.0 -> [Help 1]
[ERROR] 
[ERROR] To see the full stack trace of the errors, re-run Maven with the -e switch.
[ERROR] Re-run Maven using the -X switch to enable full debug logging.
[ERROR] 
[ERROR] For more information about the errors and possible solutions, please read the following
articles:
[ERROR] [Help 1] http://cwiki.apache.org/confluence/display/MAVEN/DependencyResolutionException
Build step 'Invoke top-level Maven targets' marked build as failure
Performing Post build task...
Match found for :.* : True
Logical operation result is TRUE
Running script  :   ZOMBIE_TESTS_COUNT=`jps | grep surefirebooter | wc -l`
  if [[ $ZOMBIE_TESTS_COUNT != 0 ]] ; then
    #It seems sometimes the tests are not dying immediately. Let's give them 10s
    echo "Suspicious java process found - waiting 10s to see if there are just slow to stop"
    sleep 10   
    ZOMBIE_TESTS_COUNT=`jps | grep surefirebooter | wc -l`
    if [[ $ZOMBIE_TESTS_COUNT != 0 ]] ; then
      echo "There are $ZOMBIE_TESTS_COUNT zombie tests, they should have been killed by surefire
but survived"
      echo "************ BEGIN zombies jstack extract"
      ZB_STACK=`jps | grep surefirebooter | cut -d ' ' -f 1 | xargs -n 1 jstack | grep ".test"
| grep "\.java"`
      jps | grep surefirebooter | cut -d ' ' -f 1 | xargs -n 1 jstack
      echo "************ END  zombies jstack extract"
      JIRA_COMMENT="$JIRA_COMMENT

     {color:red}-1 core zombie tests{color}.  There are ${ZOMBIE_TESTS_COUNT} zombie test(s):
${ZB_STACK}"
      BAD=1
      jps | grep surefirebooter | cut -d ' ' -f 1 | xargs kill -9
    else
      echo "We're ok: there is no zombie test, but some tests took some time to stop"
    fi
  else
    echo "We're ok: there is no zombie test"
  fi
[HBase-1.1] $ /bin/bash -xe /tmp/hudson2922547212806784747.sh
++ jps
++ grep surefirebooter
++ wc -l
+ ZOMBIE_TESTS_COUNT=1
+ [[ 1 != 0 ]]
+ echo 'Suspicious java process found - waiting 10s to see if there are just slow to stop'
Suspicious java process found - waiting 10s to see if there are just slow to stop
+ sleep 10
++ jps
++ grep surefirebooter
++ wc -l
+ ZOMBIE_TESTS_COUNT=1
+ [[ 1 != 0 ]]
+ echo 'There are 1 zombie tests, they should have been killed by surefire but survived'
There are 1 zombie tests, they should have been killed by surefire but survived
+ echo '************ BEGIN zombies jstack extract'
************ BEGIN zombies jstack extract
++ jps
++ grep surefirebooter
++ xargs -n 1 jstack
++ cut -d ' ' -f 1
++ grep .test
++ grep '\.java'
+ ZB_STACK='	at org.apache.activemq.broker.scheduler.KahaDBSchedulerIndexRebuildTest.testIndexRebuilds(KahaDBSchedulerIndexRebuildTest.java:83)'
+ jps
+ grep surefirebooter
+ cut -d ' ' -f 1
+ xargs -n 1 jstack
2015-03-10 05:32:56
Full thread dump Java HotSpot(TM) Server VM (23.25-b01 mixed mode):

"Attach Listener" daemon prio=10 tid=0xcbb00800 nid=0x2b2b waiting on condition [0x00000000]
   java.lang.Thread.State: RUNNABLE

"ActiveMQ Journal Checkpoint Worker" daemon prio=10 tid=0xcaa6e800 nid=0x25e3 waiting on condition
[0xc9afe000]
   java.lang.Thread.State: TIMED_WAITING (sleeping)
	at java.lang.Thread.sleep(Native Method)
	at org.apache.activemq.store.kahadb.AbstractKahaDBStore$2.run(AbstractKahaDBStore.java:691)

"KahaDB Scheduler" daemon prio=10 tid=0xcaa6e000 nid=0x25e2 in Object.wait() [0xc94fe000]
   java.lang.Thread.State: TIMED_WAITING (on object monitor)
	at java.lang.Object.wait(Native Method)
	- waiting on <0xd44bf778> (a java.util.TaskQueue)
	at java.util.TimerThread.mainLoop(Timer.java:552)
	- locked <0xd44bf778> (a java.util.TaskQueue)
	at java.util.TimerThread.run(Timer.java:505)

"Service Thread" daemon prio=10 tid=0xcbff7800 nid=0x25d1 runnable [0x00000000]
   java.lang.Thread.State: RUNNABLE

"C2 CompilerThread1" daemon prio=10 tid=0xcbff5c00 nid=0x25d0 waiting on condition [0x00000000]
   java.lang.Thread.State: RUNNABLE

"C2 CompilerThread0" daemon prio=10 tid=0xcbff3c00 nid=0x25cf waiting on condition [0x00000000]
   java.lang.Thread.State: RUNNABLE

"Signal Dispatcher" daemon prio=10 tid=0xcbff2000 nid=0x25ce runnable [0x00000000]
   java.lang.Thread.State: RUNNABLE

"Finalizer" daemon prio=10 tid=0xcbfb7000 nid=0x25cd in Object.wait() [0xcec7d000]
   java.lang.Thread.State: WAITING (on object monitor)
	at java.lang.Object.wait(Native Method)
	- waiting on <0xd43d4b98> (a java.lang.ref.ReferenceQueue$Lock)
	at java.lang.ref.ReferenceQueue.remove(ReferenceQueue.java:135)
	- locked <0xd43d4b98> (a java.lang.ref.ReferenceQueue$Lock)
	at java.lang.ref.ReferenceQueue.remove(ReferenceQueue.java:151)
	at java.lang.ref.Finalizer$FinalizerThread.run(Finalizer.java:189)

"Reference Handler" daemon prio=10 tid=0xcbfb5400 nid=0x25cc in Object.wait() [0xcee7d000]
   java.lang.Thread.State: WAITING (on object monitor)
	at java.lang.Object.wait(Native Method)
	- waiting on <0xd43d4870> (a java.lang.ref.Reference$Lock)
	at java.lang.Object.wait(Object.java:503)
	at java.lang.ref.Reference$ReferenceHandler.run(Reference.java:133)
	- locked <0xd43d4870> (a java.lang.ref.Reference$Lock)

"main" prio=10 tid=0xf6706800 nid=0x25bd waiting on condition [0xf689a000]
   java.lang.Thread.State: TIMED_WAITING (sleeping)
	at java.lang.Thread.sleep(Native Method)
	at org.apache.activemq.store.SharedFileLocker.doStart(SharedFileLocker.java:65)
	at org.apache.activemq.util.ServiceSupport.start(ServiceSupport.java:55)
	at org.apache.activemq.broker.LockableServiceSupport.preStart(LockableServiceSupport.java:94)
	at org.apache.activemq.util.ServiceSupport.start(ServiceSupport.java:54)
	at org.apache.activemq.broker.BrokerService.setJobSchedulerStore(BrokerService.java:1938)
	at org.apache.activemq.broker.scheduler.KahaDBSchedulerIndexRebuildTest.createBroker(KahaDBSchedulerIndexRebuildTest.java:188)
	at org.apache.activemq.broker.scheduler.KahaDBSchedulerIndexRebuildTest.testIndexRebuilds(KahaDBSchedulerIndexRebuildTest.java:83)
	at sun.reflect.NativeMethodAccessorImpl.invoke0(Native Method)
	at sun.reflect.NativeMethodAccessorImpl.invoke(NativeMethodAccessorImpl.java:57)
	at sun.reflect.DelegatingMethodAccessorImpl.invoke(DelegatingMethodAccessorImpl.java:43)
	at java.lang.reflect.Method.invoke(Method.java:606)
	at org.junit.runners.model.FrameworkMethod$1.runReflectiveCall(FrameworkMethod.java:47)
	at org.junit.internal.runners.model.ReflectiveCallable.run(ReflectiveCallable.java:12)
	at org.junit.runners.model.FrameworkMethod.invokeExplosively(FrameworkMethod.java:44)
	at org.junit.internal.runners.statements.InvokeMethod.evaluate(InvokeMethod.java:17)
	at org.junit.internal.runners.statements.RunBefores.evaluate(RunBefores.java:26)
	at org.junit.internal.runners.statements.RunAfters.evaluate(RunAfters.java:27)
	at org.junit.runners.ParentRunner.runLeaf(ParentRunner.java:271)
	at org.junit.runners.BlockJUnit4ClassRunner.runChild(BlockJUnit4ClassRunner.java:70)
	at org.junit.runners.BlockJUnit4ClassRunner.runChild(BlockJUnit4ClassRunner.java:50)
	at org.junit.runners.ParentRunner$3.run(ParentRunner.java:238)
	at org.junit.runners.ParentRunner$1.schedule(ParentRunner.java:63)
	at org.junit.runners.ParentRunner.runChildren(ParentRunner.java:236)
	at org.junit.runners.ParentRunner.access$000(ParentRunner.java:53)
	at org.junit.runners.ParentRunner$2.evaluate(ParentRunner.java:229)
	at org.junit.runners.ParentRunner.run(ParentRunner.java:309)
	at org.apache.maven.surefire.junit4.JUnit4Provider.execute(JUnit4Provider.java:264)
	at org.apache.maven.surefire.junit4.JUnit4Provider.executeTestSet(JUnit4Provider.java:153)
	at org.apache.maven.surefire.junit4.JUnit4Provider.invoke(JUnit4Provider.java:124)
	at org.apache.maven.surefire.booter.ForkedBooter.invokeProviderInSameClassLoader(ForkedBooter.java:200)
	at org.apache.maven.surefire.booter.ForkedBooter.runSuitesInProcess(ForkedBooter.java:153)
	at org.apache.maven.surefire.booter.ForkedBooter.main(ForkedBooter.java:103)

"VM Thread" prio=10 tid=0xcbef8800 nid=0x25cb runnable 

"GC task thread#0 (ParallelGC)" prio=10 tid=0xf6710800 nid=0x25be runnable 

"GC task thread#1 (ParallelGC)" prio=10 tid=0xf6712000 nid=0x25bf runnable 

"GC task thread#2 (ParallelGC)" prio=10 tid=0xf6713400 nid=0x25c0 runnable 

"GC task thread#3 (ParallelGC)" prio=10 tid=0xf6714c00 nid=0x25c1 runnable 

"GC task thread#4 (ParallelGC)" prio=10 tid=0xf6716400 nid=0x25c2 runnable 

"GC task thread#5 (ParallelGC)" prio=10 tid=0xf6717800 nid=0x25c3 runnable 

"GC task thread#6 (ParallelGC)" prio=10 tid=0xf6719000 nid=0x25c4 runnable 

"GC task thread#7 (ParallelGC)" prio=10 tid=0xf671a800 nid=0x25c5 runnable 

"GC task thread#8 (ParallelGC)" prio=10 tid=0xf671c000 nid=0x25c6 runnable 

"GC task thread#9 (ParallelGC)" prio=10 tid=0xf671d400 nid=0x25c7 runnable 

"GC task thread#10 (ParallelGC)" prio=10 tid=0xf671ec00 nid=0x25c8 runnable 

"GC task thread#11 (ParallelGC)" prio=10 tid=0xf6720400 nid=0x25c9 runnable 

"GC task thread#12 (ParallelGC)" prio=10 tid=0xf6721800 nid=0x25ca runnable 

"VM Periodic Task Thread" prio=10 tid=0xcbff9400 nid=0x25d2 waiting on condition 

JNI global references: 166

+ echo '************ END  zombies jstack extract'
************ END  zombies jstack extract
+ JIRA_COMMENT='

     {color:red}-1 core zombie tests{color}.  There are 1 zombie test(s): 	at org.apache.activemq.broker.scheduler.KahaDBSchedulerIndexRebuildTest.testIndexRebuilds(KahaDBSchedulerIndexRebuildTest.java:83)'
+ BAD=1
+ jps
+ grep surefirebooter
+ cut -d ' ' -f 1
+ xargs kill -9
POST BUILD TASK : SUCCESS
END OF POST BUILD TASK : 0
Archiving artifacts
Sending artifact delta relative to HBase-1.1 #264
Archived 13 artifacts
Archive block size is 32768
Received 3 blocks and 47083 bytes
Compression is 67.6%
Took 1 min 6 sec
Recording test results
Updating HBASE-12405

Mime
View raw message