hbase-builds mailing list archives

Site index · List index
Message view « Date » · « Thread »
Top « Date » · « Thread »
From Apache Jenkins Server <jenk...@builds.apache.org>
Subject Build failed in Jenkins: HBase-1.1 #267
Date Tue, 10 Mar 2015 05:42:16 GMT
See <https://builds.apache.org/job/HBase-1.1/267/>

------------------------------------------
Started by user zhangduo
Building remotely on ubuntu-4 (docker Ubuntu ubuntu4 ubuntu) in workspace <https://builds.apache.org/job/HBase-1.1/ws/>
 > git rev-parse --is-inside-work-tree # timeout=10
Fetching changes from the remote Git repository
 > git config remote.origin.url https://git-wip-us.apache.org/repos/asf/hbase.git # timeout=10
Cleaning workspace
 > git rev-parse --verify HEAD # timeout=10
Resetting working tree
 > git reset --hard # timeout=10
 > git clean -fdx # timeout=10
Fetching upstream changes from https://git-wip-us.apache.org/repos/asf/hbase.git
 > git --version # timeout=10
 > git fetch --tags --progress https://git-wip-us.apache.org/repos/asf/hbase.git +refs/heads/*:refs/remotes/origin/*
 > git rev-parse refs/remotes/origin/branch-1^{commit} # timeout=10
 > git rev-parse refs/remotes/origin/origin/branch-1^{commit} # timeout=10
Checking out Revision 5ff108d0e1b7545fb3956ceab926040a2e002ff8 (refs/remotes/origin/branch-1)
 > git config core.sparsecheckout # timeout=10
 > git checkout -f 5ff108d0e1b7545fb3956ceab926040a2e002ff8
 > git rev-list 5ff108d0e1b7545fb3956ceab926040a2e002ff8 # timeout=10
[HBase-1.1] $ /bin/bash -xe /tmp/hudson7464105896518951358.sh
+ ulimit -a
core file size          (blocks, -c) 0
data seg size           (kbytes, -d) unlimited
scheduling priority             (-e) 0
file size               (blocks, -f) unlimited
pending signals                 (-i) 386178
max locked memory       (kbytes, -l) 64
max memory size         (kbytes, -m) unlimited
open files                      (-n) 60000
pipe size            (512 bytes, -p) 8
POSIX message queues     (bytes, -q) 819200
real-time priority              (-r) 0
stack size              (kbytes, -s) 8192
cpu time               (seconds, -t) unlimited
max user processes              (-u) 10240
virtual memory          (kbytes, -v) unlimited
file locks                      (-x) unlimited
+ rm -rf /tmp/hbase-jenkins/hbase
[HBase-1.1] $ /home/jenkins/jenkins-slave/tools/hudson.tasks.Maven_MavenInstallation/Maven_3.0.3/bin/mvn
-PrunAllTests -DreuseForks=false install -Dmaven.test.redirectTestOutputToFile=true -Dit.test=noItTest
[INFO] Scanning for projects...
[INFO] ------------------------------------------------------------------------
[INFO] Reactor Build Order:
[INFO] 
[INFO] HBase
[INFO] HBase - Checkstyle
[INFO] HBase - Annotations
[INFO] HBase - Common
[INFO] HBase - Protocol
[INFO] HBase - Client
[INFO] HBase - Hadoop Compatibility
[INFO] HBase - Hadoop Two Compatibility
[INFO] HBase - Prefix Tree
[INFO] HBase - Server
[INFO] HBase - Testing Util
[INFO] HBase - Thrift
[INFO] HBase - Rest
[INFO] HBase - Shell
[INFO] HBase - Integration Tests
[INFO] HBase - Examples
[INFO] HBase - Assembly
[INFO]                                                                         
[INFO] ------------------------------------------------------------------------
[INFO] Building HBase 1.1.0-SNAPSHOT
[INFO] ------------------------------------------------------------------------
Downloading: https://repository.apache.org/content/repositories/releases/org/jmock/jmock-junit4/2.6.0/jmock-junit4-2.6.0.pom

[WARNING] Failed to create parent directories for resolution tracking file /home/jenkins/.m2/repository/org/jmock/jmock-junit4/2.6.0/jmock-junit4-2.6.0.pom.lastUpdated
Downloading: http://download.java.net/maven/2/org/jmock/jmock-junit4/2.6.0/jmock-junit4-2.6.0.pom

[WARNING] Failed to create parent directories for resolution tracking file /home/jenkins/.m2/repository/org/jmock/jmock-junit4/2.6.0/jmock-junit4-2.6.0.pom.lastUpdated
Downloading: http://repository.codehaus.org/org/jmock/jmock-junit4/2.6.0/jmock-junit4-2.6.0.pom

[WARNING] Failed to create parent directories for resolution tracking file /home/jenkins/.m2/repository/org/jmock/jmock-junit4/2.6.0/jmock-junit4-2.6.0.pom.lastUpdated
Downloading: http://repository.jboss.org/nexus/content/groups/public-jboss/org/jmock/jmock-junit4/2.6.0/jmock-junit4-2.6.0.pom

[WARNING] Failed to create parent directories for resolution tracking file /home/jenkins/.m2/repository/org/jmock/jmock-junit4/2.6.0/jmock-junit4-2.6.0.pom.lastUpdated
Downloading: http://people.apache.org/~garyh/mvn/org/jmock/jmock-junit4/2.6.0/jmock-junit4-2.6.0.pom

[WARNING] Failed to create parent directories for resolution tracking file /home/jenkins/.m2/repository/org/jmock/jmock-junit4/2.6.0/jmock-junit4-2.6.0.pom.lastUpdated
Downloading: http://repo1.maven.org/maven2/org/jmock/jmock-junit4/2.6.0/jmock-junit4-2.6.0.pom

[WARNING] Failed to create parent directories for resolution tracking file /home/jenkins/.m2/repository/org/jmock/jmock-junit4/2.6.0/jmock-junit4-2.6.0.pom.lastUpdated
[INFO] ------------------------------------------------------------------------
[INFO] Reactor Summary:
[INFO] 
[INFO] HBase ............................................. FAILURE [15.227s]
[INFO] HBase - Checkstyle ................................ SKIPPED
[INFO] HBase - Annotations ............................... SKIPPED
[INFO] HBase - Common .................................... SKIPPED
[INFO] HBase - Protocol .................................. SKIPPED
[INFO] HBase - Client .................................... SKIPPED
[INFO] HBase - Hadoop Compatibility ...................... SKIPPED
[INFO] HBase - Hadoop Two Compatibility .................. SKIPPED
[INFO] HBase - Prefix Tree ............................... SKIPPED
[INFO] HBase - Server .................................... SKIPPED
[INFO] HBase - Testing Util .............................. SKIPPED
[INFO] HBase - Thrift .................................... SKIPPED
[INFO] HBase - Rest ...................................... SKIPPED
[INFO] HBase - Shell ..................................... SKIPPED
[INFO] HBase - Integration Tests ......................... SKIPPED
[INFO] HBase - Examples .................................. SKIPPED
[INFO] HBase - Assembly .................................. SKIPPED
[INFO] ------------------------------------------------------------------------
[INFO] BUILD FAILURE
[INFO] ------------------------------------------------------------------------
[INFO] Total time: 17.123s
[INFO] Finished at: Tue Mar 10 05:42:12 UTC 2015
[INFO] Final Memory: 16M/723M
[INFO] ------------------------------------------------------------------------
[ERROR] Failed to execute goal on project hbase: Could not resolve dependencies for project
org.apache.hbase:hbase:pom:1.1.0-SNAPSHOT: Failed to collect dependencies for [com.github.stephenc.findbugs:findbugs-annotations:jar:1.3.9-1
(compile), log4j:log4j:jar:1.2.17 (compile), junit:junit:jar:4.11 (compile), org.mockito:mockito-all:jar:1.10.8
(test), org.jmock:jmock-junit4:jar:2.6.0 (test)]: Failed to read artifact descriptor for org.jmock:jmock-junit4:jar:2.6.0:
Could not transfer artifact org.jmock:jmock-junit4:pom:2.6.0 from/to repository.jboss.org
(http://repository.jboss.org/nexus/content/groups/public-jboss/): Specified destination directory
cannot be created: /home/jenkins/.m2/repository/org/jmock/jmock-junit4/2.6.0 -> [Help 1]
[ERROR] 
[ERROR] To see the full stack trace of the errors, re-run Maven with the -e switch.
[ERROR] Re-run Maven using the -X switch to enable full debug logging.
[ERROR] 
[ERROR] For more information about the errors and possible solutions, please read the following
articles:
[ERROR] [Help 1] http://cwiki.apache.org/confluence/display/MAVEN/DependencyResolutionException
Build step 'Invoke top-level Maven targets' marked build as failure
Performing Post build task...
Match found for :.* : True
Logical operation result is TRUE
Running script  :   ZOMBIE_TESTS_COUNT=`jps | grep surefirebooter | wc -l`
  if [[ $ZOMBIE_TESTS_COUNT != 0 ]] ; then
    #It seems sometimes the tests are not dying immediately. Let's give them 10s
    echo "Suspicious java process found - waiting 10s to see if there are just slow to stop"
    sleep 10   
    ZOMBIE_TESTS_COUNT=`jps | grep surefirebooter | wc -l`
    if [[ $ZOMBIE_TESTS_COUNT != 0 ]] ; then
      echo "There are $ZOMBIE_TESTS_COUNT zombie tests, they should have been killed by surefire
but survived"
      echo "************ BEGIN zombies jstack extract"
      ZB_STACK=`jps | grep surefirebooter | cut -d ' ' -f 1 | xargs -n 1 jstack | grep ".test"
| grep "\.java"`
      jps | grep surefirebooter | cut -d ' ' -f 1 | xargs -n 1 jstack
      echo "************ END  zombies jstack extract"
      JIRA_COMMENT="$JIRA_COMMENT

     {color:red}-1 core zombie tests{color}.  There are ${ZOMBIE_TESTS_COUNT} zombie test(s):
${ZB_STACK}"
      BAD=1
      jps | grep surefirebooter | cut -d ' ' -f 1 | xargs kill -9
    else
      echo "We're ok: there is no zombie test, but some tests took some time to stop"
    fi
  else
    echo "We're ok: there is no zombie test"
  fi
[HBase-1.1] $ /bin/bash -xe /tmp/hudson727246868222784371.sh
++ jps
++ grep surefirebooter
++ wc -l
+ ZOMBIE_TESTS_COUNT=0
+ [[ 0 != 0 ]]
+ echo 'We'\''re ok: there is no zombie test'
We're ok: there is no zombie test
POST BUILD TASK : SUCCESS
END OF POST BUILD TASK : 0
Archiving artifacts
Sending artifact delta relative to HBase-1.1 #264
Archived 13 artifacts
Archive block size is 32768
Received 3 blocks and 47083 bytes
Compression is 67.6%
Took 3.5 sec
Recording test results

Mime
View raw message