hbase-builds mailing list archives

Site index · List index
Message view « Date » · « Thread »
Top « Date » · « Thread »
From Stack <st...@duboce.net>
Subject Re: Build failed in Jenkins: HBase-1.1 #277
Date Wed, 11 Mar 2015 07:07:59 GMT
kalashnikov:hbase.git.commit stack$ python
./dev-support/findHangingTests.py
https://builds.apache.org/job/HBase-1.1/277/console
Fetching the console output from the URL
Printing hanging tests
Hanging test : org.apache.hadoop.hbase.regionserver.TestHRegion

On Tue, Mar 10, 2015 at 11:52 PM, Apache Jenkins Server <
jenkins@builds.apache.org> wrote:

> See <https://builds.apache.org/job/HBase-1.1/277/changes>
>
> Changes:
>
> [stack] HBASE-13142 [PERF] Reuse the IPCUtil#buildCellBlock buffer;
> ADDENDUM
>
> ------------------------------------------
> [...truncated 1843 lines...]
> Tests run: 10, Failures: 0, Errors: 0, Skipped: 0, Time elapsed: 47.451
> sec - in org.apache.hadoop.hbase.replication.TestReplicationSmallTests
> Tests run: 1, Failures: 0, Errors: 0, Skipped: 0, Time elapsed: 3.57 sec -
> in org.apache.hadoop.hbase.replication.TestReplicationWithTags
> Running
> org.apache.hadoop.hbase.security.visibility.TestVisibilityLabelReplicationWithExpAsString
> Tests run: 3, Failures: 0, Errors: 0, Skipped: 0, Time elapsed: 63.606 sec
> - in org.apache.hadoop.hbase.replication.TestMasterReplication
> Running org.apache.hadoop.hbase.TestPartialResultsFromClientSide
> Running
> org.apache.hadoop.hbase.security.visibility.TestVisibilityLabelsWithDistributedLogReplay
> Tests run: 1, Failures: 0, Errors: 0, Skipped: 0, Time elapsed: 19.237 sec
> - in
> org.apache.hadoop.hbase.security.visibility.TestVisibilityLabelReplicationWithExpAsString
> Tests run: 23, Failures: 0, Errors: 0, Skipped: 0, Time elapsed: 16.69 sec
> - in
> org.apache.hadoop.hbase.security.visibility.TestVisibilityLabelsWithDistributedLogReplay
> Running
> org.apache.hadoop.hbase.security.visibility.TestVisibilityLabelsReplication
> Running
> org.apache.hadoop.hbase.security.visibility.TestVisibilityLabelsWithSLGStack
> Tests run: 1, Failures: 0, Errors: 0, Skipped: 0, Time elapsed: 2.446 sec
> - in
> org.apache.hadoop.hbase.security.visibility.TestVisibilityLabelsWithSLGStack
> Running
> org.apache.hadoop.hbase.security.visibility.TestVisibilityLabelsWithDeletes
> Running
> org.apache.hadoop.hbase.security.visibility.TestEnforcingScanLabelGenerator
> Tests run: 12, Failures: 0, Errors: 0, Skipped: 0, Time elapsed: 39.174
> sec - in org.apache.hadoop.hbase.TestPartialResultsFromClientSide
> Tests run: 1, Failures: 0, Errors: 0, Skipped: 0, Time elapsed: 2.53 sec -
> in
> org.apache.hadoop.hbase.security.visibility.TestEnforcingScanLabelGenerator
> Tests run: 1, Failures: 0, Errors: 0, Skipped: 0, Time elapsed: 21.317 sec
> - in
> org.apache.hadoop.hbase.security.visibility.TestVisibilityLabelsReplication
> Tests run: 8, Failures: 0, Errors: 0, Skipped: 0, Time elapsed: 201.262
> sec - in
> org.apache.hadoop.hbase.replication.regionserver.TestReplicationWALReaderManager
> Running
> org.apache.hadoop.hbase.security.visibility.TestDefaultScanLabelGeneratorStack
> Running
> org.apache.hadoop.hbase.security.visibility.TestVisibilityWithCheckAuths
> Tests run: 1, Failures: 0, Errors: 0, Skipped: 0, Time elapsed: 3.125 sec
> - in
> org.apache.hadoop.hbase.security.visibility.TestDefaultScanLabelGeneratorStack
> Tests run: 2, Failures: 0, Errors: 0, Skipped: 0, Time elapsed: 3.705 sec
> - in
> org.apache.hadoop.hbase.security.visibility.TestVisibilityWithCheckAuths
> Running
> org.apache.hadoop.hbase.security.visibility.TestVisibilityLabelsOpWithDifferentUsersNoACL
> Tests run: 1, Failures: 0, Errors: 0, Skipped: 0, Time elapsed: 2.506 sec
> - in
> org.apache.hadoop.hbase.security.visibility.TestVisibilityLabelsOpWithDifferentUsersNoACL
> Running
> org.apache.hadoop.hbase.security.visibility.TestVisibilityLabelsWithDefaultVisLabelService
> Running
> org.apache.hadoop.hbase.security.visibility.TestVisibilityLabelsWithACL
> Running
> org.apache.hadoop.hbase.security.visibility.TestVisibilityLablesWithGroups
> Tests run: 1, Failures: 0, Errors: 0, Skipped: 0, Time elapsed: 3.199 sec
> - in
> org.apache.hadoop.hbase.security.visibility.TestVisibilityLablesWithGroups
> Running
> org.apache.hadoop.hbase.security.visibility.TestVisibilityLabelsWithCustomVisLabService
> Tests run: 5, Failures: 0, Errors: 0, Skipped: 0, Time elapsed: 7.423 sec
> - in org.apache.hadoop.hbase.security.visibility.TestVisibilityLabelsWithACL
> Tests run: 23, Failures: 0, Errors: 0, Skipped: 0, Time elapsed: 19.013
> sec - in
> org.apache.hadoop.hbase.security.visibility.TestVisibilityLabelsWithDefaultVisLabelService
> Running org.apache.hadoop.hbase.security.access.TestAccessController2
> Running org.apache.hadoop.hbase.security.access.TestAccessController
> Tests run: 37, Failures: 0, Errors: 0, Skipped: 0, Time elapsed: 55.801
> sec - in
> org.apache.hadoop.hbase.security.visibility.TestVisibilityLabelsWithDeletes
> Tests run: 19, Failures: 0, Errors: 0, Skipped: 0, Time elapsed: 17.468
> sec - in
> org.apache.hadoop.hbase.security.visibility.TestVisibilityLabelsWithCustomVisLabService
> Tests run: 2, Failures: 0, Errors: 0, Skipped: 0, Time elapsed: 12.08 sec
> - in org.apache.hadoop.hbase.security.access.TestAccessController2
> Running org.apache.hadoop.hbase.security.access.TestTablePermissions
> Running org.apache.hadoop.hbase.security.access.TestAccessControlFilter
> Tests run: 1, Failures: 0, Errors: 0, Skipped: 0, Time elapsed: 3.839 sec
> - in org.apache.hadoop.hbase.security.access.TestAccessControlFilter
> Running org.apache.hadoop.hbase.security.access.TestCellACLs
> Running org.apache.hadoop.hbase.security.access.TestNamespaceCommands
> Running org.apache.hadoop.hbase.security.access.TestZKPermissionsWatcher
> Tests run: 2, Failures: 0, Errors: 0, Skipped: 0, Time elapsed: 10.672 sec
> - in org.apache.hadoop.hbase.security.access.TestCellACLs
> Tests run: 1, Failures: 0, Errors: 0, Skipped: 0, Time elapsed: 3.538 sec
> - in org.apache.hadoop.hbase.security.access.TestZKPermissionsWatcher
> Tests run: 7, Failures: 0, Errors: 0, Skipped: 0, Time elapsed: 11.744 sec
> - in org.apache.hadoop.hbase.security.access.TestNamespaceCommands
> Running org.apache.hadoop.hbase.security.token.TestZKSecretWatcher
> Running org.apache.hadoop.hbase.security.access.TestScanEarlyTermination
> Running
> org.apache.hadoop.hbase.security.access.TestCellACLWithMultipleVersions
> Tests run: 7, Failures: 0, Errors: 0, Skipped: 0, Time elapsed: 33.416 sec
> - in org.apache.hadoop.hbase.security.access.TestTablePermissions
> Tests run: 1, Failures: 0, Errors: 0, Skipped: 0, Time elapsed: 4.306 sec
> - in org.apache.hadoop.hbase.security.access.TestScanEarlyTermination
> Running org.apache.hadoop.hbase.TestMetaTableAccessorNoCluster
> Running org.apache.hadoop.hbase.security.token.TestTokenAuthentication
> Tests run: 3, Failures: 0, Errors: 0, Skipped: 0, Time elapsed: 0.542 sec
> - in org.apache.hadoop.hbase.security.token.TestTokenAuthentication
> Tests run: 2, Failures: 0, Errors: 0, Skipped: 0, Time elapsed: 3.637 sec
> - in org.apache.hadoop.hbase.TestMetaTableAccessorNoCluster
> Running org.apache.hadoop.hbase.TestMetaTableLocator
> Tests run: 1, Failures: 0, Errors: 0, Skipped: 0, Time elapsed: 13.243 sec
> - in org.apache.hadoop.hbase.security.token.TestZKSecretWatcher
> Running org.apache.hadoop.hbase.TestHBaseTestingUtility
> Tests run: 7, Failures: 0, Errors: 0, Skipped: 0, Time elapsed: 3.557 sec
> - in org.apache.hadoop.hbase.TestMetaTableLocator
> Running org.apache.hadoop.hbase.TestZooKeeper
> Running org.apache.hadoop.hbase.snapshot.TestSnapshotDescriptionUtils
> Tests run: 2, Failures: 0, Errors: 0, Skipped: 0, Time elapsed: 0.178 sec
> - in org.apache.hadoop.hbase.snapshot.TestSnapshotDescriptionUtils
> Tests run: 8, Failures: 0, Errors: 0, Skipped: 0, Time elapsed: 28.22 sec
> - in org.apache.hadoop.hbase.security.access.TestCellACLWithMultipleVersions
> Running org.apache.hadoop.hbase.snapshot.TestFlushSnapshotFromClient
> Running org.apache.hadoop.hbase.snapshot.TestSecureExportSnapshot
> Tests run: 11, Failures: 0, Errors: 0, Skipped: 0, Time elapsed: 50.673
> sec - in org.apache.hadoop.hbase.TestHBaseTestingUtility
> Tests run: 9, Failures: 0, Errors: 0, Skipped: 0, Time elapsed: 45.556 sec
> - in org.apache.hadoop.hbase.snapshot.TestFlushSnapshotFromClient
> Running org.apache.hadoop.hbase.snapshot.TestExportSnapshot
> Running org.apache.hadoop.hbase.snapshot.TestRestoreFlushSnapshotFromClient
> Tests run: 5, Failures: 0, Errors: 0, Skipped: 0, Time elapsed: 64.025 sec
> - in org.apache.hadoop.hbase.snapshot.TestRestoreFlushSnapshotFromClient
> Running org.apache.hadoop.hbase.TestInfoServers
> Tests run: 3, Failures: 0, Errors: 0, Skipped: 0, Time elapsed: 2.198 sec
> - in org.apache.hadoop.hbase.TestInfoServers
> Running org.apache.hadoop.hbase.procedure.TestZKProcedureControllers
> Tests run: 4, Failures: 0, Errors: 0, Skipped: 0, Time elapsed: 2.775 sec
> - in org.apache.hadoop.hbase.procedure.TestZKProcedureControllers
> Tests run: 12, Failures: 0, Errors: 0, Skipped: 0, Time elapsed: 161.381
> sec - in org.apache.hadoop.hbase.TestZooKeeper
> Running org.apache.hadoop.hbase.procedure.TestZKProcedure
> Tests run: 4, Failures: 0, Errors: 0, Skipped: 0, Time elapsed: 2.254 sec
> - in org.apache.hadoop.hbase.procedure.TestZKProcedure
> Running org.apache.hadoop.hbase.io.hfile.TestForceCacheImportantBlocks
> Running org.apache.hadoop.hbase.io.hfile.TestCacheOnWrite
> Tests run: 55, Failures: 0, Errors: 0, Skipped: 0, Time elapsed: 257.469
> sec - in org.apache.hadoop.hbase.security.access.TestAccessController
> Running org.apache.hadoop.hbase.io.hfile.TestHFileBlock
> Tests run: 4, Failures: 0, Errors: 0, Skipped: 0, Time elapsed: 41.296 sec
> - in org.apache.hadoop.hbase.io.hfile.TestForceCacheImportantBlocks
> Running org.apache.hadoop.hbase.io.hfile.TestHFileBlockIndex
> Tests run: 10, Failures: 0, Errors: 0, Skipped: 0, Time elapsed: 15.786
> sec - in org.apache.hadoop.hbase.io.hfile.TestHFileBlockIndex
> Running org.apache.hadoop.hbase.io.hfile.TestHFileSeek
> Tests run: 1, Failures: 0, Errors: 0, Skipped: 0, Time elapsed: 2.645 sec
> - in org.apache.hadoop.hbase.io.hfile.TestHFileSeek
> Running org.apache.hadoop.hbase.io.hfile.TestScannerSelectionUsingTTL
> Tests run: 28, Failures: 0, Errors: 0, Skipped: 0, Time elapsed: 92.596
> sec - in org.apache.hadoop.hbase.io.hfile.TestHFileBlock
> Running org.apache.hadoop.hbase.io.hfile.TestCacheConfig
> Tests run: 6, Failures: 0, Errors: 0, Skipped: 0, Time elapsed: 1.85 sec -
> in org.apache.hadoop.hbase.io.hfile.TestCacheConfig
> Running org.apache.hadoop.hbase.io.encoding.TestDataBlockEncoders
> Tests run: 6, Failures: 0, Errors: 0, Skipped: 0, Time elapsed: 65.604 sec
> - in org.apache.hadoop.hbase.io.hfile.TestScannerSelectionUsingTTL
> Running org.apache.hadoop.hbase.io.encoding.TestEncodedSeekers
> Tests run: 9, Failures: 0, Errors: 0, Skipped: 0, Time elapsed: 317.867
> sec - in org.apache.hadoop.hbase.snapshot.TestSecureExportSnapshot
> Running org.apache.hadoop.hbase.io.encoding.TestBufferedDataBlockEncoder
> Tests run: 1, Failures: 0, Errors: 0, Skipped: 0, Time elapsed: 19.554 sec
> - in org.apache.hadoop.hbase.io.encoding.TestBufferedDataBlockEncoder
> Running org.apache.hadoop.hbase.io.encoding.TestChangingEncoding
> Tests run: 9, Failures: 0, Errors: 0, Skipped: 0, Time elapsed: 311.913
> sec - in org.apache.hadoop.hbase.snapshot.TestExportSnapshot
> Running org.apache.hadoop.hbase.io.encoding.TestLoadAndSwitchEncodeOnDisk
> Tests run: 1, Failures: 0, Errors: 0, Skipped: 0, Time elapsed: 26.127 sec
> - in org.apache.hadoop.hbase.io.encoding.TestLoadAndSwitchEncodeOnDisk
> Running org.apache.hadoop.hbase.io.TestFileLink
> Tests run: 20, Failures: 0, Errors: 0, Skipped: 0, Time elapsed: 119.618
> sec - in org.apache.hadoop.hbase.io.encoding.TestEncodedSeekers
> Tests run: 5, Failures: 0, Errors: 0, Skipped: 0, Time elapsed: 14.243 sec
> - in org.apache.hadoop.hbase.io.TestFileLink
> Running org.apache.hadoop.hbase.wal.TestWALFiltering
> Running org.apache.hadoop.hbase.wal.TestWALFactory
> Tests run: 9, Failures: 0, Errors: 0, Skipped: 0, Time elapsed: 16.289 sec
> - in org.apache.hadoop.hbase.wal.TestWALFactory
> Running org.apache.hadoop.hbase.wal.TestWALReaderOnSecureWAL
> Tests run: 2, Failures: 0, Errors: 0, Skipped: 0, Time elapsed: 1.759 sec
> - in org.apache.hadoop.hbase.wal.TestWALReaderOnSecureWAL
> Tests run: 1, Failures: 0, Errors: 0, Skipped: 0, Time elapsed: 25.3 sec -
> in org.apache.hadoop.hbase.wal.TestWALFiltering
> Running org.apache.hadoop.hbase.wal.TestDefaultWALProvider
> Running org.apache.hadoop.hbase.wal.TestWALSplit
> Tests run: 5, Failures: 0, Errors: 0, Skipped: 0, Time elapsed: 7.015 sec
> - in org.apache.hadoop.hbase.wal.TestDefaultWALProvider
> Running org.apache.hadoop.hbase.wal.TestSecureWAL
> Tests run: 1, Failures: 0, Errors: 0, Skipped: 0, Time elapsed: 1.381 sec
> - in org.apache.hadoop.hbase.wal.TestSecureWAL
> Running org.apache.hadoop.hbase.wal.TestDefaultWALProviderWithHLogKey
> Tests run: 5, Failures: 0, Errors: 0, Skipped: 0, Time elapsed: 6.76 sec -
> in org.apache.hadoop.hbase.wal.TestDefaultWALProviderWithHLogKey
> Tests run: 3, Failures: 0, Errors: 0, Skipped: 0, Time elapsed: 111.918
> sec - in org.apache.hadoop.hbase.io.encoding.TestChangingEncoding
> Running org.apache.hadoop.hbase.wal.TestBoundedRegionGroupingProvider
> Running org.apache.hadoop.hbase.wal.TestWALSplitCompressed
> Tests run: 5, Failures: 0, Errors: 0, Skipped: 0, Time elapsed: 20.317 sec
> - in org.apache.hadoop.hbase.wal.TestBoundedRegionGroupingProvider
> Running org.apache.hadoop.hbase.zookeeper.TestZooKeeperACL
> Tests run: 6, Failures: 0, Errors: 0, Skipped: 0, Time elapsed: 0.274 sec
> - in org.apache.hadoop.hbase.zookeeper.TestZooKeeperACL
> Running org.apache.hadoop.hbase.zookeeper.TestZKLeaderManager
> Tests run: 1, Failures: 0, Errors: 0, Skipped: 0, Time elapsed: 0.148 sec
> - in org.apache.hadoop.hbase.zookeeper.TestZKLeaderManager
> Running org.apache.hadoop.hbase.zookeeper.TestZooKeeperNodeTracker
> Tests run: 3, Failures: 0, Errors: 0, Skipped: 0, Time elapsed: 1.044 sec
> - in org.apache.hadoop.hbase.zookeeper.TestZooKeeperNodeTracker
> Running org.apache.hadoop.hbase.zookeeper.TestRecoverableZooKeeper
> Tests run: 1, Failures: 0, Errors: 0, Skipped: 0, Time elapsed: 1.238 sec
> - in org.apache.hadoop.hbase.zookeeper.TestRecoverableZooKeeper
> Running org.apache.hadoop.hbase.zookeeper.TestZKTableStateManager
> Tests run: 1, Failures: 0, Errors: 0, Skipped: 0, Time elapsed: 0.772 sec
> - in org.apache.hadoop.hbase.zookeeper.TestZKTableStateManager
> Running org.apache.hadoop.hbase.zookeeper.TestZKMulti
> Tests run: 8, Failures: 0, Errors: 0, Skipped: 0, Time elapsed: 0.64 sec -
> in org.apache.hadoop.hbase.zookeeper.TestZKMulti
> Running
> org.apache.hadoop.hbase.zookeeper.lock.TestZKInterProcessReadWriteLock
> Tests run: 28, Failures: 0, Errors: 0, Skipped: 0, Time elapsed: 243.986
> sec - in org.apache.hadoop.hbase.io.encoding.TestDataBlockEncoders
> Running org.apache.hadoop.hbase.zookeeper.TestHQuorumPeer
> Tests run: 4, Failures: 0, Errors: 0, Skipped: 0, Time elapsed: 2.137 sec
> - in org.apache.hadoop.hbase.zookeeper.TestHQuorumPeer
> Running org.apache.hadoop.hbase.TestIOFencing
> Tests run: 216, Failures: 0, Errors: 0, Skipped: 0, Time elapsed: 393.374
> sec - in org.apache.hadoop.hbase.io.hfile.TestCacheOnWrite
> Tests run: 6, Failures: 0, Errors: 0, Skipped: 0, Time elapsed: 24.537 sec
> - in org.apache.hadoop.hbase.zookeeper.lock.TestZKInterProcessReadWriteLock
> Running org.apache.hadoop.hbase.TestMovedRegionsCleaner
> Running org.apache.hadoop.hbase.constraint.TestConstraint
> Tests run: 1, Failures: 0, Errors: 0, Skipped: 0, Time elapsed: 9.278 sec
> - in org.apache.hadoop.hbase.TestMovedRegionsCleaner
> Tests run: 5, Failures: 0, Errors: 0, Skipped: 0, Time elapsed: 7.011 sec
> - in org.apache.hadoop.hbase.constraint.TestConstraint
> Running
> org.apache.hadoop.hbase.backup.example.TestZooKeeperTableArchiveClient
> Running org.apache.hadoop.hbase.backup.TestHFileArchiving
> Tests run: 3, Failures: 0, Errors: 0, Skipped: 0, Time elapsed: 3.837 sec
> - in org.apache.hadoop.hbase.backup.example.TestZooKeeperTableArchiveClient
> Running org.apache.hadoop.hbase.TestHColumnDescriptorDefaultVersions
> Tests run: 3, Failures: 0, Errors: 0, Skipped: 0, Time elapsed: 12.957 sec
> - in org.apache.hadoop.hbase.TestHColumnDescriptorDefaultVersions
> Running org.apache.hadoop.hbase.ipc.TestProtoBufRpc
> Tests run: 1, Failures: 0, Errors: 0, Skipped: 0, Time elapsed: 1.675 sec
> - in org.apache.hadoop.hbase.ipc.TestProtoBufRpc
> Running org.apache.hadoop.hbase.ipc.TestDelayedRpc
> Tests run: 4, Failures: 0, Errors: 0, Skipped: 0, Time elapsed: 3.751 sec
> - in org.apache.hadoop.hbase.ipc.TestDelayedRpc
> Running org.apache.hadoop.hbase.ipc.TestHBaseClient
> Tests run: 1, Failures: 0, Errors: 0, Skipped: 0, Time elapsed: 0.403 sec
> - in org.apache.hadoop.hbase.ipc.TestHBaseClient
> Tests run: 5, Failures: 0, Errors: 0, Skipped: 0, Time elapsed: 43.729 sec
> - in org.apache.hadoop.hbase.backup.TestHFileArchiving
> Running org.apache.hadoop.hbase.TestNamespace
> Tests run: 9, Failures: 0, Errors: 0, Skipped: 1, Time elapsed: 7.048 sec
> - in org.apache.hadoop.hbase.TestNamespace
> Tests run: 31, Failures: 0, Errors: 0, Skipped: 0, Time elapsed: 189.821
> sec - in org.apache.hadoop.hbase.wal.TestWALSplit
> Tests run: 31, Failures: 0, Errors: 0, Skipped: 0, Time elapsed: 199.732
> sec - in org.apache.hadoop.hbase.wal.TestWALSplitCompressed
> Tests run: 2, Failures: 0, Errors: 0, Skipped: 0, Time elapsed: 211.5 sec
> - in org.apache.hadoop.hbase.TestIOFencing
>
> Results :
>
>
>
>
> Tests run: 2375, Failures: 0, Errors: 0, Skipped: 18
>
> [INFO]
> ------------------------------------------------------------------------
> [INFO] Reactor Summary:
> [INFO]
> [INFO] HBase ............................................. SUCCESS [3.378s]
> [INFO] HBase - Checkstyle ................................ SUCCESS [0.678s]
> [INFO] HBase - Annotations ............................... SUCCESS [0.925s]
> [INFO] HBase - Common .................................... SUCCESS
> [1:20.541s]
> [INFO] HBase - Protocol .................................. SUCCESS [9.591s]
> [INFO] HBase - Client .................................... SUCCESS
> [1:16.467s]
> [INFO] HBase - Hadoop Compatibility ...................... SUCCESS [7.127s]
> [INFO] HBase - Hadoop Two Compatibility .................. SUCCESS [6.708s]
> [INFO] HBase - Prefix Tree ............................... SUCCESS [9.085s]
> [INFO] HBase - Server .................................... FAILURE
> [1:14:19.990s]
> [INFO] HBase - Testing Util .............................. SKIPPED
> [INFO] HBase - Thrift .................................... SKIPPED
> [INFO] HBase - Rest ...................................... SKIPPED
> [INFO] HBase - Shell ..................................... SKIPPED
> [INFO] HBase - Integration Tests ......................... SKIPPED
> [INFO] HBase - Examples .................................. SKIPPED
> [INFO] HBase - Assembly .................................. SKIPPED
> [INFO]
> ------------------------------------------------------------------------
> [INFO] BUILD FAILURE
> [INFO]
> ------------------------------------------------------------------------
> [INFO] Total time: 1:17:36.514s
> [INFO] Finished at: Wed Mar 11 06:49:01 UTC 2015
> [INFO] Final Memory: 85M/546M
> [INFO]
> ------------------------------------------------------------------------
> [ERROR] Failed to execute goal
> org.apache.maven.plugins:maven-surefire-plugin:2.18:test
> (secondPartTestsExecution) on project hbase-server: There was a timeout or
> other error in the fork -> [Help 1]
> [ERROR]
> [ERROR] To see the full stack trace of the errors, re-run Maven with the
> -e switch.
> [ERROR] Re-run Maven using the -X switch to enable full debug logging.
> [ERROR]
> [ERROR] For more information about the errors and possible solutions,
> please read the following articles:
> [ERROR] [Help 1]
> http://cwiki.apache.org/confluence/display/MAVEN/MojoFailureException
> [ERROR]
> [ERROR] After correcting the problems, you can resume the build with the
> command
> [ERROR]   mvn <goals> -rf :hbase-server
> Build step 'Invoke top-level Maven targets' marked build as failure
> Performing Post build task...
> Match found for :.* : True
> Logical operation result is TRUE
> Running script  :   ZOMBIE_TESTS_COUNT=`jps | grep surefirebooter | wc -l`
>   if [[ $ZOMBIE_TESTS_COUNT != 0 ]] ; then
>     #It seems sometimes the tests are not dying immediately. Let's give
> them 10s
>     echo "Suspicious java process found - waiting 10s to see if there are
> just slow to stop"
>     sleep 10
>     ZOMBIE_TESTS_COUNT=`jps | grep surefirebooter | wc -l`
>     if [[ $ZOMBIE_TESTS_COUNT != 0 ]] ; then
>       echo "There are $ZOMBIE_TESTS_COUNT zombie tests, they should have
> been killed by surefire but survived"
>       echo "************ BEGIN zombies jstack extract"
>       ZB_STACK=`jps | grep surefirebooter | cut -d ' ' -f 1 | xargs -n 1
> jstack | grep ".test" | grep "\.java"`
>       jps | grep surefirebooter | cut -d ' ' -f 1 | xargs -n 1 jstack
>       echo "************ END  zombies jstack extract"
>       JIRA_COMMENT="$JIRA_COMMENT
>
>      {color:red}-1 core zombie tests{color}.  There are
> ${ZOMBIE_TESTS_COUNT} zombie test(s): ${ZB_STACK}"
>       BAD=1
>       jps | grep surefirebooter | cut -d ' ' -f 1 | xargs kill -9
>     else
>       echo "We're ok: there is no zombie test, but some tests took some
> time to stop"
>     fi
>   else
>     echo "We're ok: there is no zombie test"
>   fi
> [HBase-1.1] $ /bin/bash -xe /tmp/hudson5362906868988919800.sh
> ++ jps
> ++ grep surefirebooter
> ++ wc -l
> + ZOMBIE_TESTS_COUNT=0
> + [[ 0 != 0 ]]
> + echo 'We'\''re ok: there is no zombie test'
> We're ok: there is no zombie test
> POST BUILD TASK : SUCCESS
> END OF POST BUILD TASK : 0
> Archiving artifacts
> Sending artifact delta relative to HBase-1.1 #276
> Archived 1912 artifacts
> Archive block size is 32768
> Received 39 blocks and 468165761 bytes
> Compression is 0.3%
> Took 2 min 59 sec
> Recording test results
> Updating HBASE-13142
>

Mime
  • Unnamed multipart/alternative (inline, None, 0 bytes)
View raw message