hbase-builds mailing list archives

Site index · List index
Message view « Date » · « Thread »
Top « Date » · « Thread »
From Stack <st...@duboce.net>
Subject Re: Build failed in Jenkins: HBase-1.0 #780
Date Mon, 02 Mar 2015 18:19:28 GMT
kalashnikov-22:hbase.git.commit stack$ python
./dev-support/findHangingTests.py
https://builds.apache.org/job/HBase-1.0/780/consoleText
Fetching the console output from the URL
Printing hanging tests
Hanging test : org.apache.hadoop.hbase.master.TestDistributedLogSplitting
Printing Failing tests

On Sun, Mar 1, 2015 at 11:54 PM, Apache Jenkins Server <
jenkins@builds.apache.org> wrote:

> See <https://builds.apache.org/job/HBase-1.0/780/changes>
>
> Changes:
>
> [ramkrishna] HBASE-13123 - Minor bug in ROW bloom filter (Ram)
>
> ------------------------------------------
> [...truncated 1826 lines...]
> Tests run: 1, Failures: 0, Errors: 0, Skipped: 0, Time elapsed: 7.55 sec -
> in org.apache.hadoop.hbase.client.TestClientScannerRPCTimeout
> Tests run: 6, Failures: 0, Errors: 0, Skipped: 0, Time elapsed: 24.85 sec
> - in org.apache.hadoop.hbase.client.TestSnapshotCloneIndependence
> Running org.apache.hadoop.hbase.client.TestClientOperationInterrupt
> Tests run: 23, Failures: 0, Errors: 0, Skipped: 0, Time elapsed: 52.973
> sec - in org.apache.hadoop.hbase.client.TestAdmin2
> Running org.apache.hadoop.hbase.client.TestRpcControllerFactory
> Tests run: 1, Failures: 0, Errors: 0, Skipped: 0, Time elapsed: 2.704 sec
> - in org.apache.hadoop.hbase.client.TestRpcControllerFactory
> Running org.apache.hadoop.hbase.client.TestScannersFromClientSide
> Running org.apache.hadoop.hbase.client.TestCheckAndMutate
> Tests run: 5, Failures: 0, Errors: 0, Skipped: 0, Time elapsed: 5.39 sec -
> in org.apache.hadoop.hbase.client.TestScannersFromClientSide
> Tests run: 1, Failures: 0, Errors: 0, Skipped: 0, Time elapsed: 1.463 sec
> - in org.apache.hadoop.hbase.client.TestCheckAndMutate
> Running org.apache.hadoop.hbase.client.TestFromClientSide
> Running
> org.apache.hadoop.hbase.client.TestHTablePool$TestHTableThreadLocalPool
> Tests run: 9, Failures: 0, Errors: 0, Skipped: 0, Time elapsed: 2.265 sec
> - in org.apache.hadoop.hbase.client.TestHTablePool$TestHTableThreadLocalPool
> Running org.apache.hadoop.hbase.client.TestUpdateConfiguration
> Tests run: 2, Failures: 0, Errors: 0, Skipped: 0, Time elapsed: 0.211 sec
> - in org.apache.hadoop.hbase.client.TestUpdateConfiguration
> Tests run: 5, Failures: 0, Errors: 0, Skipped: 0, Time elapsed: 75.557 sec
> - in
> org.apache.hadoop.hbase.client.TestCloneSnapshotFromClientWithRegionReplicas
> Tests run: 1, Failures: 0, Errors: 0, Skipped: 0, Time elapsed: 54.129 sec
> - in org.apache.hadoop.hbase.client.TestClientOperationInterrupt
> Running org.apache.hadoop.hbase.client.TestClientPushback
> Tests run: 1, Failures: 0, Errors: 0, Skipped: 0, Time elapsed: 1.928 sec
> - in org.apache.hadoop.hbase.client.TestClientPushback
> Running
> org.apache.hadoop.hbase.client.TestHTablePool$TestHTableReusablePool
> Tests run: 9, Failures: 0, Errors: 0, Skipped: 0, Time elapsed: 2.6 sec -
> in org.apache.hadoop.hbase.client.TestHTablePool$TestHTableReusablePool
> Running
> org.apache.hadoop.hbase.client.TestRestoreSnapshotFromClientWithRegionReplicas
> Running org.apache.hadoop.hbase.client.TestReplicaWithCluster
> Running org.apache.hadoop.hbase.client.TestHTableMultiplexer
> Tests run: 1, Failures: 0, Errors: 0, Skipped: 0, Time elapsed: 7.611 sec
> - in org.apache.hadoop.hbase.client.TestHTableMultiplexer
> Tests run: 21, Failures: 0, Errors: 0, Skipped: 3, Time elapsed: 145.475
> sec - in org.apache.hadoop.hbase.client.TestHCM
> Tests run: 4, Failures: 0, Errors: 0, Skipped: 0, Time elapsed: 25.611 sec
> - in org.apache.hadoop.hbase.client.TestReplicaWithCluster
> Running org.apache.hadoop.hbase.client.TestScannerTimeout
> Running
> org.apache.hadoop.hbase.client.TestHTablePool$TestHTableReusablePool
> Running org.apache.hadoop.hbase.client.TestReplicasClient
> Tests run: 9, Failures: 0, Errors: 0, Skipped: 0, Time elapsed: 6.79 sec -
> in org.apache.hadoop.hbase.client.TestHTablePool$TestHTableReusablePool
> Running
> org.apache.hadoop.hbase.client.TestHTablePool$TestHTableThreadLocalPool
> Tests run: 9, Failures: 0, Errors: 0, Skipped: 0, Time elapsed: 2.374 sec
> - in org.apache.hadoop.hbase.client.TestHTablePool$TestHTableThreadLocalPool
> Running org.apache.hadoop.hbase.client.TestTableSnapshotScanner
> Tests run: 81, Failures: 0, Errors: 0, Skipped: 4, Time elapsed: 90.645
> sec - in org.apache.hadoop.hbase.client.TestFromClientSide
> Tests run: 4, Failures: 0, Errors: 0, Skipped: 0, Time elapsed: 38.341 sec
> - in org.apache.hadoop.hbase.client.TestScannerTimeout
> Running org.apache.hadoop.hbase.client.TestFromClientSide3
> Running org.apache.hadoop.hbase.client.TestRestoreSnapshotFromClient
> Tests run: 3, Failures: 0, Errors: 0, Skipped: 0, Time elapsed: 38.074 sec
> - in org.apache.hadoop.hbase.client.TestTableSnapshotScanner
> Running org.apache.hadoop.hbase.client.TestSnapshotMetadata
> Tests run: 5, Failures: 0, Errors: 0, Skipped: 0, Time elapsed: 92.881 sec
> - in
> org.apache.hadoop.hbase.client.TestRestoreSnapshotFromClientWithRegionReplicas
> Tests run: 6, Failures: 0, Errors: 0, Skipped: 0, Time elapsed: 33.538 sec
> - in org.apache.hadoop.hbase.client.TestFromClientSide3
> Running org.apache.hadoop.hbase.client.TestHTableMultiplexerFlushCache
> Tests run: 4, Failures: 0, Errors: 0, Skipped: 0, Time elapsed: 12.328 sec
> - in org.apache.hadoop.hbase.client.TestSnapshotMetadata
> Tests run: 1, Failures: 0, Errors: 0, Skipped: 0, Time elapsed: 4.116 sec
> - in org.apache.hadoop.hbase.client.TestHTableMultiplexerFlushCache
> Running org.apache.hadoop.hbase.procedure.TestZKProcedure
> Running org.apache.hadoop.hbase.TestMultiVersions
> Tests run: 4, Failures: 0, Errors: 0, Skipped: 0, Time elapsed: 2.153 sec
> - in org.apache.hadoop.hbase.procedure.TestZKProcedure
> Running org.apache.hadoop.hbase.TestHColumnDescriptorDefaultVersions
> Running org.apache.hadoop.hbase.procedure.TestZKProcedureControllers
> Tests run: 4, Failures: 0, Errors: 0, Skipped: 0, Time elapsed: 1.726 sec
> - in org.apache.hadoop.hbase.procedure.TestZKProcedureControllers
> Tests run: 3, Failures: 0, Errors: 0, Skipped: 0, Time elapsed: 6.066 sec
> - in org.apache.hadoop.hbase.TestMultiVersions
> Running org.apache.hadoop.hbase.TestNamespace
> Running org.apache.hadoop.hbase.constraint.TestConstraint
> Tests run: 3, Failures: 0, Errors: 0, Skipped: 0, Time elapsed: 15.841 sec
> - in org.apache.hadoop.hbase.TestHColumnDescriptorDefaultVersions
> Tests run: 9, Failures: 0, Errors: 0, Skipped: 1, Time elapsed: 6.829 sec
> - in org.apache.hadoop.hbase.TestNamespace
> Tests run: 5, Failures: 0, Errors: 0, Skipped: 0, Time elapsed: 6.139 sec
> - in org.apache.hadoop.hbase.constraint.TestConstraint
> Running org.apache.hadoop.hbase.TestZooKeeper
> Tests run: 12, Failures: 0, Errors: 0, Skipped: 0, Time elapsed: 97.341
> sec - in org.apache.hadoop.hbase.client.TestReplicasClient
> Running org.apache.hadoop.hbase.snapshot.TestFlushSnapshotFromClient
> Tests run: 5, Failures: 0, Errors: 0, Skipped: 0, Time elapsed: 75.916 sec
> - in org.apache.hadoop.hbase.client.TestRestoreSnapshotFromClient
> Running org.apache.hadoop.hbase.snapshot.TestExportSnapshot
> Running org.apache.hadoop.hbase.snapshot.TestSecureExportSnapshot
> Running org.apache.hadoop.hbase.snapshot.TestRestoreFlushSnapshotFromClient
> Tests run: 9, Failures: 0, Errors: 0, Skipped: 0, Time elapsed: 39.175 sec
> - in org.apache.hadoop.hbase.snapshot.TestFlushSnapshotFromClient
> Running org.apache.hadoop.hbase.snapshot.TestSnapshotDescriptionUtils
> Tests run: 2, Failures: 0, Errors: 0, Skipped: 0, Time elapsed: 0.205 sec
> - in org.apache.hadoop.hbase.snapshot.TestSnapshotDescriptionUtils
> Running org.apache.hadoop.hbase.TestIOFencing
> Tests run: 5, Failures: 0, Errors: 0, Skipped: 0, Time elapsed: 57.818 sec
> - in org.apache.hadoop.hbase.snapshot.TestRestoreFlushSnapshotFromClient
> Running
> org.apache.hadoop.hbase.coprocessor.TestRegionObserverScannerOpenHook
> Tests run: 3, Failures: 0, Errors: 0, Skipped: 0, Time elapsed: 10.387 sec
> - in org.apache.hadoop.hbase.coprocessor.TestRegionObserverScannerOpenHook
> Running org.apache.hadoop.hbase.coprocessor.TestOpenTableInCoprocessor
> Tests run: 2, Failures: 0, Errors: 0, Skipped: 0, Time elapsed: 4.675 sec
> - in org.apache.hadoop.hbase.coprocessor.TestOpenTableInCoprocessor
> Running
> org.apache.hadoop.hbase.coprocessor.TestMasterCoprocessorExceptionWithAbort
> Tests run: 1, Failures: 0, Errors: 0, Skipped: 0, Time elapsed: 17.144 sec
> - in
> org.apache.hadoop.hbase.coprocessor.TestMasterCoprocessorExceptionWithAbort
> Running org.apache.hadoop.hbase.coprocessor.TestCoprocessorTableEndpoint
> Tests run: 2, Failures: 0, Errors: 0, Skipped: 0, Time elapsed: 4.809 sec
> - in org.apache.hadoop.hbase.coprocessor.TestCoprocessorTableEndpoint
> Tests run: 11, Failures: 0, Errors: 0, Skipped: 0, Time elapsed: 158.575
> sec - in org.apache.hadoop.hbase.TestZooKeeper
> Running
> org.apache.hadoop.hbase.coprocessor.TestRegionServerCoprocessorEndpoint
> Tests run: 1, Failures: 0, Errors: 0, Skipped: 0, Time elapsed: 1.722 sec
> - in org.apache.hadoop.hbase.coprocessor.TestRegionServerCoprocessorEndpoint
> Running org.apache.hadoop.hbase.coprocessor.TestRegionObserverInterface
> Running
> org.apache.hadoop.hbase.coprocessor.TestMasterCoprocessorExceptionWithRemove
> Tests run: 1, Failures: 0, Errors: 0, Skipped: 0, Time elapsed: 5.122 sec
> - in
> org.apache.hadoop.hbase.coprocessor.TestMasterCoprocessorExceptionWithRemove
> Running org.apache.hadoop.hbase.coprocessor.TestAggregateProtocol
> Tests run: 44, Failures: 0, Errors: 0, Skipped: 0, Time elapsed: 5.769 sec
> - in org.apache.hadoop.hbase.coprocessor.TestAggregateProtocol
> Tests run: 13, Failures: 0, Errors: 0, Skipped: 0, Time elapsed: 35.707
> sec - in org.apache.hadoop.hbase.coprocessor.TestRegionObserverInterface
> Running org.apache.hadoop.hbase.coprocessor.TestBatchCoprocessorEndpoint
> Tests run: 4, Failures: 0, Errors: 0, Skipped: 0, Time elapsed: 2.35 sec -
> in org.apache.hadoop.hbase.coprocessor.TestBatchCoprocessorEndpoint
> Running org.apache.hadoop.hbase.coprocessor.TestRegionServerObserver
> Running org.apache.hadoop.hbase.coprocessor.TestHTableWrapper
> Tests run: 1, Failures: 0, Errors: 0, Skipped: 0, Time elapsed: 2.5 sec -
> in org.apache.hadoop.hbase.coprocessor.TestHTableWrapper
> Tests run: 1, Failures: 0, Errors: 0, Skipped: 0, Time elapsed: 14.013 sec
> - in org.apache.hadoop.hbase.coprocessor.TestRegionServerObserver
> Running
> org.apache.hadoop.hbase.coprocessor.TestRegionServerCoprocessorExceptionWithAbort
> Running org.apache.hadoop.hbase.coprocessor.TestClassLoading
> Tests run: 9, Failures: 0, Errors: 0, Skipped: 0, Time elapsed: 14.677 sec
> - in org.apache.hadoop.hbase.coprocessor.TestClassLoading
> Tests run: 2, Failures: 0, Errors: 0, Skipped: 0, Time elapsed: 16.95 sec
> - in
> org.apache.hadoop.hbase.coprocessor.TestRegionServerCoprocessorExceptionWithAbort
> Running org.apache.hadoop.hbase.coprocessor.TestDoubleColumnInterpreter
> Running org.apache.hadoop.hbase.coprocessor.TestRegionObserverBypass
> Tests run: 2, Failures: 0, Errors: 0, Skipped: 0, Time elapsed: 4.033 sec
> - in org.apache.hadoop.hbase.coprocessor.TestRegionObserverBypass
> Tests run: 38, Failures: 0, Errors: 0, Skipped: 0, Time elapsed: 4.783 sec
> - in org.apache.hadoop.hbase.coprocessor.TestDoubleColumnInterpreter
> Tests run: 2, Failures: 0, Errors: 0, Skipped: 0, Time elapsed: 205.478
> sec - in org.apache.hadoop.hbase.TestIOFencing
> Running org.apache.hadoop.hbase.coprocessor.TestCoprocessorStop
> Running org.apache.hadoop.hbase.coprocessor.TestRowProcessorEndpoint
> Running
> org.apache.hadoop.hbase.coprocessor.TestRegionServerCoprocessorExceptionWithRemove
> Tests run: 4, Failures: 0, Errors: 0, Skipped: 0, Time elapsed: 6.893 sec
> - in org.apache.hadoop.hbase.coprocessor.TestRowProcessorEndpoint
> Tests run: 1, Failures: 0, Errors: 0, Skipped: 0, Time elapsed: 13.749 sec
> - in
> org.apache.hadoop.hbase.coprocessor.TestRegionServerCoprocessorExceptionWithRemove
> Tests run: 1, Failures: 0, Errors: 0, Skipped: 0, Time elapsed: 16.051 sec
> - in org.apache.hadoop.hbase.coprocessor.TestCoprocessorStop
> Running org.apache.hadoop.hbase.coprocessor.TestBigDecimalColumnInterpreter
> Tests run: 38, Failures: 0, Errors: 0, Skipped: 0, Time elapsed: 4.98 sec
> - in org.apache.hadoop.hbase.coprocessor.TestBigDecimalColumnInterpreter
> Running org.apache.hadoop.hbase.coprocessor.TestMasterObserver
> Running org.apache.hadoop.hbase.coprocessor.TestCoprocessorEndpoint
> Tests run: 6, Failures: 0, Errors: 0, Skipped: 0, Time elapsed: 2.3 sec -
> in org.apache.hadoop.hbase.coprocessor.TestCoprocessorEndpoint
> Running org.apache.hadoop.hbase.TestGlobalMemStoreSize
> Running org.apache.hadoop.hbase.coprocessor.TestWALObserver
> Tests run: 7, Failures: 0, Errors: 0, Skipped: 0, Time elapsed: 8.749 sec
> - in org.apache.hadoop.hbase.coprocessor.TestMasterObserver
> Tests run: 6, Failures: 0, Errors: 0, Skipped: 0, Time elapsed: 7.174 sec
> - in org.apache.hadoop.hbase.coprocessor.TestWALObserver
> Running org.apache.hadoop.hbase.TestMetaTableLocator
> Tests run: 1, Failures: 0, Errors: 0, Skipped: 0, Time elapsed: 11.892 sec
> - in org.apache.hadoop.hbase.TestGlobalMemStoreSize
> Tests run: 9, Failures: 0, Errors: 0, Skipped: 0, Time elapsed: 281.763
> sec - in org.apache.hadoop.hbase.snapshot.TestExportSnapshot
> Running org.apache.hadoop.hbase.TestJMXListener
> Running org.apache.hadoop.hbase.zookeeper.TestZKTableStateManager
> Tests run: 1, Failures: 0, Errors: 0, Skipped: 0, Time elapsed: 0.854 sec
> - in org.apache.hadoop.hbase.zookeeper.TestZKTableStateManager
> Tests run: 9, Failures: 0, Errors: 0, Skipped: 0, Time elapsed: 281.111
> sec - in org.apache.hadoop.hbase.snapshot.TestSecureExportSnapshot
> Tests run: 7, Failures: 0, Errors: 0, Skipped: 0, Time elapsed: 3.62 sec -
> in org.apache.hadoop.hbase.TestMetaTableLocator
> Running org.apache.hadoop.hbase.zookeeper.TestZKMulti
> Tests run: 6, Failures: 0, Errors: 0, Skipped: 0, Time elapsed: 0.326 sec
> - in org.apache.hadoop.hbase.zookeeper.TestZKMulti
> Running
> org.apache.hadoop.hbase.zookeeper.lock.TestZKInterProcessReadWriteLock
> Running org.apache.hadoop.hbase.zookeeper.TestZKLeaderManager
> Tests run: 1, Failures: 0, Errors: 0, Skipped: 0, Time elapsed: 0.131 sec
> - in org.apache.hadoop.hbase.zookeeper.TestZKLeaderManager
> Running org.apache.hadoop.hbase.zookeeper.TestRecoverableZooKeeper
> Running org.apache.hadoop.hbase.zookeeper.TestZooKeeperNodeTracker
> Tests run: 1, Failures: 0, Errors: 0, Skipped: 0, Time elapsed: 1.225 sec
> - in org.apache.hadoop.hbase.zookeeper.TestRecoverableZooKeeper
> Running org.apache.hadoop.hbase.zookeeper.TestHQuorumPeer
> Tests run: 3, Failures: 0, Errors: 0, Skipped: 0, Time elapsed: 1.973 sec
> - in org.apache.hadoop.hbase.zookeeper.TestZooKeeperNodeTracker
> Running org.apache.hadoop.hbase.zookeeper.TestZooKeeperACL
> Running org.apache.hadoop.hbase.TestClusterBootOrder
> Tests run: 6, Failures: 0, Errors: 0, Skipped: 0, Time elapsed: 0.267 sec
> - in org.apache.hadoop.hbase.zookeeper.TestZooKeeperACL
> Tests run: 3, Failures: 0, Errors: 0, Skipped: 0, Time elapsed: 6.384 sec
> - in org.apache.hadoop.hbase.zookeeper.TestHQuorumPeer
> Tests run: 2, Failures: 0, Errors: 0, Skipped: 0, Time elapsed: 17.317 sec
> - in org.apache.hadoop.hbase.TestJMXListener
> Tests run: 6, Failures: 0, Errors: 0, Skipped: 0, Time elapsed: 24.484 sec
> - in org.apache.hadoop.hbase.zookeeper.lock.TestZKInterProcessReadWriteLock
> Tests run: 2, Failures: 0, Errors: 0, Skipped: 0, Time elapsed: 27.042 sec
> - in org.apache.hadoop.hbase.TestClusterBootOrder
>
> Results :
>
>
>
>
> Tests run: 2316, Failures: 0, Errors: 0, Skipped: 18
>
> [INFO]
> ------------------------------------------------------------------------
> [INFO] Reactor Summary:
> [INFO]
> [INFO] HBase ............................................. SUCCESS [3.001s]
> [INFO] HBase - Checkstyle ................................ SUCCESS [0.730s]
> [INFO] HBase - Annotations ............................... SUCCESS [0.850s]
> [INFO] HBase - Common .................................... SUCCESS
> [59.514s]
> [INFO] HBase - Protocol .................................. SUCCESS [9.400s]
> [INFO] HBase - Client .................................... SUCCESS
> [1:15.848s]
> [INFO] HBase - Hadoop Compatibility ...................... SUCCESS [7.028s]
> [INFO] HBase - Hadoop Two Compatibility .................. SUCCESS [6.173s]
> [INFO] HBase - Prefix Tree ............................... SUCCESS [8.311s]
> [INFO] HBase - Server .................................... FAILURE
> [1:07:05.332s]
> [INFO] HBase - Testing Util .............................. SKIPPED
> [INFO] HBase - Thrift .................................... SKIPPED
> [INFO] HBase - Rest ...................................... SKIPPED
> [INFO] HBase - Shell ..................................... SKIPPED
> [INFO] HBase - Integration Tests ......................... SKIPPED
> [INFO] HBase - Examples .................................. SKIPPED
> [INFO] HBase - Assembly .................................. SKIPPED
> [INFO]
> ------------------------------------------------------------------------
> [INFO] BUILD FAILURE
> [INFO]
> ------------------------------------------------------------------------
> [INFO] Total time: 1:09:56.967s
> [INFO] Finished at: Mon Mar 02 07:49:17 UTC 2015
> [INFO] Final Memory: 47M/462M
> [INFO]
> ------------------------------------------------------------------------
> [ERROR] Failed to execute goal
> org.apache.maven.plugins:maven-surefire-plugin:2.18:test
> (secondPartTestsExecution) on project hbase-server: There was a timeout or
> other error in the fork -> [Help 1]
> [ERROR]
> [ERROR] To see the full stack trace of the errors, re-run Maven with the
> -e switch.
> [ERROR] Re-run Maven using the -X switch to enable full debug logging.
> [ERROR]
> [ERROR] For more information about the errors and possible solutions,
> please read the following articles:
> [ERROR] [Help 1]
> http://cwiki.apache.org/confluence/display/MAVEN/MojoFailureException
> [ERROR]
> [ERROR] After correcting the problems, you can resume the build with the
> command
> [ERROR]   mvn <goals> -rf :hbase-server
> Build step 'Invoke top-level Maven targets' marked build as failure
> Performing Post build task...
> Match found for :.* : True
> Logical operation result is TRUE
> Running script  :   ZOMBIE_TESTS_COUNT=`jps | grep surefirebooter | wc -l`
>   if [[ $ZOMBIE_TESTS_COUNT != 0 ]] ; then
>     #It seems sometimes the tests are not dying immediately. Let's give
> them 10s
>     echo "Suspicious java process found - waiting 10s to see if there are
> just slow to stop"
>     sleep 10
>     ZOMBIE_TESTS_COUNT=`jps | grep surefirebooter | wc -l`
>     if [[ $ZOMBIE_TESTS_COUNT != 0 ]] ; then
>       echo "There are $ZOMBIE_TESTS_COUNT zombie tests, they should have
> been killed by surefire but survived"
>       echo "************ BEGIN zombies jstack extract"
>       ZB_STACK=`jps | grep surefirebooter | cut -d ' ' -f 1 | xargs -n 1
> jstack | grep ".test" | grep "\.java"`
>       jps | grep surefirebooter | cut -d ' ' -f 1 | xargs -n 1 jstack
>       echo "************ END  zombies jstack extract"
>       JIRA_COMMENT="$JIRA_COMMENT
>
>      {color:red}-1 core zombie tests{color}.  There are
> ${ZOMBIE_TESTS_COUNT} zombie test(s): ${ZB_STACK}"
>       BAD=1
>       jps | grep surefirebooter | cut -d ' ' -f 1 | xargs kill -9
>     else
>       echo "We're ok: there is no zombie test, but some tests took some
> time to stop"
>     fi
>   else
>     echo "We're ok: there is no zombie test"
>   fi
> [HBase-1.0] $ /bin/bash -xe /tmp/hudson1382490432245192779.sh
> ++ jps
> ++ grep surefirebooter
> ++ wc -l
> + ZOMBIE_TESTS_COUNT=1
> + [[ 1 != 0 ]]
> + echo 'Suspicious java process found - waiting 10s to see if there are
> just slow to stop'
> Suspicious java process found - waiting 10s to see if there are just slow
> to stop
> + sleep 10
> ++ jps
> ++ grep surefirebooter
> ++ wc -l
> + ZOMBIE_TESTS_COUNT=1
> + [[ 1 != 0 ]]
> + echo 'There are 1 zombie tests, they should have been killed by surefire
> but survived'
> There are 1 zombie tests, they should have been killed by surefire but
> survived
> + echo '************ BEGIN zombies jstack extract'
> ************ BEGIN zombies jstack extract
> ++ grep surefirebooter
> ++ jps
> ++ cut -d ' ' -f 1
> ++ xargs -n 1 jstack
> ++ grep .test
> ++ grep '\.java'
> + ZB_STACK=
> POST BUILD TASK : FAILURE
> END OF POST BUILD TASK : 0
> Archiving artifacts
> Sending artifact delta relative to HBase-1.0 #779
> Archived 1861 artifacts
> Archive block size is 32768
> Received 27 blocks and 1398680438 bytes
> Compression is 0.1%
> Took 4 min 57 sec
> Recording test results
> Updating HBASE-13123
>

Mime
  • Unnamed multipart/alternative (inline, None, 0 bytes)
View raw message