hbase-builds mailing list archives

Site index · List index
Message view « Date » · « Thread »
Top « Date » · « Thread »
From Stack <st...@duboce.net>
Subject Re: Build failed in Jenkins: HBase-1.0 #797
Date Wed, 11 Mar 2015 17:02:52 GMT
kalashnikov:hbase.git.commit stack$ python
./dev-support/findHangingTests.py
https://builds.apache.org/job/HBase-1.0/797/consoleText
Fetching the console output from the URL
Printing hanging tests
Hanging test :
org.apache.hadoop.hbase.client.TestCloneSnapshotFromClientWithRegionReplicas
Printing Failing tests

On Wed, Mar 11, 2015 at 8:56 AM, Apache Jenkins Server <
jenkins@builds.apache.org> wrote:

> See <https://builds.apache.org/job/HBase-1.0/797/changes>
>
> Changes:
>
> [tedyu] HBASE-12931 The existing KeyValues in memstore are not removed
> completely after inserting cell into memStore (ChiaPing Tsai)
>
> ------------------------------------------
> [...truncated 1817 lines...]
> Tests run: 2, Failures: 0, Errors: 0, Skipped: 0, Time elapsed: 8.898 sec
> - in org.apache.hadoop.hbase.security.access.TestCellACLs
> Running
> org.apache.hadoop.hbase.security.access.TestCellACLWithMultipleVersions
> Tests run: 7, Failures: 0, Errors: 0, Skipped: 0, Time elapsed: 32.227 sec
> - in org.apache.hadoop.hbase.security.access.TestTablePermissions
> Tests run: 8, Failures: 0, Errors: 0, Skipped: 0, Time elapsed: 26.942 sec
> - in org.apache.hadoop.hbase.security.access.TestCellACLWithMultipleVersions
> Running org.apache.hadoop.hbase.security.access.TestNamespaceCommands
> Running org.apache.hadoop.hbase.security.access.TestAccessController
> Tests run: 7, Failures: 0, Errors: 0, Skipped: 0, Time elapsed: 11.459 sec
> - in org.apache.hadoop.hbase.security.access.TestNamespaceCommands
> Running org.apache.hadoop.hbase.security.access.TestAccessController2
> Tests run: 2, Failures: 0, Errors: 0, Skipped: 0, Time elapsed: 10.093 sec
> - in org.apache.hadoop.hbase.security.access.TestAccessController2
> Running org.apache.hadoop.hbase.security.token.TestZKSecretWatcher
> Tests run: 1, Failures: 0, Errors: 0, Skipped: 0, Time elapsed: 13.247 sec
> - in org.apache.hadoop.hbase.security.token.TestZKSecretWatcher
> Running org.apache.hadoop.hbase.security.token.TestTokenAuthentication
> Tests run: 3, Failures: 0, Errors: 0, Skipped: 0, Time elapsed: 0.481 sec
> - in org.apache.hadoop.hbase.security.token.TestTokenAuthentication
> Running
> org.apache.hadoop.hbase.security.visibility.TestEnforcingScanLabelGenerator
> Tests run: 1, Failures: 0, Errors: 0, Skipped: 0, Time elapsed: 2.471 sec
> - in
> org.apache.hadoop.hbase.security.visibility.TestEnforcingScanLabelGenerator
> Running
> org.apache.hadoop.hbase.security.visibility.TestVisibilityWithCheckAuths
> Tests run: 2, Failures: 0, Errors: 0, Skipped: 0, Time elapsed: 3.562 sec
> - in
> org.apache.hadoop.hbase.security.visibility.TestVisibilityWithCheckAuths
> Running
> org.apache.hadoop.hbase.security.visibility.TestVisibilityLabelsWithSLGStack
> Tests run: 1, Failures: 0, Errors: 0, Skipped: 0, Time elapsed: 1.856 sec
> - in
> org.apache.hadoop.hbase.security.visibility.TestVisibilityLabelsWithSLGStack
> Running
> org.apache.hadoop.hbase.security.visibility.TestVisibilityLabelsWithACL
> Tests run: 5, Failures: 0, Errors: 0, Skipped: 0, Time elapsed: 6.647 sec
> - in org.apache.hadoop.hbase.security.visibility.TestVisibilityLabelsWithACL
> Running
> org.apache.hadoop.hbase.security.visibility.TestVisibilityLablesWithGroups
> Tests run: 1, Failures: 0, Errors: 0, Skipped: 0, Time elapsed: 2.406 sec
> - in
> org.apache.hadoop.hbase.security.visibility.TestVisibilityLablesWithGroups
> Running
> org.apache.hadoop.hbase.security.visibility.TestVisibilityLabelsOpWithDifferentUsersNoACL
> Tests run: 1, Failures: 0, Errors: 0, Skipped: 0, Time elapsed: 2.653 sec
> - in
> org.apache.hadoop.hbase.security.visibility.TestVisibilityLabelsOpWithDifferentUsersNoACL
> Tests run: 9, Failures: 0, Errors: 0, Skipped: 0, Time elapsed: 312.087
> sec - in org.apache.hadoop.hbase.snapshot.TestExportSnapshot
> Running
> org.apache.hadoop.hbase.security.visibility.TestVisibilityLabelsWithDistributedLogReplay
> Running
> org.apache.hadoop.hbase.security.visibility.TestDefaultScanLabelGeneratorStack
> Tests run: 1, Failures: 0, Errors: 0, Skipped: 0, Time elapsed: 2.132 sec
> - in
> org.apache.hadoop.hbase.security.visibility.TestDefaultScanLabelGeneratorStack
> Tests run: 9, Failures: 0, Errors: 0, Skipped: 0, Time elapsed: 318.962
> sec - in org.apache.hadoop.hbase.snapshot.TestSecureExportSnapshot
> Tests run: 23, Failures: 0, Errors: 0, Skipped: 0, Time elapsed: 14.763
> sec - in
> org.apache.hadoop.hbase.security.visibility.TestVisibilityLabelsWithDistributedLogReplay
> Running
> org.apache.hadoop.hbase.security.visibility.TestVisibilityLabelsWithDefaultVisLabelService
> Running
> org.apache.hadoop.hbase.security.visibility.TestVisibilityLabelsWithDeletes
> Running
> org.apache.hadoop.hbase.security.visibility.TestVisibilityLabelsWithCustomVisLabService
> Tests run: 23, Failures: 0, Errors: 0, Skipped: 0, Time elapsed: 18.624
> sec - in
> org.apache.hadoop.hbase.security.visibility.TestVisibilityLabelsWithDefaultVisLabelService
> Running
> org.apache.hadoop.hbase.security.visibility.TestVisibilityLabelsReplication
> Tests run: 19, Failures: 0, Errors: 0, Skipped: 0, Time elapsed: 15.793
> sec - in
> org.apache.hadoop.hbase.security.visibility.TestVisibilityLabelsWithCustomVisLabService
> Running
> org.apache.hadoop.hbase.security.visibility.TestVisibilityLabelReplicationWithExpAsString
> Tests run: 1, Failures: 0, Errors: 0, Skipped: 0, Time elapsed: 20.198 sec
> - in
> org.apache.hadoop.hbase.security.visibility.TestVisibilityLabelsReplication
> Running org.apache.hadoop.hbase.fs.TestBlockReorder
> Tests run: 1, Failures: 0, Errors: 0, Skipped: 0, Time elapsed: 19.468 sec
> - in
> org.apache.hadoop.hbase.security.visibility.TestVisibilityLabelReplicationWithExpAsString
> Running org.apache.hadoop.hbase.TestInfoServers
> Tests run: 37, Failures: 0, Errors: 0, Skipped: 0, Time elapsed: 51.929
> sec - in
> org.apache.hadoop.hbase.security.visibility.TestVisibilityLabelsWithDeletes
> Tests run: 3, Failures: 0, Errors: 0, Skipped: 0, Time elapsed: 2.322 sec
> - in org.apache.hadoop.hbase.TestInfoServers
> Tests run: 3, Failures: 0, Errors: 0, Skipped: 0, Time elapsed: 20.869 sec
> - in org.apache.hadoop.hbase.fs.TestBlockReorder
> Running org.apache.hadoop.hbase.wal.TestWALReaderOnSecureWAL
> Running org.apache.hadoop.hbase.wal.TestWALFactory
> Tests run: 2, Failures: 0, Errors: 0, Skipped: 0, Time elapsed: 2.755 sec
> - in org.apache.hadoop.hbase.wal.TestWALReaderOnSecureWAL
> Running org.apache.hadoop.hbase.wal.TestSecureWAL
> Running org.apache.hadoop.hbase.wal.TestDefaultWALProviderWithHLogKey
> Tests run: 1, Failures: 0, Errors: 0, Skipped: 0, Time elapsed: 3.034 sec
> - in org.apache.hadoop.hbase.wal.TestSecureWAL
> Tests run: 5, Failures: 0, Errors: 0, Skipped: 0, Time elapsed: 6.92 sec -
> in org.apache.hadoop.hbase.wal.TestDefaultWALProviderWithHLogKey
> Running org.apache.hadoop.hbase.wal.TestWALSplit
> Tests run: 9, Failures: 0, Errors: 0, Skipped: 0, Time elapsed: 13.029 sec
> - in org.apache.hadoop.hbase.wal.TestWALFactory
> Running org.apache.hadoop.hbase.wal.TestBoundedRegionGroupingProvider
> Running org.apache.hadoop.hbase.wal.TestWALFiltering
> Tests run: 55, Failures: 0, Errors: 0, Skipped: 0, Time elapsed: 242.007
> sec - in org.apache.hadoop.hbase.security.access.TestAccessController
> Running org.apache.hadoop.hbase.wal.TestDefaultWALProvider
> Tests run: 5, Failures: 0, Errors: 0, Skipped: 0, Time elapsed: 19.888 sec
> - in org.apache.hadoop.hbase.wal.TestBoundedRegionGroupingProvider
> Tests run: 5, Failures: 0, Errors: 0, Skipped: 0, Time elapsed: 7.222 sec
> - in org.apache.hadoop.hbase.wal.TestDefaultWALProvider
> Running org.apache.hadoop.hbase.wal.TestWALSplitCompressed
> Tests run: 1, Failures: 0, Errors: 0, Skipped: 0, Time elapsed: 30.301 sec
> - in org.apache.hadoop.hbase.wal.TestWALFiltering
> Running org.apache.hadoop.hbase.backup.TestHFileArchiving
> Running
> org.apache.hadoop.hbase.backup.example.TestZooKeeperTableArchiveClient
> Tests run: 3, Failures: 0, Errors: 0, Skipped: 0, Time elapsed: 3.842 sec
> - in org.apache.hadoop.hbase.backup.example.TestZooKeeperTableArchiveClient
> Running org.apache.hadoop.hbase.zookeeper.TestHQuorumPeer
> Tests run: 3, Failures: 0, Errors: 0, Skipped: 0, Time elapsed: 18.634 sec
> - in org.apache.hadoop.hbase.zookeeper.TestHQuorumPeer
> Running
> org.apache.hadoop.hbase.zookeeper.lock.TestZKInterProcessReadWriteLock
> Tests run: 5, Failures: 0, Errors: 0, Skipped: 0, Time elapsed: 35.355 sec
> - in org.apache.hadoop.hbase.backup.TestHFileArchiving
> Running org.apache.hadoop.hbase.zookeeper.TestZKTableStateManager
> Tests run: 1, Failures: 0, Errors: 0, Skipped: 0, Time elapsed: 1.073 sec
> - in org.apache.hadoop.hbase.zookeeper.TestZKTableStateManager
> Running org.apache.hadoop.hbase.zookeeper.TestRecoverableZooKeeper
> Tests run: 1, Failures: 0, Errors: 0, Skipped: 0, Time elapsed: 1.221 sec
> - in org.apache.hadoop.hbase.zookeeper.TestRecoverableZooKeeper
> Running org.apache.hadoop.hbase.zookeeper.TestZKLeaderManager
> Tests run: 1, Failures: 0, Errors: 0, Skipped: 0, Time elapsed: 0.112 sec
> - in org.apache.hadoop.hbase.zookeeper.TestZKLeaderManager
> Running org.apache.hadoop.hbase.zookeeper.TestZooKeeperACL
> Tests run: 6, Failures: 0, Errors: 0, Skipped: 0, Time elapsed: 0.265 sec
> - in org.apache.hadoop.hbase.zookeeper.TestZooKeeperACL
> Running org.apache.hadoop.hbase.zookeeper.TestZooKeeperNodeTracker
> Tests run: 6, Failures: 0, Errors: 0, Skipped: 0, Time elapsed: 24.449 sec
> - in org.apache.hadoop.hbase.zookeeper.lock.TestZKInterProcessReadWriteLock
> Tests run: 3, Failures: 0, Errors: 0, Skipped: 0, Time elapsed: 0.929 sec
> - in org.apache.hadoop.hbase.zookeeper.TestZooKeeperNodeTracker
> Running org.apache.hadoop.hbase.zookeeper.TestZKMulti
> Tests run: 6, Failures: 0, Errors: 0, Skipped: 0, Time elapsed: 0.279 sec
> - in org.apache.hadoop.hbase.zookeeper.TestZKMulti
> Running org.apache.hadoop.hbase.mapreduce.TestTableInputFormatScan2
> Running org.apache.hadoop.hbase.mapreduce.TestTableMapReduce
> Tests run: 31, Failures: 0, Errors: 0, Skipped: 0, Time elapsed: 190.783
> sec - in org.apache.hadoop.hbase.wal.TestWALSplit
> Running org.apache.hadoop.hbase.mapreduce.TestHLogRecordReader
> Tests run: 2, Failures: 0, Errors: 0, Skipped: 0, Time elapsed: 1.651 sec
> - in org.apache.hadoop.hbase.mapreduce.TestHLogRecordReader
> Tests run: 31, Failures: 0, Errors: 0, Skipped: 0, Time elapsed: 188.686
> sec - in org.apache.hadoop.hbase.wal.TestWALSplitCompressed
> Running org.apache.hadoop.hbase.mapreduce.TestImportExport
> Running org.apache.hadoop.hbase.mapreduce.TestWALPlayer
> Running org.apache.hadoop.hbase.mapreduce.TestCopyTable
> Tests run: 2, Failures: 0, Errors: 0, Skipped: 0, Time elapsed: 176.746
> sec - in org.apache.hadoop.hbase.mapreduce.TestTableMapReduce
> Tests run: 4, Failures: 0, Errors: 0, Skipped: 0, Time elapsed: 56.661 sec
> - in org.apache.hadoop.hbase.mapreduce.TestWALPlayer
> Running
> org.apache.hadoop.hbase.mapreduce.TestImportTSVWithOperationAttributes
> Running org.apache.hadoop.hbase.mapreduce.TestRowCounter
> Tests run: 2, Failures: 0, Errors: 0, Skipped: 0, Time elapsed: 60.199 sec
> - in org.apache.hadoop.hbase.mapreduce.TestImportTSVWithOperationAttributes
> Tests run: 5, Failures: 0, Errors: 0, Skipped: 0, Time elapsed: 140.828
> sec - in org.apache.hadoop.hbase.mapreduce.TestCopyTable
> Running org.apache.hadoop.hbase.mapreduce.TestImportTsv
> Tests run: 7, Failures: 0, Errors: 0, Skipped: 0, Time elapsed: 292.808
> sec - in org.apache.hadoop.hbase.mapreduce.TestTableInputFormatScan2
> Running
> org.apache.hadoop.hbase.mapreduce.TestLoadIncrementalHFilesUseSecurityEndPoint
> Running org.apache.hadoop.hbase.mapreduce.TestSecureLoadIncrementalHFiles
> Tests run: 15, Failures: 0, Errors: 0, Skipped: 0, Time elapsed: 34.631
> sec - in
> org.apache.hadoop.hbase.mapreduce.TestLoadIncrementalHFilesUseSecurityEndPoint
> Tests run: 15, Failures: 0, Errors: 0, Skipped: 0, Time elapsed: 35.08 sec
> - in org.apache.hadoop.hbase.mapreduce.TestSecureLoadIncrementalHFiles
> Running org.apache.hadoop.hbase.mapreduce.TestTimeRangeMapRed
> Running org.apache.hadoop.hbase.mapreduce.TestTableInputFormat
> Tests run: 1, Failures: 0, Errors: 0, Skipped: 0, Time elapsed: 65.259 sec
> - in org.apache.hadoop.hbase.mapreduce.TestTimeRangeMapRed
> Running org.apache.hadoop.hbase.mapreduce.TestTableSnapshotInputFormat
> Tests run: 6, Failures: 0, Errors: 0, Skipped: 0, Time elapsed: 275.513
> sec - in org.apache.hadoop.hbase.mapreduce.TestRowCounter
> Running org.apache.hadoop.hbase.mapreduce.TestImportTSVWithTTLs
> Tests run: 8, Failures: 0, Errors: 0, Skipped: 0, Time elapsed: 165.143
> sec - in org.apache.hadoop.hbase.mapreduce.TestTableInputFormat
> Tests run: 10, Failures: 0, Errors: 0, Skipped: 0, Time elapsed: 243.063
> sec - in org.apache.hadoop.hbase.mapreduce.TestImportTsv
> Running org.apache.hadoop.hbase.mapreduce.TestLoadIncrementalHFiles
> Tests run: 12, Failures: 0, Errors: 0, Skipped: 0, Time elapsed: 451.193
> sec - in org.apache.hadoop.hbase.mapreduce.TestImportExport
> Tests run: 15, Failures: 0, Errors: 0, Skipped: 0, Time elapsed: 29.374
> sec - in org.apache.hadoop.hbase.mapreduce.TestLoadIncrementalHFiles
> Running org.apache.hadoop.hbase.mapreduce.TestHRegionPartitioner
> Tests run: 1, Failures: 0, Errors: 0, Skipped: 0, Time elapsed: 3.41 sec -
> in org.apache.hadoop.hbase.mapreduce.TestHRegionPartitioner
> Running org.apache.hadoop.hbase.mapreduce.TestHFileOutputFormat
> Running
> org.apache.hadoop.hbase.mapreduce.TestLoadIncrementalHFilesSplitRecovery
> Tests run: 1, Failures: 0, Errors: 0, Skipped: 0, Time elapsed: 74.943 sec
> - in org.apache.hadoop.hbase.mapreduce.TestImportTSVWithTTLs
> Running org.apache.hadoop.hbase.mapreduce.TestImportTSVWithVisibilityLabels
> Tests run: 5, Failures: 0, Errors: 0, Skipped: 0, Time elapsed: 16.012 sec
> - in
> org.apache.hadoop.hbase.mapreduce.TestLoadIncrementalHFilesSplitRecovery
> Running org.apache.hadoop.hbase.mapreduce.TestHFileOutputFormat2
> Running org.apache.hadoop.hbase.mapreduce.TestMultithreadedTableMapper
> Tests run: 7, Failures: 0, Errors: 0, Skipped: 0, Time elapsed: 283.063
> sec - in org.apache.hadoop.hbase.mapreduce.TestTableSnapshotInputFormat
> Running org.apache.hadoop.hbase.mapreduce.TestTableInputFormatScan1
> Tests run: 1, Failures: 0, Errors: 0, Skipped: 0, Time elapsed: 114.14 sec
> - in org.apache.hadoop.hbase.mapreduce.TestMultithreadedTableMapper
> Running org.apache.hadoop.hbase.mapreduce.TestCellCounter
> Tests run: 5, Failures: 0, Errors: 0, Skipped: 0, Time elapsed: 188.179
> sec - in org.apache.hadoop.hbase.mapreduce.TestImportTSVWithVisibilityLabels
> Running org.apache.hadoop.hbase.mapreduce.TestWALRecordReader
> Tests run: 2, Failures: 0, Errors: 0, Skipped: 0, Time elapsed: 0.83 sec -
> in org.apache.hadoop.hbase.mapreduce.TestWALRecordReader
> Running org.apache.hadoop.hbase.mapreduce.TestMultiTableInputFormat
> Tests run: 13, Failures: 0, Errors: 0, Skipped: 1, Time elapsed: 271.663
> sec - in org.apache.hadoop.hbase.mapreduce.TestHFileOutputFormat
> Running
> org.apache.hadoop.hbase.mapreduce.TestSecureLoadIncrementalHFilesSplitRecovery
> Tests run: 5, Failures: 0, Errors: 0, Skipped: 0, Time elapsed: 17.646 sec
> - in
> org.apache.hadoop.hbase.mapreduce.TestSecureLoadIncrementalHFilesSplitRecovery
> Running org.apache.hadoop.hbase.filter.TestScanRowPrefix
> Tests run: 13, Failures: 0, Errors: 0, Skipped: 1, Time elapsed: 291.838
> sec - in org.apache.hadoop.hbase.mapreduce.TestHFileOutputFormat2
> Tests run: 1, Failures: 0, Errors: 0, Skipped: 0, Time elapsed: 2.251 sec
> - in org.apache.hadoop.hbase.filter.TestScanRowPrefix
> Running org.apache.hadoop.hbase.filter.TestFuzzyRowAndColumnRangeFilter
> Running org.apache.hadoop.hbase.filter.TestFilterWithScanLimits
> Tests run: 1, Failures: 0, Errors: 0, Skipped: 0, Time elapsed: 1.895 sec
> - in org.apache.hadoop.hbase.filter.TestFilterWithScanLimits
> Tests run: 1, Failures: 0, Errors: 0, Skipped: 0, Time elapsed: 2.569 sec
> - in org.apache.hadoop.hbase.filter.TestFuzzyRowAndColumnRangeFilter
> Running org.apache.hadoop.hbase.filter.TestColumnRangeFilter
> Running org.apache.hadoop.hbase.filter.TestFilterWrapper
> Tests run: 1, Failures: 0, Errors: 0, Skipped: 0, Time elapsed: 2.572 sec
> - in org.apache.hadoop.hbase.filter.TestFilterWrapper
> Tests run: 1, Failures: 0, Errors: 0, Skipped: 0, Time elapsed: 9.646 sec
> - in org.apache.hadoop.hbase.filter.TestColumnRangeFilter
> Running org.apache.hadoop.hbase.TestMetaTableAccessor
> Tests run: 8, Failures: 0, Errors: 0, Skipped: 0, Time elapsed: 8.988 sec
> - in org.apache.hadoop.hbase.TestMetaTableAccessor
> Tests run: 7, Failures: 0, Errors: 0, Skipped: 0, Time elapsed: 261.268
> sec - in org.apache.hadoop.hbase.mapreduce.TestTableInputFormatScan1
> Tests run: 4, Failures: 0, Errors: 0, Skipped: 0, Time elapsed: 173.741
> sec - in org.apache.hadoop.hbase.mapreduce.TestMultiTableInputFormat
> Tests run: 7, Failures: 0, Errors: 0, Skipped: 0, Time elapsed: 274.663
> sec - in org.apache.hadoop.hbase.mapreduce.TestCellCounter
>
> Results :
>
>
>
>
> Tests run: 2331, Failures: 0, Errors: 0, Skipped: 18
>
> [INFO]
> ------------------------------------------------------------------------
> [INFO] Reactor Summary:
> [INFO]
> [INFO] HBase ............................................. SUCCESS [3.526s]
> [INFO] HBase - Checkstyle ................................ SUCCESS [0.693s]
> [INFO] HBase - Annotations ............................... SUCCESS [0.881s]
> [INFO] HBase - Common .................................... SUCCESS
> [1:03.160s]
> [INFO] HBase - Protocol .................................. SUCCESS [8.988s]
> [INFO] HBase - Client .................................... SUCCESS
> [1:18.488s]
> [INFO] HBase - Hadoop Compatibility ...................... SUCCESS [7.009s]
> [INFO] HBase - Hadoop Two Compatibility .................. SUCCESS [6.215s]
> [INFO] HBase - Prefix Tree ............................... SUCCESS [8.304s]
> [INFO] HBase - Server .................................... FAILURE
> [1:10:57.296s]
> [INFO] HBase - Testing Util .............................. SKIPPED
> [INFO] HBase - Thrift .................................... SKIPPED
> [INFO] HBase - Rest ...................................... SKIPPED
> [INFO] HBase - Shell ..................................... SKIPPED
> [INFO] HBase - Integration Tests ......................... SKIPPED
> [INFO] HBase - Examples .................................. SKIPPED
> [INFO] HBase - Assembly .................................. SKIPPED
> [INFO]
> ------------------------------------------------------------------------
> [INFO] BUILD FAILURE
> [INFO]
> ------------------------------------------------------------------------
> [INFO] Total time: 1:13:55.414s
> [INFO] Finished at: Wed Mar 11 15:53:45 UTC 2015
> [INFO] Final Memory: 46M/533M
> [INFO]
> ------------------------------------------------------------------------
> [ERROR] Failed to execute goal
> org.apache.maven.plugins:maven-surefire-plugin:2.18:test
> (secondPartTestsExecution) on project hbase-server: There was a timeout or
> other error in the fork -> [Help 1]
> [ERROR]
> [ERROR] To see the full stack trace of the errors, re-run Maven with the
> -e switch.
> [ERROR] Re-run Maven using the -X switch to enable full debug logging.
> [ERROR]
> [ERROR] For more information about the errors and possible solutions,
> please read the following articles:
> [ERROR] [Help 1]
> http://cwiki.apache.org/confluence/display/MAVEN/MojoFailureException
> [ERROR]
> [ERROR] After correcting the problems, you can resume the build with the
> command
> [ERROR]   mvn <goals> -rf :hbase-server
> Build step 'Invoke top-level Maven targets' marked build as failure
> Performing Post build task...
> Match found for :.* : True
> Logical operation result is TRUE
> Running script  :   ZOMBIE_TESTS_COUNT=`jps | grep surefirebooter | wc -l`
>   if [[ $ZOMBIE_TESTS_COUNT != 0 ]] ; then
>     #It seems sometimes the tests are not dying immediately. Let's give
> them 10s
>     echo "Suspicious java process found - waiting 10s to see if there are
> just slow to stop"
>     sleep 10
>     ZOMBIE_TESTS_COUNT=`jps | grep surefirebooter | wc -l`
>     if [[ $ZOMBIE_TESTS_COUNT != 0 ]] ; then
>       echo "There are $ZOMBIE_TESTS_COUNT zombie tests, they should have
> been killed by surefire but survived"
>       echo "************ BEGIN zombies jstack extract"
>       ZB_STACK=`jps | grep surefirebooter | cut -d ' ' -f 1 | xargs -n 1
> jstack | grep ".test" | grep "\.java"`
>       jps | grep surefirebooter | cut -d ' ' -f 1 | xargs -n 1 jstack
>       echo "************ END  zombies jstack extract"
>       JIRA_COMMENT="$JIRA_COMMENT
>
>      {color:red}-1 core zombie tests{color}.  There are
> ${ZOMBIE_TESTS_COUNT} zombie test(s): ${ZB_STACK}"
>       BAD=1
>       jps | grep surefirebooter | cut -d ' ' -f 1 | xargs kill -9
>     else
>       echo "We're ok: there is no zombie test, but some tests took some
> time to stop"
>     fi
>   else
>     echo "We're ok: there is no zombie test"
>   fi
> [HBase-1.0] $ /bin/bash -xe /tmp/hudson843412663011830238.sh
> ++ jps
> ++ grep surefirebooter
> ++ wc -l
> + ZOMBIE_TESTS_COUNT=1
> + [[ 1 != 0 ]]
> + echo 'Suspicious java process found - waiting 10s to see if there are
> just slow to stop'
> Suspicious java process found - waiting 10s to see if there are just slow
> to stop
> + sleep 10
> ++ jps
> ++ grep surefirebooter
> ++ wc -l
> + ZOMBIE_TESTS_COUNT=0
> + [[ 0 != 0 ]]
> + echo 'We'\''re ok: there is no zombie test, but some tests took some
> time to stop'
> We're ok: there is no zombie test, but some tests took some time to stop
> POST BUILD TASK : SUCCESS
> END OF POST BUILD TASK : 0
> Archiving artifacts
> Sending artifact delta relative to HBase-1.0 #794
> Archived 1861 artifacts
> Archive block size is 32768
> Received 27 blocks and 401645577 bytes
> Compression is 0.2%
> Took 2 min 5 sec
> Recording test results
> Updating HBASE-12931
>

Mime
  • Unnamed multipart/alternative (inline, None, 0 bytes)
View raw message