hbase-builds mailing list archives

Site index · List index
Message view « Date » · « Thread »
Top « Date » · « Thread »
From Stack <st...@duboce.net>
Subject Re: Build failed in Jenkins: HBase-1.1 #257
Date Sat, 07 Mar 2015 04:29:30 GMT
kalashnikov:hbase.git stack$ python ./dev-support/findHangingTests.py
https://builds.apache.org/job/HBase-1.1/257/consoleText
Fetching the console output from the URL
Printing hanging tests
Hanging test : org.apache.hadoop.hbase.master.TestDistributedLogSplitting
Printing Failing tests

On Fri, Mar 6, 2015 at 7:05 PM, Apache Jenkins Server <
jenkins@builds.apache.org> wrote:

> See <https://builds.apache.org/job/HBase-1.1/257/changes>
>
> Changes:
>
> [enis] HBASE-12706 Support multiple port numbers in ZK quorum string
> (Stephen Yuan Jiang)
>
> ------------------------------------------
> [...truncated 1860 lines...]
> Tests run: 9, Failures: 0, Errors: 0, Skipped: 0, Time elapsed: 2.974 sec
> - in org.apache.hadoop.hbase.client.TestHTablePool$TestHTableThreadLocalPool
> Running org.apache.hadoop.hbase.client.TestTableSnapshotScanner
> Tests run: 5, Failures: 0, Errors: 0, Skipped: 0, Time elapsed: 84.201 sec
> - in org.apache.hadoop.hbase.client.TestRestoreSnapshotFromClient
> Running org.apache.hadoop.hbase.client.TestClientScannerRPCTimeout
> Tests run: 1, Failures: 0, Errors: 0, Skipped: 0, Time elapsed: 8.643 sec
> - in org.apache.hadoop.hbase.client.TestClientScannerRPCTimeout
> Running org.apache.hadoop.hbase.client.TestAdmin2
> Tests run: 14, Failures: 0, Errors: 0, Skipped: 0, Time elapsed: 108.818
> sec - in org.apache.hadoop.hbase.client.TestReplicasClient
> Tests run: 3, Failures: 0, Errors: 0, Skipped: 0, Time elapsed: 38.929 sec
> - in org.apache.hadoop.hbase.client.TestTableSnapshotScanner
> Running org.apache.hadoop.hbase.client.TestHTableUtil
> Tests run: 2, Failures: 0, Errors: 0, Skipped: 0, Time elapsed: 3.021 sec
> - in org.apache.hadoop.hbase.client.TestHTableUtil
> Running org.apache.hadoop.hbase.client.TestUpdateConfiguration
> Tests run: 2, Failures: 0, Errors: 0, Skipped: 0, Time elapsed: 0.226 sec
> - in org.apache.hadoop.hbase.client.TestUpdateConfiguration
> Running org.apache.hadoop.hbase.client.TestScannersFromClientSide
> Running org.apache.hadoop.hbase.client.TestFromClientSide
> Tests run: 5, Failures: 0, Errors: 0, Skipped: 0, Time elapsed: 5.534 sec
> - in org.apache.hadoop.hbase.client.TestScannersFromClientSide
> Running
> org.apache.hadoop.hbase.client.TestSnapshotFromClientWithRegionReplicas
> Tests run: 5, Failures: 0, Errors: 0, Skipped: 0, Time elapsed: 13.773 sec
> - in org.apache.hadoop.hbase.client.TestSnapshotFromClientWithRegionReplicas
> Tests run: 23, Failures: 0, Errors: 0, Skipped: 0, Time elapsed: 56.227
> sec - in org.apache.hadoop.hbase.client.TestAdmin2
> Tests run: 5, Failures: 0, Errors: 0, Skipped: 0, Time elapsed: 93.182 sec
> - in
> org.apache.hadoop.hbase.client.TestRestoreSnapshotFromClientWithRegionReplicas
> Running org.apache.hadoop.hbase.client.TestCheckAndMutate
> Tests run: 1, Failures: 0, Errors: 0, Skipped: 0, Time elapsed: 2.573 sec
> - in org.apache.hadoop.hbase.client.TestCheckAndMutate
> Tests run: 21, Failures: 0, Errors: 0, Skipped: 3, Time elapsed: 145.695
> sec - in org.apache.hadoop.hbase.client.TestHCM
> Running org.apache.hadoop.hbase.client.TestSnapshotMetadata
> Running org.apache.hadoop.hbase.TestDrainingServer
> Tests run: 2, Failures: 0, Errors: 0, Skipped: 0, Time elapsed: 2.234 sec
> - in org.apache.hadoop.hbase.TestDrainingServer
> Running org.apache.hadoop.hbase.client.TestClientOperationInterrupt
> Running org.apache.hadoop.hbase.client.TestFromClientSideWithCoprocessor
> Running org.apache.hadoop.hbase.TestMetaTableAccessor
> Tests run: 4, Failures: 0, Errors: 0, Skipped: 0, Time elapsed: 14.647 sec
> - in org.apache.hadoop.hbase.client.TestSnapshotMetadata
> Running org.apache.hadoop.hbase.util.hbck.TestOfflineMetaRebuildBase
> Tests run: 11, Failures: 0, Errors: 0, Skipped: 0, Time elapsed: 9.357 sec
> - in org.apache.hadoop.hbase.TestMetaTableAccessor
> Running org.apache.hadoop.hbase.util.hbck.TestOfflineMetaRebuildOverlap
> Tests run: 1, Failures: 0, Errors: 0, Skipped: 0, Time elapsed: 21.314 sec
> - in org.apache.hadoop.hbase.util.hbck.TestOfflineMetaRebuildBase
> Running org.apache.hadoop.hbase.util.hbck.TestOfflineMetaRebuildHole
> Tests run: 1, Failures: 0, Errors: 0, Skipped: 0, Time elapsed: 20.146 sec
> - in org.apache.hadoop.hbase.util.hbck.TestOfflineMetaRebuildOverlap
> Running org.apache.hadoop.hbase.util.TestTableName
> Tests run: 6, Failures: 0, Errors: 0, Skipped: 0, Time elapsed: 0.618 sec
> - in org.apache.hadoop.hbase.util.TestTableName
> Running org.apache.hadoop.hbase.util.TestCoprocessorScanPolicy
> Tests run: 81, Failures: 0, Errors: 0, Skipped: 4, Time elapsed: 91.549
> sec - in org.apache.hadoop.hbase.client.TestFromClientSide
> Running org.apache.hadoop.hbase.util.TestMiniClusterLoadEncoded
> Tests run: 1, Failures: 0, Errors: 0, Skipped: 0, Time elapsed: 53.996 sec
> - in org.apache.hadoop.hbase.client.TestClientOperationInterrupt
> Tests run: 4, Failures: 0, Errors: 0, Skipped: 0, Time elapsed: 4.83 sec -
> in org.apache.hadoop.hbase.util.TestCoprocessorScanPolicy
> Tests run: 1, Failures: 0, Errors: 0, Skipped: 0, Time elapsed: 20.347 sec
> - in org.apache.hadoop.hbase.util.hbck.TestOfflineMetaRebuildHole
> Running org.apache.hadoop.hbase.util.TestIdLock
> Running org.apache.hadoop.hbase.util.TestMiniClusterLoadSequential
> Running org.apache.hadoop.hbase.util.TestMergeTable
> Tests run: 1, Failures: 0, Errors: 0, Skipped: 0, Time elapsed: 15.544 sec
> - in org.apache.hadoop.hbase.util.TestIdLock
> Running org.apache.hadoop.hbase.util.TestHBaseFsckEncryption
> Tests run: 1, Failures: 0, Errors: 0, Skipped: 0, Time elapsed: 23.979 sec
> - in org.apache.hadoop.hbase.util.TestMergeTable
> Running org.apache.hadoop.hbase.util.TestMiniClusterLoadParallel
> Tests run: 1, Failures: 0, Errors: 0, Skipped: 0, Time elapsed: 12.739 sec
> - in org.apache.hadoop.hbase.util.TestHBaseFsckEncryption
> Tests run: 5, Failures: 0, Errors: 0, Skipped: 0, Time elapsed: 47.226 sec
> - in org.apache.hadoop.hbase.util.TestMiniClusterLoadEncoded
> Tests run: 81, Failures: 0, Errors: 0, Skipped: 4, Time elapsed: 94.238
> sec - in org.apache.hadoop.hbase.client.TestFromClientSideWithCoprocessor
> Tests run: 4, Failures: 0, Errors: 0, Skipped: 0, Time elapsed: 44.292 sec
> - in org.apache.hadoop.hbase.util.TestMiniClusterLoadSequential
> Running org.apache.hadoop.hbase.util.TestHBaseFsck
> Running org.apache.hadoop.hbase.util.TestProcessBasedCluster
> Tests run: 1, Failures: 0, Errors: 0, Skipped: 0, Time elapsed: 0.125 sec
> - in org.apache.hadoop.hbase.util.TestProcessBasedCluster
> Running org.apache.hadoop.hbase.util.TestMergeTool
> Running org.apache.hadoop.hbase.util.TestFSTableDescriptors
> Running org.apache.hadoop.hbase.util.TestFSHDFSUtils
> Tests run: 15, Failures: 0, Errors: 0, Skipped: 0, Time elapsed: 2.628 sec
> - in org.apache.hadoop.hbase.util.TestFSTableDescriptors
> Running org.apache.hadoop.hbase.util.TestFSVisitor
> Tests run: 3, Failures: 0, Errors: 0, Skipped: 0, Time elapsed: 5.835 sec
> - in org.apache.hadoop.hbase.util.TestFSHDFSUtils
> Running org.apache.hadoop.hbase.util.TestFSUtils
> Tests run: 3, Failures: 0, Errors: 0, Skipped: 0, Time elapsed: 3.821 sec
> - in org.apache.hadoop.hbase.util.TestFSVisitor
> Running org.apache.hadoop.hbase.util.TestDefaultEnvironmentEdge
> Tests run: 1, Failures: 0, Errors: 0, Skipped: 0, Time elapsed: 0.377 sec
> - in org.apache.hadoop.hbase.util.TestDefaultEnvironmentEdge
> Tests run: 7, Failures: 0, Errors: 0, Skipped: 0, Time elapsed: 10.948 sec
> - in org.apache.hadoop.hbase.util.TestFSUtils
> Running org.apache.hadoop.hbase.util.TestRegionSplitter
> Running org.apache.hadoop.hbase.wal.TestWALFiltering
> Tests run: 1, Failures: 0, Errors: 0, Skipped: 0, Time elapsed: 21.135 sec
> - in org.apache.hadoop.hbase.util.TestMergeTool
> Tests run: 4, Failures: 0, Errors: 0, Skipped: 0, Time elapsed: 43.05 sec
> - in org.apache.hadoop.hbase.util.TestMiniClusterLoadParallel
> Running org.apache.hadoop.hbase.wal.TestWALReaderOnSecureWAL
> Tests run: 2, Failures: 0, Errors: 0, Skipped: 0, Time elapsed: 1.984 sec
> - in org.apache.hadoop.hbase.wal.TestWALReaderOnSecureWAL
> Running org.apache.hadoop.hbase.wal.TestDefaultWALProviderWithHLogKey
> Tests run: 6, Failures: 0, Errors: 0, Skipped: 0, Time elapsed: 7.53 sec -
> in org.apache.hadoop.hbase.util.TestRegionSplitter
> Running org.apache.hadoop.hbase.wal.TestSecureWAL
> Tests run: 1, Failures: 0, Errors: 0, Skipped: 0, Time elapsed: 1.555 sec
> - in org.apache.hadoop.hbase.wal.TestSecureWAL
> Running org.apache.hadoop.hbase.wal.TestWALSplit
> Tests run: 5, Failures: 0, Errors: 0, Skipped: 0, Time elapsed: 6.979 sec
> - in org.apache.hadoop.hbase.wal.TestDefaultWALProviderWithHLogKey
> Running org.apache.hadoop.hbase.wal.TestWALSplitCompressed
> Running org.apache.hadoop.hbase.wal.TestDefaultWALProvider
> Tests run: 5, Failures: 0, Errors: 0, Skipped: 0, Time elapsed: 6.674 sec
> - in org.apache.hadoop.hbase.wal.TestDefaultWALProvider
> Tests run: 1, Failures: 0, Errors: 0, Skipped: 0, Time elapsed: 25.821 sec
> - in org.apache.hadoop.hbase.wal.TestWALFiltering
> Running org.apache.hadoop.hbase.wal.TestWALFactory
> Running org.apache.hadoop.hbase.wal.TestBoundedRegionGroupingProvider
> Tests run: 9, Failures: 0, Errors: 0, Skipped: 0, Time elapsed: 11.564 sec
> - in org.apache.hadoop.hbase.wal.TestWALFactory
> Tests run: 5, Failures: 0, Errors: 0, Skipped: 0, Time elapsed: 20.149 sec
> - in org.apache.hadoop.hbase.wal.TestBoundedRegionGroupingProvider
> Running org.apache.hadoop.hbase.constraint.TestConstraint
> Running org.apache.hadoop.hbase.TestNamespace
> Tests run: 5, Failures: 0, Errors: 0, Skipped: 0, Time elapsed: 7.798 sec
> - in org.apache.hadoop.hbase.constraint.TestConstraint
> Tests run: 9, Failures: 0, Errors: 0, Skipped: 1, Time elapsed: 7.082 sec
> - in org.apache.hadoop.hbase.TestNamespace
> Running org.apache.hadoop.hbase.TestMetaMigrationConvertingToPB
> Running org.apache.hadoop.hbase.TestInfoServers
> Tests run: 3, Failures: 0, Errors: 0, Skipped: 0, Time elapsed: 2.234 sec
> - in org.apache.hadoop.hbase.TestMetaMigrationConvertingToPB
> Running org.apache.hadoop.hbase.TestRegionRebalancing
> Tests run: 3, Failures: 0, Errors: 0, Skipped: 0, Time elapsed: 2.575 sec
> - in org.apache.hadoop.hbase.TestInfoServers
> Running org.apache.hadoop.hbase.filter.TestMultiRowRangeFilter
> Tests run: 18, Failures: 0, Errors: 0, Skipped: 0, Time elapsed: 12.12 sec
> - in org.apache.hadoop.hbase.filter.TestMultiRowRangeFilter
> Tests run: 2, Failures: 0, Errors: 0, Skipped: 0, Time elapsed: 31.538 sec
> - in org.apache.hadoop.hbase.TestRegionRebalancing
> Running org.apache.hadoop.hbase.filter.TestScanRowPrefix
> Tests run: 1, Failures: 0, Errors: 0, Skipped: 0, Time elapsed: 2.941 sec
> - in org.apache.hadoop.hbase.filter.TestScanRowPrefix
> Running org.apache.hadoop.hbase.filter.TestFilterWrapper
> Tests run: 1, Failures: 0, Errors: 0, Skipped: 0, Time elapsed: 2.012 sec
> - in org.apache.hadoop.hbase.filter.TestFilterWrapper
> Running org.apache.hadoop.hbase.filter.TestFuzzyRowAndColumnRangeFilter
> Tests run: 1, Failures: 0, Errors: 0, Skipped: 0, Time elapsed: 2.4 sec -
> in org.apache.hadoop.hbase.filter.TestFuzzyRowAndColumnRangeFilter
> Running org.apache.hadoop.hbase.filter.TestColumnRangeFilter
> Running org.apache.hadoop.hbase.filter.TestFilterWithScanLimits
> Tests run: 1, Failures: 0, Errors: 0, Skipped: 0, Time elapsed: 7.458 sec
> - in org.apache.hadoop.hbase.filter.TestColumnRangeFilter
> Tests run: 1, Failures: 0, Errors: 0, Skipped: 0, Time elapsed: 2.398 sec
> - in org.apache.hadoop.hbase.filter.TestFilterWithScanLimits
> Running org.apache.hadoop.hbase.io.TestFileLink
> Running org.apache.hadoop.hbase.io.hfile.TestScannerSelectionUsingTTL
> Tests run: 5, Failures: 0, Errors: 0, Skipped: 0, Time elapsed: 12.284 sec
> - in org.apache.hadoop.hbase.io.TestFileLink
> Running org.apache.hadoop.hbase.io.hfile.TestCacheConfig
> Tests run: 6, Failures: 0, Errors: 0, Skipped: 0, Time elapsed: 1.592 sec
> - in org.apache.hadoop.hbase.io.hfile.TestCacheConfig
> Running org.apache.hadoop.hbase.io.hfile.TestHFileSeek
> Tests run: 1, Failures: 0, Errors: 0, Skipped: 0, Time elapsed: 1.893 sec
> - in org.apache.hadoop.hbase.io.hfile.TestHFileSeek
> Running org.apache.hadoop.hbase.io.hfile.TestForceCacheImportantBlocks
> Tests run: 4, Failures: 0, Errors: 0, Skipped: 0, Time elapsed: 34.009 sec
> - in org.apache.hadoop.hbase.io.hfile.TestForceCacheImportantBlocks
> Running org.apache.hadoop.hbase.io.hfile.TestCacheOnWrite
> Tests run: 31, Failures: 0, Errors: 0, Skipped: 0, Time elapsed: 190.934
> sec - in org.apache.hadoop.hbase.wal.TestWALSplit
> Running org.apache.hadoop.hbase.io.hfile.TestHFileBlock
> Tests run: 6, Failures: 0, Errors: 0, Skipped: 0, Time elapsed: 62.893 sec
> - in org.apache.hadoop.hbase.io.hfile.TestScannerSelectionUsingTTL
> Tests run: 31, Failures: 0, Errors: 0, Skipped: 0, Time elapsed: 199.543
> sec - in org.apache.hadoop.hbase.wal.TestWALSplitCompressed
> Running org.apache.hadoop.hbase.io.hfile.TestHFileBlockIndex
> Running org.apache.hadoop.hbase.io.encoding.TestLoadAndSwitchEncodeOnDisk
> Tests run: 10, Failures: 0, Errors: 0, Skipped: 0, Time elapsed: 12.706
> sec - in org.apache.hadoop.hbase.io.hfile.TestHFileBlockIndex
> Running org.apache.hadoop.hbase.io.encoding.TestBufferedDataBlockEncoder
> Tests run: 1, Failures: 0, Errors: 0, Skipped: 0, Time elapsed: 27.007 sec
> - in org.apache.hadoop.hbase.io.encoding.TestLoadAndSwitchEncodeOnDisk
> Running org.apache.hadoop.hbase.io.encoding.TestEncodedSeekers
> Tests run: 1, Failures: 0, Errors: 0, Skipped: 0, Time elapsed: 24.712 sec
> - in org.apache.hadoop.hbase.io.encoding.TestBufferedDataBlockEncoder
> Running org.apache.hadoop.hbase.io.encoding.TestDataBlockEncoders
> Tests run: 51, Failures: 0, Errors: 0, Skipped: 1, Time elapsed: 282.722
> sec - in org.apache.hadoop.hbase.util.TestHBaseFsck
> Running org.apache.hadoop.hbase.io.encoding.TestChangingEncoding
> Tests run: 28, Failures: 0, Errors: 0, Skipped: 0, Time elapsed: 91.341
> sec - in org.apache.hadoop.hbase.io.hfile.TestHFileBlock
> Running org.apache.hadoop.hbase.TestClusterBootOrder
> Tests run: 2, Failures: 0, Errors: 0, Skipped: 0, Time elapsed: 27.9 sec -
> in org.apache.hadoop.hbase.TestClusterBootOrder
> Tests run: 20, Failures: 0, Errors: 0, Skipped: 0, Time elapsed: 119.017
> sec - in org.apache.hadoop.hbase.io.encoding.TestEncodedSeekers
> Tests run: 3, Failures: 0, Errors: 0, Skipped: 0, Time elapsed: 104.607
> sec - in org.apache.hadoop.hbase.io.encoding.TestChangingEncoding
> Tests run: 28, Failures: 0, Errors: 0, Skipped: 0, Time elapsed: 222.343
> sec - in org.apache.hadoop.hbase.io.encoding.TestDataBlockEncoders
> Tests run: 216, Failures: 0, Errors: 0, Skipped: 0, Time elapsed: 364.604
> sec - in org.apache.hadoop.hbase.io.hfile.TestCacheOnWrite
>
> Results :
>
>
>
>
> Tests run: 2438, Failures: 0, Errors: 0, Skipped: 18
>
> [INFO]
> ------------------------------------------------------------------------
> [INFO] Reactor Summary:
> [INFO]
> [INFO] HBase ............................................. SUCCESS [2.933s]
> [INFO] HBase - Checkstyle ................................ SUCCESS [0.560s]
> [INFO] HBase - Annotations ............................... SUCCESS [0.867s]
> [INFO] HBase - Common .................................... SUCCESS
> [1:19.877s]
> [INFO] HBase - Protocol .................................. SUCCESS [9.050s]
> [INFO] HBase - Client .................................... SUCCESS
> [1:16.694s]
> [INFO] HBase - Hadoop Compatibility ...................... SUCCESS [7.091s]
> [INFO] HBase - Hadoop Two Compatibility .................. SUCCESS [6.461s]
> [INFO] HBase - Prefix Tree ............................... SUCCESS [8.776s]
> [INFO] HBase - Server .................................... FAILURE
> [1:12:07.556s]
> [INFO] HBase - Testing Util .............................. SKIPPED
> [INFO] HBase - Thrift .................................... SKIPPED
> [INFO] HBase - Rest ...................................... SKIPPED
> [INFO] HBase - Shell ..................................... SKIPPED
> [INFO] HBase - Integration Tests ......................... SKIPPED
> [INFO] HBase - Examples .................................. SKIPPED
> [INFO] HBase - Assembly .................................. SKIPPED
> [INFO]
> ------------------------------------------------------------------------
> [INFO] BUILD FAILURE
> [INFO]
> ------------------------------------------------------------------------
> [INFO] Total time: 1:15:21.696s
> [INFO] Finished at: Sat Mar 07 03:02:42 UTC 2015
> [INFO] Final Memory: 85M/657M
> [INFO]
> ------------------------------------------------------------------------
> [ERROR] Failed to execute goal
> org.apache.maven.plugins:maven-surefire-plugin:2.18:test
> (secondPartTestsExecution) on project hbase-server: There was a timeout or
> other error in the fork -> [Help 1]
> [ERROR]
> [ERROR] To see the full stack trace of the errors, re-run Maven with the
> -e switch.
> [ERROR] Re-run Maven using the -X switch to enable full debug logging.
> [ERROR]
> [ERROR] For more information about the errors and possible solutions,
> please read the following articles:
> [ERROR] [Help 1]
> http://cwiki.apache.org/confluence/display/MAVEN/MojoFailureException
> [ERROR]
> [ERROR] After correcting the problems, you can resume the build with the
> command
> [ERROR]   mvn <goals> -rf :hbase-server
> Build step 'Invoke top-level Maven targets' marked build as failure
> Performing Post build task...
> Match found for :.* : True
> Logical operation result is TRUE
> Running script  :   ZOMBIE_TESTS_COUNT=`jps | grep surefirebooter | wc -l`
>   if [[ $ZOMBIE_TESTS_COUNT != 0 ]] ; then
>     #It seems sometimes the tests are not dying immediately. Let's give
> them 10s
>     echo "Suspicious java process found - waiting 10s to see if there are
> just slow to stop"
>     sleep 10
>     ZOMBIE_TESTS_COUNT=`jps | grep surefirebooter | wc -l`
>     if [[ $ZOMBIE_TESTS_COUNT != 0 ]] ; then
>       echo "There are $ZOMBIE_TESTS_COUNT zombie tests, they should have
> been killed by surefire but survived"
>       echo "************ BEGIN zombies jstack extract"
>       ZB_STACK=`jps | grep surefirebooter | cut -d ' ' -f 1 | xargs -n 1
> jstack | grep ".test" | grep "\.java"`
>       jps | grep surefirebooter | cut -d ' ' -f 1 | xargs -n 1 jstack
>       echo "************ END  zombies jstack extract"
>       JIRA_COMMENT="$JIRA_COMMENT
>
>      {color:red}-1 core zombie tests{color}.  There are
> ${ZOMBIE_TESTS_COUNT} zombie test(s): ${ZB_STACK}"
>       BAD=1
>       jps | grep surefirebooter | cut -d ' ' -f 1 | xargs kill -9
>     else
>       echo "We're ok: there is no zombie test, but some tests took some
> time to stop"
>     fi
>   else
>     echo "We're ok: there is no zombie test"
>   fi
> [HBase-1.1] $ /bin/bash -xe /tmp/hudson2002027667226065158.sh
> ++ jps
> ++ grep surefirebooter
> ++ wc -l
> + ZOMBIE_TESTS_COUNT=1
> + [[ 1 != 0 ]]
> + echo 'Suspicious java process found - waiting 10s to see if there are
> just slow to stop'
> Suspicious java process found - waiting 10s to see if there are just slow
> to stop
> + sleep 10
> ++ jps
> ++ grep surefirebooter
> ++ wc -l
> + ZOMBIE_TESTS_COUNT=1
> + [[ 1 != 0 ]]
> + echo 'There are 1 zombie tests, they should have been killed by surefire
> but survived'
> There are 1 zombie tests, they should have been killed by surefire but
> survived
> + echo '************ BEGIN zombies jstack extract'
> ************ BEGIN zombies jstack extract
> ++ jps
> ++ grep surefirebooter
> ++ cut -d ' ' -f 1
> ++ xargs -n 1 jstack
> ++ grep .test
> ++ grep '\.java'
> + ZB_STACK=
> POST BUILD TASK : FAILURE
> END OF POST BUILD TASK : 0
> Archiving artifacts
> Sending artifact delta relative to HBase-1.1 #252
> Archived 1912 artifacts
> Archive block size is 32768
> Received 27 blocks and 447466788 bytes
> Compression is 0.2%
> Took 1 min 55 sec
> Recording test results
> Updating HBASE-12706
>

Mime
  • Unnamed multipart/alternative (inline, None, 0 bytes)
View raw message