hbase-builds mailing list archives

Site index · List index
Message view « Date » · « Thread »
Top « Date » · « Thread »
From Apache Jenkins Server <jenk...@builds.apache.org>
Subject Build failed in Jenkins: HBase-1.2 #128
Date Wed, 03 Jun 2015 00:39:19 GMT
See <https://builds.apache.org/job/HBase-1.2/128/changes>

Changes:

[ssrungarapu] HBASE-13764 Backport HBASE-7782 (HBaseTestingUtility.truncateTable() not acting
like CLI) to branch-1.x

[ssrungarapu] HBASE-13658 Improve the test run time for TestAccessController class (Ashish
Singhi)

------------------------------------------
[...truncated 1991 lines...]
Running org.apache.hadoop.hbase.coprocessor.TestHTableWrapper
Tests run: 1, Failures: 0, Errors: 0, Skipped: 0, Time elapsed: 5.748 sec - in org.apache.hadoop.hbase.coprocessor.TestHTableWrapper
Tests run: 2, Failures: 0, Errors: 0, Skipped: 0, Time elapsed: 9.622 sec - in org.apache.hadoop.hbase.coprocessor.TestRegionObserverBypass
Running org.apache.hadoop.hbase.backup.example.TestZooKeeperTableArchiveClient
Tests run: 13, Failures: 0, Errors: 0, Skipped: 2, Time elapsed: 65.43 sec - in org.apache.hadoop.hbase.coprocessor.TestRegionObserverInterface
Running org.apache.hadoop.hbase.regionserver.TestHRegionServerBulkLoad
Tests run: 3, Failures: 0, Errors: 0, Skipped: 0, Time elapsed: 4.043 sec - in org.apache.hadoop.hbase.backup.example.TestZooKeeperTableArchiveClient
Running org.apache.hadoop.hbase.backup.TestHFileArchiving
Running org.apache.hadoop.hbase.regionserver.TestScannerRetriableFailure
Tests run: 1, Failures: 0, Errors: 0, Skipped: 0, Time elapsed: 45.035 sec - in org.apache.hadoop.hbase.regionserver.TestHRegionServerBulkLoad
Tests run: 1, Failures: 0, Errors: 0, Skipped: 0, Time elapsed: 36.533 sec - in org.apache.hadoop.hbase.regionserver.TestScannerRetriableFailure
Running org.apache.hadoop.hbase.regionserver.TestReversibleScanners
Tests run: 5, Failures: 0, Errors: 0, Skipped: 0, Time elapsed: 4.8 sec - in org.apache.hadoop.hbase.regionserver.TestReversibleScanners
Running org.apache.hadoop.hbase.regionserver.TestRegionFavoredNodes
Running org.apache.hadoop.hbase.regionserver.TestEndToEndSplitTransaction
Tests run: 5, Failures: 0, Errors: 0, Skipped: 0, Time elapsed: 63.315 sec - in org.apache.hadoop.hbase.backup.TestHFileArchiving
Tests run: 1, Failures: 0, Errors: 0, Skipped: 0, Time elapsed: 9.792 sec - in org.apache.hadoop.hbase.regionserver.TestRegionFavoredNodes
Running org.apache.hadoop.hbase.regionserver.TestClusterId
Running org.apache.hadoop.hbase.regionserver.TestRegionServerNoMaster
Tests run: 2, Failures: 0, Errors: 0, Skipped: 0, Time elapsed: 19.035 sec - in org.apache.hadoop.hbase.regionserver.TestEndToEndSplitTransaction
Running org.apache.hadoop.hbase.regionserver.TestMajorCompaction
Tests run: 9, Failures: 0, Errors: 0, Skipped: 0, Time elapsed: 18.196 sec - in org.apache.hadoop.hbase.regionserver.TestRegionServerNoMaster
Tests run: 2, Failures: 0, Errors: 0, Skipped: 0, Time elapsed: 29.741 sec - in org.apache.hadoop.hbase.regionserver.TestClusterId
Running org.apache.hadoop.hbase.regionserver.TestRegionReplicaFailover
Running org.apache.hadoop.hbase.regionserver.TestServerCustomProtocol
Tests run: 9, Failures: 0, Errors: 0, Skipped: 0, Time elapsed: 327.459 sec - in org.apache.hadoop.hbase.snapshot.TestSecureExportSnapshot
Tests run: 9, Failures: 0, Errors: 0, Skipped: 0, Time elapsed: 314.556 sec - in org.apache.hadoop.hbase.snapshot.TestExportSnapshot
Running org.apache.hadoop.hbase.regionserver.TestPriorityRpc
Tests run: 4, Failures: 0, Errors: 0, Skipped: 0, Time elapsed: 2.995 sec - in org.apache.hadoop.hbase.regionserver.TestPriorityRpc
Running org.apache.hadoop.hbase.regionserver.TestBlocksRead
Tests run: 7, Failures: 0, Errors: 0, Skipped: 0, Time elapsed: 43.904 sec - in org.apache.hadoop.hbase.regionserver.TestMajorCompaction
Running org.apache.hadoop.hbase.regionserver.TestEncryptionKeyRotation
Running org.apache.hadoop.hbase.regionserver.TestSplitLogWorker
Tests run: 4, Failures: 0, Errors: 0, Skipped: 0, Time elapsed: 2.281 sec - in org.apache.hadoop.hbase.regionserver.TestBlocksRead
Running org.apache.hadoop.hbase.regionserver.TestZKLessMergeOnCluster
Tests run: 2, Failures: 0, Errors: 0, Skipped: 0, Time elapsed: 16.967 sec - in org.apache.hadoop.hbase.regionserver.TestEncryptionKeyRotation
Running org.apache.hadoop.hbase.regionserver.TestRegionServerHostname
Tests run: 7, Failures: 0, Errors: 0, Skipped: 0, Time elapsed: 43.449 sec - in org.apache.hadoop.hbase.regionserver.TestServerCustomProtocol
Tests run: 7, Failures: 0, Errors: 0, Skipped: 0, Time elapsed: 22.317 sec - in org.apache.hadoop.hbase.regionserver.TestSplitLogWorker
Running org.apache.hadoop.hbase.regionserver.TestJoinedScanners
Running org.apache.hadoop.hbase.regionserver.TestZKLessSplitOnCluster
Tests run: 4, Failures: 0, Errors: 0, Skipped: 0, Time elapsed: 25.494 sec - in org.apache.hadoop.hbase.regionserver.TestZKLessMergeOnCluster
Tests run: 2, Failures: 0, Errors: 0, Skipped: 0, Time elapsed: 16.286 sec - in org.apache.hadoop.hbase.regionserver.TestRegionServerHostname
Running org.apache.hadoop.hbase.regionserver.TestMinorCompaction
Tests run: 6, Failures: 0, Errors: 0, Skipped: 0, Time elapsed: 3.859 sec - in org.apache.hadoop.hbase.regionserver.TestMinorCompaction
Running org.apache.hadoop.hbase.regionserver.TestRegionServerMetrics
Tests run: 1, Failures: 0, Errors: 0, Skipped: 0, Time elapsed: 26.515 sec - in org.apache.hadoop.hbase.regionserver.TestJoinedScanners
Running org.apache.hadoop.hbase.regionserver.TestTags
Running org.apache.hadoop.hbase.regionserver.TestScannerHeartbeatMessages
Tests run: 10, Failures: 0, Errors: 0, Skipped: 0, Time elapsed: 20.854 sec - in org.apache.hadoop.hbase.regionserver.TestRegionServerMetrics
Running org.apache.hadoop.hbase.regionserver.TestHRegionOnCluster
Tests run: 1, Failures: 0, Errors: 0, Skipped: 0, Time elapsed: 15.514 sec - in org.apache.hadoop.hbase.regionserver.TestHRegionOnCluster
Tests run: 1, Failures: 0, Errors: 0, Skipped: 0, Time elapsed: 26.316 sec - in org.apache.hadoop.hbase.regionserver.TestScannerHeartbeatMessages
Running org.apache.hadoop.hbase.regionserver.TestRowTooBig
Running org.apache.hadoop.hbase.regionserver.TestSCVFWithMiniCluster
Tests run: 5, Failures: 0, Errors: 0, Skipped: 0, Time elapsed: 0.399 sec - in org.apache.hadoop.hbase.regionserver.TestSCVFWithMiniCluster
Tests run: 4, Failures: 0, Errors: 0, Skipped: 0, Time elapsed: 52.229 sec - in org.apache.hadoop.hbase.regionserver.TestTags
Running org.apache.hadoop.hbase.regionserver.TestPerColumnFamilyFlush
Tests run: 2, Failures: 0, Errors: 0, Skipped: 0, Time elapsed: 15.992 sec - in org.apache.hadoop.hbase.regionserver.TestRowTooBig
Running org.apache.hadoop.hbase.regionserver.TestSeekOptimizations
Tests run: 17, Failures: 0, Errors: 0, Skipped: 0, Time elapsed: 80.703 sec - in org.apache.hadoop.hbase.regionserver.TestZKLessSplitOnCluster
Running org.apache.hadoop.hbase.regionserver.TestCompactionState
Tests run: 6, Failures: 0, Errors: 0, Skipped: 0, Time elapsed: 6.095 sec - in org.apache.hadoop.hbase.regionserver.TestSeekOptimizations
Running org.apache.hadoop.hbase.regionserver.TestCompactionWithCoprocessor
Running org.apache.hadoop.hbase.regionserver.TestRegionReplicas
Tests run: 5, Failures: 0, Errors: 0, Skipped: 0, Time elapsed: 24.165 sec - in org.apache.hadoop.hbase.regionserver.TestCompactionWithCoprocessor
Running org.apache.hadoop.hbase.regionserver.TestStoreScanner
Tests run: 16, Failures: 0, Errors: 0, Skipped: 0, Time elapsed: 0.863 sec - in org.apache.hadoop.hbase.regionserver.TestStoreScanner
Running org.apache.hadoop.hbase.regionserver.TestHRegionReplayEvents
Tests run: 26, Failures: 0, Errors: 0, Skipped: 0, Time elapsed: 14.332 sec - in org.apache.hadoop.hbase.regionserver.TestHRegionReplayEvents
Running org.apache.hadoop.hbase.regionserver.TestCacheOnWriteInSchema
Tests run: 5, Failures: 0, Errors: 0, Skipped: 0, Time elapsed: 46.277 sec - in org.apache.hadoop.hbase.regionserver.TestCompactionState
Tests run: 3, Failures: 0, Errors: 0, Skipped: 0, Time elapsed: 3.087 sec - in org.apache.hadoop.hbase.regionserver.TestCacheOnWriteInSchema
Running org.apache.hadoop.hbase.regionserver.wal.TestReadOldRootAndMetaEdits
Tests run: 1, Failures: 0, Errors: 0, Skipped: 0, Time elapsed: 0.295 sec - in org.apache.hadoop.hbase.regionserver.wal.TestReadOldRootAndMetaEdits
Running org.apache.hadoop.hbase.regionserver.wal.TestFSHLog
Running org.apache.hadoop.hbase.regionserver.wal.TestWALReplayCompressed
Tests run: 6, Failures: 0, Errors: 0, Skipped: 0, Time elapsed: 4.812 sec - in org.apache.hadoop.hbase.regionserver.wal.TestFSHLog
Running org.apache.hadoop.hbase.regionserver.wal.TestSecureWALReplay
Tests run: 6, Failures: 0, Errors: 0, Skipped: 0, Time elapsed: 100.71 sec - in org.apache.hadoop.hbase.regionserver.TestPerColumnFamilyFlush
Tests run: 12, Failures: 0, Errors: 0, Skipped: 0, Time elapsed: 243.723 sec - in org.apache.hadoop.hbase.regionserver.TestRegionReplicaFailover
Running org.apache.hadoop.hbase.regionserver.wal.TestLogRollAbort
Tests run: 9, Failures: 0, Errors: 0, Skipped: 0, Time elapsed: 40.127 sec - in org.apache.hadoop.hbase.regionserver.wal.TestWALReplayCompressed
Running org.apache.hadoop.hbase.regionserver.wal.TestLogRolling
Running org.apache.hadoop.hbase.regionserver.wal.TestWALReplay
Tests run: 9, Failures: 0, Errors: 0, Skipped: 0, Time elapsed: 42.395 sec - in org.apache.hadoop.hbase.regionserver.wal.TestSecureWALReplay
Tests run: 2, Failures: 0, Errors: 0, Skipped: 0, Time elapsed: 21.04 sec - in org.apache.hadoop.hbase.regionserver.wal.TestLogRollAbort
Running org.apache.hadoop.hbase.regionserver.wal.TestProtobufLog
Tests run: 1, Failures: 0, Errors: 0, Skipped: 0, Time elapsed: 1.436 sec - in org.apache.hadoop.hbase.regionserver.wal.TestProtobufLog
Running org.apache.hadoop.hbase.regionserver.wal.TestDurability
Tests run: 3, Failures: 0, Errors: 0, Skipped: 0, Time elapsed: 2.349 sec - in org.apache.hadoop.hbase.regionserver.wal.TestDurability
Running org.apache.hadoop.hbase.regionserver.wal.TestLogRollPeriod
Running org.apache.hadoop.hbase.regionserver.TestScannerWithBulkload
Tests run: 9, Failures: 0, Errors: 0, Skipped: 0, Time elapsed: 39.452 sec - in org.apache.hadoop.hbase.regionserver.wal.TestWALReplay
Tests run: 3, Failures: 0, Errors: 0, Skipped: 0, Time elapsed: 9.187 sec - in org.apache.hadoop.hbase.regionserver.TestScannerWithBulkload
Running org.apache.hadoop.hbase.regionserver.TestDefaultMemStore
Running org.apache.hadoop.hbase.regionserver.TestEncryptionRandomKeying
Tests run: 1, Failures: 0, Errors: 0, Skipped: 0, Time elapsed: 1.887 sec - in org.apache.hadoop.hbase.regionserver.TestEncryptionRandomKeying
Running org.apache.hadoop.hbase.regionserver.handler.TestOpenRegionHandler
Tests run: 6, Failures: 0, Errors: 0, Skipped: 0, Time elapsed: 1.821 sec - in org.apache.hadoop.hbase.regionserver.handler.TestOpenRegionHandler
Running org.apache.hadoop.hbase.regionserver.handler.TestCloseRegionHandler
Tests run: 3, Failures: 0, Errors: 0, Skipped: 0, Time elapsed: 1.914 sec - in org.apache.hadoop.hbase.regionserver.handler.TestCloseRegionHandler
Running org.apache.hadoop.hbase.regionserver.TestMasterAddressTracker
Tests run: 5, Failures: 0, Errors: 0, Skipped: 0, Time elapsed: 0.91 sec - in org.apache.hadoop.hbase.regionserver.TestMasterAddressTracker
Running org.apache.hadoop.hbase.regionserver.TestSplitTransactionOnCluster
Tests run: 24, Failures: 0, Errors: 0, Skipped: 0, Time elapsed: 25.04 sec - in org.apache.hadoop.hbase.regionserver.TestDefaultMemStore
Running org.apache.hadoop.hbase.regionserver.TestParallelPut
Tests run: 7, Failures: 0, Errors: 0, Skipped: 0, Time elapsed: 174.292 sec - in org.apache.hadoop.hbase.regionserver.TestRegionReplicas
Tests run: 2, Failures: 0, Errors: 0, Skipped: 0, Time elapsed: 58.241 sec - in org.apache.hadoop.hbase.regionserver.wal.TestLogRollPeriod
Running org.apache.hadoop.hbase.regionserver.TestCorruptedRegionStoreFile
Running org.apache.hadoop.hbase.regionserver.TestRegionServerOnlineConfigChange
Tests run: 2, Failures: 0, Errors: 0, Skipped: 0, Time elapsed: 2.007 sec - in org.apache.hadoop.hbase.regionserver.TestRegionServerOnlineConfigChange
Running org.apache.hadoop.hbase.regionserver.TestCompaction
Tests run: 5, Failures: 0, Errors: 0, Skipped: 0, Time elapsed: 23.511 sec - in org.apache.hadoop.hbase.regionserver.TestCompaction
Running org.apache.hadoop.hbase.regionserver.TestRegionMergeTransactionOnCluster
Tests run: 2, Failures: 0, Errors: 0, Skipped: 0, Time elapsed: 74.823 sec - in org.apache.hadoop.hbase.regionserver.TestParallelPut
Running org.apache.hadoop.hbase.regionserver.TestRecoveredEdits
Tests run: 4, Failures: 0, Errors: 0, Skipped: 0, Time elapsed: 23.032 sec - in org.apache.hadoop.hbase.regionserver.TestRegionMergeTransactionOnCluster
Tests run: 17, Failures: 0, Errors: 0, Skipped: 0, Time elapsed: 86.45 sec - in org.apache.hadoop.hbase.regionserver.TestSplitTransactionOnCluster
Running org.apache.hadoop.hbase.regionserver.TestCompoundBloomFilter
Running org.apache.hadoop.hbase.regionserver.TestGetClosestAtOrBefore
Tests run: 3, Failures: 0, Errors: 0, Skipped: 0, Time elapsed: 2.007 sec - in org.apache.hadoop.hbase.regionserver.TestGetClosestAtOrBefore
Running org.apache.hadoop.hbase.regionserver.TestRegionServerReportForDuty
Tests run: 1, Failures: 0, Errors: 0, Skipped: 0, Time elapsed: 11.307 sec - in org.apache.hadoop.hbase.regionserver.TestRecoveredEdits
Running org.apache.hadoop.hbase.regionserver.TestHRegion
Tests run: 1, Failures: 0, Errors: 0, Skipped: 0, Time elapsed: 13.44 sec - in org.apache.hadoop.hbase.regionserver.TestRegionServerReportForDuty
Running org.apache.hadoop.hbase.regionserver.compactions.TestCompactionWithThroughputController
Tests run: 3, Failures: 0, Errors: 0, Skipped: 0, Time elapsed: 20.816 sec - in org.apache.hadoop.hbase.regionserver.TestCompoundBloomFilter
Running org.apache.hadoop.hbase.regionserver.TestAtomicOperation
Tests run: 6, Failures: 0, Errors: 0, Skipped: 0, Time elapsed: 39.823 sec - in org.apache.hadoop.hbase.regionserver.TestAtomicOperation
Running org.apache.hadoop.hbase.regionserver.TestFSErrorsExposed
Tests run: 3, Failures: 0, Errors: 0, Skipped: 0, Time elapsed: 63.416 sec - in org.apache.hadoop.hbase.regionserver.compactions.TestCompactionWithThroughputController
Running org.apache.hadoop.hbase.regionserver.TestRSKilledWhenInitializing
Tests run: 2, Failures: 0, Errors: 0, Skipped: 0, Time elapsed: 157.043 sec - in org.apache.hadoop.hbase.regionserver.TestCorruptedRegionStoreFile
Running org.apache.hadoop.hbase.regionserver.TestMultiColumnScanner
Tests run: 3, Failures: 0, Errors: 0, Skipped: 0, Time elapsed: 31.472 sec - in org.apache.hadoop.hbase.regionserver.TestFSErrorsExposed
Running org.apache.hadoop.hbase.regionserver.TestFlushRegionEntry
Tests run: 1, Failures: 0, Errors: 0, Skipped: 0, Time elapsed: 0.711 sec - in org.apache.hadoop.hbase.regionserver.TestFlushRegionEntry
Running org.apache.hadoop.hbase.regionserver.TestStore
Tests run: 1, Failures: 0, Errors: 0, Skipped: 0, Time elapsed: 17.046 sec - in org.apache.hadoop.hbase.regionserver.TestRSKilledWhenInitializing
Running org.apache.hadoop.hbase.TestMetaTableLocator
Tests run: 5, Failures: 0, Errors: 0, Skipped: 0, Time elapsed: 262.328 sec - in org.apache.hadoop.hbase.regionserver.wal.TestLogRolling
Tests run: 7, Failures: 0, Errors: 0, Skipped: 0, Time elapsed: 3.554 sec - in org.apache.hadoop.hbase.TestMetaTableLocator
Tests run: 18, Failures: 0, Errors: 0, Skipped: 0, Time elapsed: 13.714 sec - in org.apache.hadoop.hbase.regionserver.TestStore
Running org.apache.hadoop.hbase.namespace.TestNamespaceAuditor
Running org.apache.hadoop.hbase.namespace.TestZKLessNamespaceAuditor
Tests run: 93, Failures: 0, Errors: 0, Skipped: 0, Time elapsed: 120.513 sec - in org.apache.hadoop.hbase.regionserver.TestHRegion
Tests run: 12, Failures: 0, Errors: 0, Skipped: 0, Time elapsed: 54.949 sec - in org.apache.hadoop.hbase.regionserver.TestMultiColumnScanner
Tests run: 12, Failures: 0, Errors: 0, Skipped: 0, Time elapsed: 97.148 sec - in org.apache.hadoop.hbase.namespace.TestZKLessNamespaceAuditor
Tests run: 12, Failures: 0, Errors: 0, Skipped: 0, Time elapsed: 99.426 sec - in org.apache.hadoop.hbase.namespace.TestNamespaceAuditor

Results :




Tests run: 2567, Failures: 0, Errors: 0, Skipped: 17

[INFO] ------------------------------------------------------------------------
[INFO] Reactor Summary:
[INFO] 
[INFO] HBase ............................................. SUCCESS [3.513s]
[INFO] HBase - Checkstyle ................................ SUCCESS [0.777s]
[INFO] HBase - Annotations ............................... SUCCESS [0.941s]
[INFO] HBase - Protocol .................................. SUCCESS [13.660s]
[INFO] HBase - Common .................................... SUCCESS [1:31.323s]
[INFO] HBase - Procedure ................................. SUCCESS [2:00.329s]
[INFO] HBase - Client .................................... SUCCESS [1:49.434s]
[INFO] HBase - Hadoop Compatibility ...................... SUCCESS [10.429s]
[INFO] HBase - Hadoop Two Compatibility .................. SUCCESS [7.336s]
[INFO] HBase - Prefix Tree ............................... SUCCESS [10.196s]
[INFO] HBase - Server .................................... FAILURE [1:39:30.897s]
[INFO] HBase - Testing Util .............................. SKIPPED
[INFO] HBase - Thrift .................................... SKIPPED
[INFO] HBase - Rest ...................................... SKIPPED
[INFO] HBase - Shell ..................................... SKIPPED
[INFO] HBase - Integration Tests ......................... SKIPPED
[INFO] HBase - Examples .................................. SKIPPED
[INFO] HBase - Assembly .................................. SKIPPED
[INFO] HBase - Shaded .................................... SKIPPED
[INFO] HBase - Shaded - Client ........................... SKIPPED
[INFO] HBase - Shaded - Server ........................... SKIPPED
[INFO] ------------------------------------------------------------------------
[INFO] BUILD FAILURE
[INFO] ------------------------------------------------------------------------
[INFO] Total time: 1:45:40.889s
[INFO] Finished at: Wed Jun 03 00:36:02 UTC 2015
[INFO] Final Memory: 91M/634M
[INFO] ------------------------------------------------------------------------
[ERROR] Failed to execute goal org.apache.maven.plugins:maven-surefire-plugin:2.18:test (secondPartTestsExecution)
on project hbase-server: ExecutionException: java.lang.RuntimeException: The forked VM terminated
without properly saying goodbye. VM crash or System.exit called?
[ERROR] Command was /bin/sh -c cd <https://builds.apache.org/job/HBase-1.2/ws/hbase-server>
&& /home/jenkins/jenkins-slave/tools/hudson.model.JDK/jdk-1.7u51/jre/bin/java -enableassertions
-XX:MaxDirectMemorySize=1G -Xmx2800m -XX:MaxPermSize=256m -Djava.security.egd=file:/dev/./urandom
-Djava.net.preferIPv4Stack=true -Djava.awt.headless=true -jar <https://builds.apache.org/job/HBase-1.2/ws/hbase-server/target/surefire/surefirebooter5959095959008727693.jar>
<https://builds.apache.org/job/HBase-1.2/ws/hbase-server/target/surefire/surefire4768140673901482640tmp>
<https://builds.apache.org/job/HBase-1.2/ws/hbase-server/target/surefire/surefire_10713560540685271484405tmp>
[ERROR] -> [Help 1]
[ERROR] 
[ERROR] To see the full stack trace of the errors, re-run Maven with the -e switch.
[ERROR] Re-run Maven using the -X switch to enable full debug logging.
[ERROR] 
[ERROR] For more information about the errors and possible solutions, please read the following
articles:
[ERROR] [Help 1] http://cwiki.apache.org/confluence/display/MAVEN/MojoFailureException
[ERROR] 
[ERROR] After correcting the problems, you can resume the build with the command
[ERROR]   mvn <goals> -rf :hbase-server
Build step 'Invoke top-level Maven targets' marked build as failure
Performing Post build task...
Match found for :.* : True
Logical operation result is TRUE
Running script  :   ZOMBIE_TESTS_COUNT=`jps | grep surefirebooter | wc -l`
  if [[ $ZOMBIE_TESTS_COUNT != 0 ]] ; then
    #It seems sometimes the tests are not dying immediately. Let's give them 10s
    echo "Suspicious java process found - waiting 10s to see if there are just slow to stop"
    sleep 10   
    ZOMBIE_TESTS_COUNT=`jps | grep surefirebooter | wc -l`
    if [[ $ZOMBIE_TESTS_COUNT != 0 ]] ; then
      echo "There are $ZOMBIE_TESTS_COUNT zombie tests, they should have been killed by surefire
but survived"
      echo "************ BEGIN zombies jstack extract"
      ZB_STACK=`jps | grep surefirebooter | cut -d ' ' -f 1 | xargs -n 1 jstack | grep ".test"
| grep "\.java"`
      jps | grep surefirebooter | cut -d ' ' -f 1 | xargs -n 1 jstack
      echo "************ END  zombies jstack extract"
      JIRA_COMMENT="$JIRA_COMMENT

     {color:red}-1 core zombie tests{color}.  There are ${ZOMBIE_TESTS_COUNT} zombie test(s):
${ZB_STACK}"
      BAD=1
      jps | grep surefirebooter | cut -d ' ' -f 1 | xargs kill -9
    else
      echo "We're ok: there is no zombie test, but some tests took some time to stop"
    fi
  else
    echo "We're ok: there is no zombie test"
  fi
[HBase-1.2] $ /bin/bash -xe /tmp/hudson7477434217005145272.sh
++ jps
++ wc -l
++ grep surefirebooter
+ ZOMBIE_TESTS_COUNT=0
+ [[ 0 != 0 ]]
+ echo 'We'\''re ok: there is no zombie test'
We're ok: there is no zombie test
POST BUILD TASK : SUCCESS
END OF POST BUILD TASK : 0
Archiving artifacts
Sending artifact delta relative to HBase-1.2 #126
Archived 2058 artifacts
Archive block size is 32768
Received 39 blocks and 473334359 bytes
Compression is 0.3%
Took 3 min 2 sec
Recording test results
Updating HBASE-7782
Updating HBASE-13764
Updating HBASE-13658

Mime
View raw message