hbase-builds mailing list archives

Site index · List index
Message view « Date » · « Thread »
Top « Date » · « Thread »
From Apache Jenkins Server <jenk...@builds.apache.org>
Subject Build failed in Jenkins: HBase-1.2 #122
Date Mon, 01 Jun 2015 16:25:36 GMT
See <https://builds.apache.org/job/HBase-1.2/122/changes>

Changes:

[busbey] HBASE-13344 Addendum - Move max Java version check to release.

------------------------------------------
[...truncated 2092 lines...]
Running org.apache.hadoop.hbase.regionserver.TestRegionServerHostname
Tests run: 1, Failures: 0, Errors: 0, Skipped: 0, Time elapsed: 21.817 sec - in org.apache.hadoop.hbase.regionserver.TestRegionServerReportForDuty
Running org.apache.hadoop.hbase.regionserver.TestParallelPut
Tests run: 3, Failures: 0, Errors: 0, Skipped: 0, Time elapsed: 62.244 sec - in org.apache.hadoop.hbase.regionserver.compactions.TestCompactionWithThroughputController
Tests run: 2, Failures: 0, Errors: 0, Skipped: 0, Time elapsed: 20.228 sec - in org.apache.hadoop.hbase.regionserver.TestRegionServerHostname
Running org.apache.hadoop.hbase.regionserver.TestHRegionServerBulkLoad
Running org.apache.hadoop.hbase.regionserver.TestJoinedScanners
Tests run: 1, Failures: 0, Errors: 0, Skipped: 0, Time elapsed: 31.597 sec - in org.apache.hadoop.hbase.regionserver.TestJoinedScanners
Tests run: 2, Failures: 0, Errors: 0, Skipped: 0, Time elapsed: 51.455 sec - in org.apache.hadoop.hbase.regionserver.TestParallelPut
Running org.apache.hadoop.hbase.regionserver.TestReversibleScanners
Running org.apache.hadoop.hbase.regionserver.TestSplitTransactionOnCluster
Tests run: 81, Failures: 0, Errors: 0, Skipped: 4, Time elapsed: 213.888 sec - in org.apache.hadoop.hbase.client.TestFromClientSideWithCoprocessor
Running org.apache.hadoop.hbase.regionserver.TestHRegion
Tests run: 5, Failures: 0, Errors: 0, Skipped: 0, Time elapsed: 4.944 sec - in org.apache.hadoop.hbase.regionserver.TestReversibleScanners
Tests run: 1, Failures: 0, Errors: 0, Skipped: 0, Time elapsed: 45.594 sec - in org.apache.hadoop.hbase.regionserver.TestHRegionServerBulkLoad
Running org.apache.hadoop.hbase.regionserver.TestHRegionOnCluster
Tests run: 12, Failures: 0, Errors: 0, Skipped: 0, Time elapsed: 77.008 sec - in org.apache.hadoop.hbase.regionserver.TestMultiColumnScanner
Running org.apache.hadoop.hbase.regionserver.TestRecoveredEdits
Running org.apache.hadoop.hbase.regionserver.TestRegionServerOnlineConfigChange
Tests run: 2, Failures: 0, Errors: 0, Skipped: 0, Time elapsed: 1.648 sec - in org.apache.hadoop.hbase.regionserver.TestRegionServerOnlineConfigChange
Running org.apache.hadoop.hbase.regionserver.TestHRegionReplayEvents
Tests run: 1, Failures: 0, Errors: 0, Skipped: 0, Time elapsed: 17.223 sec - in org.apache.hadoop.hbase.regionserver.TestHRegionOnCluster
Tests run: 1, Failures: 0, Errors: 0, Skipped: 0, Time elapsed: 12.689 sec - in org.apache.hadoop.hbase.regionserver.TestRecoveredEdits
Running org.apache.hadoop.hbase.regionserver.TestScannerRetriableFailure
Running org.apache.hadoop.hbase.regionserver.TestEndToEndSplitTransaction
Tests run: 26, Failures: 0, Errors: 0, Skipped: 0, Time elapsed: 16.169 sec - in org.apache.hadoop.hbase.regionserver.TestHRegionReplayEvents
Running org.apache.hadoop.hbase.regionserver.TestStore
Tests run: 18, Failures: 0, Errors: 0, Skipped: 0, Time elapsed: 14.052 sec - in org.apache.hadoop.hbase.regionserver.TestStore
Tests run: 2, Failures: 0, Errors: 0, Skipped: 0, Time elapsed: 18.756 sec - in org.apache.hadoop.hbase.regionserver.TestEndToEndSplitTransaction
Running org.apache.hadoop.hbase.regionserver.TestGetClosestAtOrBefore
Tests run: 3, Failures: 0, Errors: 0, Skipped: 0, Time elapsed: 1.905 sec - in org.apache.hadoop.hbase.regionserver.TestGetClosestAtOrBefore
Running org.apache.hadoop.hbase.regionserver.TestCacheOnWriteInSchema
Tests run: 3, Failures: 0, Errors: 0, Skipped: 0, Time elapsed: 2.936 sec - in org.apache.hadoop.hbase.regionserver.TestCacheOnWriteInSchema
Running org.apache.hadoop.hbase.regionserver.TestSeekOptimizations
Running org.apache.hadoop.hbase.regionserver.TestSCVFWithMiniCluster
Tests run: 5, Failures: 0, Errors: 0, Skipped: 0, Time elapsed: 0.446 sec - in org.apache.hadoop.hbase.regionserver.TestSCVFWithMiniCluster
Tests run: 6, Failures: 0, Errors: 0, Skipped: 0, Time elapsed: 5.493 sec - in org.apache.hadoop.hbase.regionserver.TestSeekOptimizations
Tests run: 1, Failures: 0, Errors: 0, Skipped: 0, Time elapsed: 35.263 sec - in org.apache.hadoop.hbase.regionserver.TestScannerRetriableFailure
Running org.apache.hadoop.hbase.regionserver.wal.TestProtobufLog
Tests run: 1, Failures: 0, Errors: 0, Skipped: 0, Time elapsed: 1.685 sec - in org.apache.hadoop.hbase.regionserver.wal.TestProtobufLog
Running org.apache.hadoop.hbase.regionserver.wal.TestWALReplay
Running org.apache.hadoop.hbase.regionserver.wal.TestWALReplayCompressed
Running org.apache.hadoop.hbase.regionserver.wal.TestLogRollPeriod
Tests run: 17, Failures: 0, Errors: 0, Skipped: 0, Time elapsed: 92.2 sec - in org.apache.hadoop.hbase.regionserver.TestSplitTransactionOnCluster
Running org.apache.hadoop.hbase.regionserver.wal.TestLogRolling
Tests run: 93, Failures: 0, Errors: 0, Skipped: 0, Time elapsed: 110.643 sec - in org.apache.hadoop.hbase.regionserver.TestHRegion
Tests run: 9, Failures: 0, Errors: 0, Skipped: 0, Time elapsed: 38.332 sec - in org.apache.hadoop.hbase.regionserver.wal.TestWALReplay
Tests run: 9, Failures: 0, Errors: 0, Skipped: 0, Time elapsed: 40.628 sec - in org.apache.hadoop.hbase.regionserver.wal.TestWALReplayCompressed
Running org.apache.hadoop.hbase.regionserver.wal.TestLogRollAbort
Running org.apache.hadoop.hbase.regionserver.wal.TestSecureWALReplay
Running org.apache.hadoop.hbase.regionserver.wal.TestFSHLog
Tests run: 6, Failures: 0, Errors: 0, Skipped: 0, Time elapsed: 4.23 sec - in org.apache.hadoop.hbase.regionserver.wal.TestFSHLog
Running org.apache.hadoop.hbase.regionserver.wal.TestReadOldRootAndMetaEdits
Tests run: 1, Failures: 0, Errors: 0, Skipped: 0, Time elapsed: 0.217 sec - in org.apache.hadoop.hbase.regionserver.wal.TestReadOldRootAndMetaEdits
Running org.apache.hadoop.hbase.regionserver.wal.TestDurability
Tests run: 3, Failures: 0, Errors: 0, Skipped: 0, Time elapsed: 2.526 sec - in org.apache.hadoop.hbase.regionserver.wal.TestDurability
Tests run: 2, Failures: 0, Errors: 0, Skipped: 0, Time elapsed: 21.151 sec - in org.apache.hadoop.hbase.regionserver.wal.TestLogRollAbort
Running org.apache.hadoop.hbase.regionserver.TestMinorCompaction
Tests run: 2, Failures: 0, Errors: 0, Skipped: 0, Time elapsed: 57.586 sec - in org.apache.hadoop.hbase.regionserver.wal.TestLogRollPeriod
Tests run: 6, Failures: 0, Errors: 0, Skipped: 0, Time elapsed: 4.073 sec - in org.apache.hadoop.hbase.regionserver.TestMinorCompaction
Running org.apache.hadoop.hbase.regionserver.TestDefaultMemStore
Running org.apache.hadoop.hbase.regionserver.TestRegionMergeTransactionOnCluster
Running org.apache.hadoop.hbase.regionserver.TestZKLessMergeOnCluster
Tests run: 9, Failures: 0, Errors: 0, Skipped: 0, Time elapsed: 41.675 sec - in org.apache.hadoop.hbase.regionserver.wal.TestSecureWALReplay
Tests run: 24, Failures: 0, Errors: 0, Skipped: 0, Time elapsed: 26.795 sec - in org.apache.hadoop.hbase.regionserver.TestDefaultMemStore
Running org.apache.hadoop.hbase.regionserver.TestServerCustomProtocol
Tests run: 4, Failures: 0, Errors: 0, Skipped: 0, Time elapsed: 24.604 sec - in org.apache.hadoop.hbase.regionserver.TestRegionMergeTransactionOnCluster
Running org.apache.hadoop.hbase.regionserver.TestCorruptedRegionStoreFile
Tests run: 4, Failures: 0, Errors: 0, Skipped: 0, Time elapsed: 24.535 sec - in org.apache.hadoop.hbase.regionserver.TestZKLessMergeOnCluster
Running org.apache.hadoop.hbase.regionserver.TestPerColumnFamilyFlush
Running org.apache.hadoop.hbase.regionserver.TestRegionFavoredNodes
Tests run: 1, Failures: 0, Errors: 0, Skipped: 0, Time elapsed: 9.145 sec - in org.apache.hadoop.hbase.regionserver.TestRegionFavoredNodes
Running org.apache.hadoop.hbase.regionserver.TestZKLessSplitOnCluster
Tests run: 7, Failures: 0, Errors: 0, Skipped: 0, Time elapsed: 42.89 sec - in org.apache.hadoop.hbase.regionserver.TestServerCustomProtocol
Running org.apache.hadoop.hbase.regionserver.TestRowTooBig
Tests run: 2, Failures: 0, Errors: 0, Skipped: 0, Time elapsed: 16.083 sec - in org.apache.hadoop.hbase.regionserver.TestRowTooBig
Running org.apache.hadoop.hbase.regionserver.TestScannerHeartbeatMessages
Tests run: 1, Failures: 0, Errors: 0, Skipped: 0, Time elapsed: 26.464 sec - in org.apache.hadoop.hbase.regionserver.TestScannerHeartbeatMessages
Running org.apache.hadoop.hbase.regionserver.TestCompactionWithCoprocessor
Tests run: 17, Failures: 0, Errors: 0, Skipped: 0, Time elapsed: 77.273 sec - in org.apache.hadoop.hbase.regionserver.TestZKLessSplitOnCluster
Running org.apache.hadoop.hbase.regionserver.TestAtomicOperation
Tests run: 6, Failures: 0, Errors: 0, Skipped: 0, Time elapsed: 104.573 sec - in org.apache.hadoop.hbase.regionserver.TestPerColumnFamilyFlush
Running org.apache.hadoop.hbase.regionserver.TestSplitLogWorker
Tests run: 5, Failures: 0, Errors: 0, Skipped: 0, Time elapsed: 28.858 sec - in org.apache.hadoop.hbase.regionserver.TestCompactionWithCoprocessor
Tests run: 7, Failures: 0, Errors: 0, Skipped: 0, Time elapsed: 22.849 sec - in org.apache.hadoop.hbase.regionserver.TestSplitLogWorker
Running org.apache.hadoop.hbase.regionserver.TestRegionReplicaFailover
Running org.apache.hadoop.hbase.regionserver.TestMajorCompaction
Tests run: 6, Failures: 0, Errors: 0, Skipped: 0, Time elapsed: 41.812 sec - in org.apache.hadoop.hbase.regionserver.TestAtomicOperation
Running org.apache.hadoop.hbase.regionserver.TestClusterId
Tests run: 2, Failures: 0, Errors: 0, Skipped: 0, Time elapsed: 25.326 sec - in org.apache.hadoop.hbase.regionserver.TestClusterId
Tests run: 2, Failures: 0, Errors: 0, Skipped: 0, Time elapsed: 181.661 sec - in org.apache.hadoop.hbase.regionserver.TestCorruptedRegionStoreFile
Running org.apache.hadoop.hbase.regionserver.TestFSErrorsExposed
Tests run: 7, Failures: 0, Errors: 0, Skipped: 0, Time elapsed: 47.717 sec - in org.apache.hadoop.hbase.regionserver.TestMajorCompaction
Running org.apache.hadoop.hbase.regionserver.TestCompactionState
Running org.apache.hadoop.hbase.regionserver.TestRegionReplicas
Tests run: 5, Failures: 0, Errors: 0, Skipped: 0, Time elapsed: 282.309 sec - in org.apache.hadoop.hbase.regionserver.wal.TestLogRolling
Running org.apache.hadoop.hbase.regionserver.TestEncryptionKeyRotation
Tests run: 3, Failures: 0, Errors: 0, Skipped: 0, Time elapsed: 38.584 sec - in org.apache.hadoop.hbase.regionserver.TestFSErrorsExposed
Tests run: 2, Failures: 0, Errors: 0, Skipped: 0, Time elapsed: 18.461 sec - in org.apache.hadoop.hbase.regionserver.TestEncryptionKeyRotation
Running org.apache.hadoop.hbase.regionserver.TestCompoundBloomFilter
Running org.apache.hadoop.hbase.regionserver.handler.TestOpenRegionHandler
Tests run: 6, Failures: 0, Errors: 0, Skipped: 0, Time elapsed: 2.165 sec - in org.apache.hadoop.hbase.regionserver.handler.TestOpenRegionHandler
Running org.apache.hadoop.hbase.regionserver.handler.TestCloseRegionHandler
Tests run: 3, Failures: 0, Errors: 0, Skipped: 0, Time elapsed: 2.318 sec - in org.apache.hadoop.hbase.regionserver.handler.TestCloseRegionHandler
Tests run: 5, Failures: 0, Errors: 0, Skipped: 0, Time elapsed: 50.16 sec - in org.apache.hadoop.hbase.regionserver.TestCompactionState
Running org.apache.hadoop.hbase.regionserver.TestFlushRegionEntry
Tests run: 1, Failures: 0, Errors: 0, Skipped: 0, Time elapsed: 0.941 sec - in org.apache.hadoop.hbase.regionserver.TestFlushRegionEntry
Running org.apache.hadoop.hbase.TestLocalHBaseCluster
Running org.apache.hadoop.hbase.regionserver.TestRegionServerMetrics
Tests run: 3, Failures: 0, Errors: 0, Skipped: 0, Time elapsed: 23.304 sec - in org.apache.hadoop.hbase.regionserver.TestCompoundBloomFilter
Tests run: 1, Failures: 0, Errors: 0, Skipped: 0, Time elapsed: 10.887 sec - in org.apache.hadoop.hbase.TestLocalHBaseCluster
Running org.apache.hadoop.hbase.migration.TestUpgradeTo96
Tests run: 5, Failures: 0, Errors: 0, Skipped: 0, Time elapsed: 2.537 sec - in org.apache.hadoop.hbase.migration.TestUpgradeTo96
Running org.apache.hadoop.hbase.migration.TestNamespaceUpgrade
Tests run: 10, Failures: 0, Errors: 0, Skipped: 0, Time elapsed: 24.182 sec - in org.apache.hadoop.hbase.regionserver.TestRegionServerMetrics
Running org.apache.hadoop.hbase.quotas.TestQuotaAdmin
Running org.apache.hadoop.hbase.quotas.TestQuotaThrottle
Tests run: 2, Failures: 0, Errors: 0, Skipped: 0, Time elapsed: 5.624 sec - in org.apache.hadoop.hbase.quotas.TestQuotaAdmin
Tests run: 5, Failures: 0, Errors: 0, Skipped: 0, Time elapsed: 21.249 sec - in org.apache.hadoop.hbase.migration.TestNamespaceUpgrade
Running org.apache.hadoop.hbase.quotas.TestQuotaTableUtil
Tests run: 3, Failures: 0, Errors: 0, Skipped: 0, Time elapsed: 2.353 sec - in org.apache.hadoop.hbase.quotas.TestQuotaTableUtil
Tests run: 7, Failures: 0, Errors: 0, Skipped: 0, Time elapsed: 17.793 sec - in org.apache.hadoop.hbase.quotas.TestQuotaThrottle
Running org.apache.hadoop.hbase.TestServerSideScanMetricsFromClientSide
Tests run: 2, Failures: 0, Errors: 0, Skipped: 0, Time elapsed: 2.966 sec - in org.apache.hadoop.hbase.TestServerSideScanMetricsFromClientSide
Running org.apache.hadoop.hbase.constraint.TestConstraint
Tests run: 5, Failures: 0, Errors: 0, Skipped: 0, Time elapsed: 21.198 sec - in org.apache.hadoop.hbase.constraint.TestConstraint
Tests run: 12, Failures: 0, Errors: 0, Skipped: 0, Time elapsed: 244.239 sec - in org.apache.hadoop.hbase.regionserver.TestRegionReplicaFailover
Tests run: 7, Failures: 0, Errors: 0, Skipped: 0, Time elapsed: 184.338 sec - in org.apache.hadoop.hbase.regionserver.TestRegionReplicas

Results :


Tests in error: 
org.apache.hadoop.hbase.backup.TestHFileArchiving.testArchiveOnTableFamilyDelete(org.apache.hadoop.hbase.backup.TestHFileArchiving)
  Run 1: TestHFileArchiving.testArchiveOnTableFamilyDelete:343 » InvalidFamilyOperation
  Run 2: TestHFileArchiving.testArchiveOnTableFamilyDelete:343 » InvalidFamilyOperation
  Run 3: TestHFileArchiving.testArchiveOnTableFamilyDelete:343 » InvalidFamilyOperation



Tests run: 2639, Failures: 0, Errors: 1, Skipped: 20

[INFO] ------------------------------------------------------------------------
[INFO] Reactor Summary:
[INFO] 
[INFO] HBase ............................................. SUCCESS [2.985s]
[INFO] HBase - Checkstyle ................................ SUCCESS [0.585s]
[INFO] HBase - Annotations ............................... SUCCESS [1.270s]
[INFO] HBase - Protocol .................................. SUCCESS [12.838s]
[INFO] HBase - Common .................................... SUCCESS [1:23.741s]
[INFO] HBase - Procedure ................................. SUCCESS [1:52.444s]
[INFO] HBase - Client .................................... SUCCESS [1:22.353s]
[INFO] HBase - Hadoop Compatibility ...................... SUCCESS [7.446s]
[INFO] HBase - Hadoop Two Compatibility .................. SUCCESS [6.925s]
[INFO] HBase - Prefix Tree ............................... SUCCESS [10.448s]
[INFO] HBase - Server .................................... FAILURE [1:26:35.642s]
[INFO] HBase - Testing Util .............................. SKIPPED
[INFO] HBase - Thrift .................................... SKIPPED
[INFO] HBase - Rest ...................................... SKIPPED
[INFO] HBase - Shell ..................................... SKIPPED
[INFO] HBase - Integration Tests ......................... SKIPPED
[INFO] HBase - Examples .................................. SKIPPED
[INFO] HBase - Assembly .................................. SKIPPED
[INFO] HBase - Shaded .................................... SKIPPED
[INFO] HBase - Shaded - Client ........................... SKIPPED
[INFO] HBase - Shaded - Server ........................... SKIPPED
[INFO] ------------------------------------------------------------------------
[INFO] BUILD FAILURE
[INFO] ------------------------------------------------------------------------
[INFO] Total time: 1:31:58.586s
[INFO] Finished at: Mon Jun 01 16:22:45 UTC 2015
[INFO] Final Memory: 93M/967M
[INFO] ------------------------------------------------------------------------
[ERROR] Failed to execute goal org.apache.maven.plugins:maven-surefire-plugin:2.18:test (secondPartTestsExecution)
on project hbase-server: There are test failures.
[ERROR] 
[ERROR] Please refer to <https://builds.apache.org/job/HBase-1.2/ws/hbase-server/target/surefire-reports>
for the individual test results.
[ERROR] -> [Help 1]
[ERROR] 
[ERROR] To see the full stack trace of the errors, re-run Maven with the -e switch.
[ERROR] Re-run Maven using the -X switch to enable full debug logging.
[ERROR] 
[ERROR] For more information about the errors and possible solutions, please read the following
articles:
[ERROR] [Help 1] http://cwiki.apache.org/confluence/display/MAVEN/MojoFailureException
[ERROR] 
[ERROR] After correcting the problems, you can resume the build with the command
[ERROR]   mvn <goals> -rf :hbase-server
Build step 'Invoke top-level Maven targets' marked build as failure
Performing Post build task...
Match found for :.* : True
Logical operation result is TRUE
Running script  :   ZOMBIE_TESTS_COUNT=`jps | grep surefirebooter | wc -l`
  if [[ $ZOMBIE_TESTS_COUNT != 0 ]] ; then
    #It seems sometimes the tests are not dying immediately. Let's give them 10s
    echo "Suspicious java process found - waiting 10s to see if there are just slow to stop"
    sleep 10   
    ZOMBIE_TESTS_COUNT=`jps | grep surefirebooter | wc -l`
    if [[ $ZOMBIE_TESTS_COUNT != 0 ]] ; then
      echo "There are $ZOMBIE_TESTS_COUNT zombie tests, they should have been killed by surefire
but survived"
      echo "************ BEGIN zombies jstack extract"
      ZB_STACK=`jps | grep surefirebooter | cut -d ' ' -f 1 | xargs -n 1 jstack | grep ".test"
| grep "\.java"`
      jps | grep surefirebooter | cut -d ' ' -f 1 | xargs -n 1 jstack
      echo "************ END  zombies jstack extract"
      JIRA_COMMENT="$JIRA_COMMENT

     {color:red}-1 core zombie tests{color}.  There are ${ZOMBIE_TESTS_COUNT} zombie test(s):
${ZB_STACK}"
      BAD=1
      jps | grep surefirebooter | cut -d ' ' -f 1 | xargs kill -9
    else
      echo "We're ok: there is no zombie test, but some tests took some time to stop"
    fi
  else
    echo "We're ok: there is no zombie test"
  fi
[HBase-1.2] $ /bin/bash -xe /tmp/hudson5346855899384724137.sh
++ jps
++ grep surefirebooter
++ wc -l
+ ZOMBIE_TESTS_COUNT=2
+ [[ 2 != 0 ]]
+ echo 'Suspicious java process found - waiting 10s to see if there are just slow to stop'
Suspicious java process found - waiting 10s to see if there are just slow to stop
+ sleep 10
++ jps
++ grep surefirebooter
++ wc -l
+ ZOMBIE_TESTS_COUNT=2
+ [[ 2 != 0 ]]
+ echo 'There are 2 zombie tests, they should have been killed by surefire but survived'
There are 2 zombie tests, they should have been killed by surefire but survived
+ echo '************ BEGIN zombies jstack extract'
************ BEGIN zombies jstack extract
++ jps
++ grep surefirebooter
++ xargs -n 1 jstack
++ cut -d ' ' -f 1
++ grep .test
++ grep '\.java'
+ ZB_STACK=
POST BUILD TASK : FAILURE
END OF POST BUILD TASK : 0
Archiving artifacts
Sending artifact delta relative to HBase-1.2 #115
Archived 2066 artifacts
Archive block size is 32768
Received 27 blocks and 522644545 bytes
Compression is 0.2%
Took 2 min 20 sec
Recording test results
Updating HBASE-13344

Mime
View raw message