hbase-builds mailing list archives

Site index · List index
Message view « Date » · « Thread »
Top « Date » · « Thread »
From Apache Jenkins Server <jenk...@builds.apache.org>
Subject Build failed in Jenkins: HBase-1.0 #952
Date Mon, 08 Jun 2015 22:53:29 GMT
See <https://builds.apache.org/job/HBase-1.0/952/changes>

Changes:

[enis] HBASE-13853 ITBLL improvements after HBASE-13811 (ADDENDUM to fix logging)

------------------------------------------
[...truncated 1824 lines...]
Running org.apache.hadoop.hbase.coprocessor.TestCoprocessorEndpoint
Tests run: 6, Failures: 0, Errors: 0, Skipped: 0, Time elapsed: 2.835 sec - in org.apache.hadoop.hbase.coprocessor.TestCoprocessorEndpoint
Tests run: 38, Failures: 0, Errors: 0, Skipped: 0, Time elapsed: 5.572 sec - in org.apache.hadoop.hbase.coprocessor.TestDoubleColumnInterpreter
Tests run: 2, Failures: 0, Errors: 0, Skipped: 0, Time elapsed: 19.305 sec - in org.apache.hadoop.hbase.coprocessor.TestRegionServerCoprocessorExceptionWithAbort
Running org.apache.hadoop.hbase.coprocessor.TestMasterCoprocessorExceptionWithRemove
Running org.apache.hadoop.hbase.coprocessor.TestBatchCoprocessorEndpoint
Tests run: 4, Failures: 0, Errors: 0, Skipped: 0, Time elapsed: 2.68 sec - in org.apache.hadoop.hbase.coprocessor.TestBatchCoprocessorEndpoint
Running org.apache.hadoop.hbase.coprocessor.TestRowProcessorEndpoint
Tests run: 1, Failures: 0, Errors: 0, Skipped: 0, Time elapsed: 5.125 sec - in org.apache.hadoop.hbase.coprocessor.TestMasterCoprocessorExceptionWithRemove
Tests run: 4, Failures: 0, Errors: 0, Skipped: 0, Time elapsed: 8.5 sec - in org.apache.hadoop.hbase.coprocessor.TestRowProcessorEndpoint
Running org.apache.hadoop.hbase.coprocessor.TestOpenTableInCoprocessor
Running org.apache.hadoop.hbase.coprocessor.TestRegionObserverInterface
Tests run: 2, Failures: 0, Errors: 0, Skipped: 0, Time elapsed: 4.583 sec - in org.apache.hadoop.hbase.coprocessor.TestOpenTableInCoprocessor
Running org.apache.hadoop.hbase.coprocessor.TestBigDecimalColumnInterpreter
Running org.apache.hadoop.hbase.coprocessor.TestCoprocessorStop
Tests run: 38, Failures: 0, Errors: 0, Skipped: 0, Time elapsed: 5.375 sec - in org.apache.hadoop.hbase.coprocessor.TestBigDecimalColumnInterpreter
Running org.apache.hadoop.hbase.coprocessor.TestAggregateProtocol
Tests run: 1, Failures: 0, Errors: 0, Skipped: 0, Time elapsed: 16.536 sec - in org.apache.hadoop.hbase.coprocessor.TestCoprocessorStop
Tests run: 44, Failures: 0, Errors: 0, Skipped: 0, Time elapsed: 5.238 sec - in org.apache.hadoop.hbase.coprocessor.TestAggregateProtocol
Tests run: 13, Failures: 0, Errors: 0, Skipped: 0, Time elapsed: 36.282 sec - in org.apache.hadoop.hbase.coprocessor.TestRegionObserverInterface
Running org.apache.hadoop.hbase.backup.example.TestZooKeeperTableArchiveClient
Running org.apache.hadoop.hbase.coprocessor.TestRegionObserverBypass
Running org.apache.hadoop.hbase.coprocessor.TestHTableWrapper
Tests run: 3, Failures: 0, Errors: 0, Skipped: 0, Time elapsed: 3.936 sec - in org.apache.hadoop.hbase.backup.example.TestZooKeeperTableArchiveClient
Tests run: 2, Failures: 0, Errors: 0, Skipped: 0, Time elapsed: 4.061 sec - in org.apache.hadoop.hbase.coprocessor.TestRegionObserverBypass
Running org.apache.hadoop.hbase.regionserver.TestHRegionServerBulkLoad
Tests run: 1, Failures: 0, Errors: 0, Skipped: 0, Time elapsed: 2.669 sec - in org.apache.hadoop.hbase.coprocessor.TestHTableWrapper
Running org.apache.hadoop.hbase.backup.TestHFileArchiving
Running org.apache.hadoop.hbase.regionserver.TestScannerRetriableFailure
Tests run: 1, Failures: 0, Errors: 0, Skipped: 0, Time elapsed: 43.103 sec - in org.apache.hadoop.hbase.regionserver.TestHRegionServerBulkLoad
Tests run: 1, Failures: 0, Errors: 0, Skipped: 0, Time elapsed: 34.523 sec - in org.apache.hadoop.hbase.regionserver.TestScannerRetriableFailure
Tests run: 5, Failures: 0, Errors: 0, Skipped: 0, Time elapsed: 41.693 sec - in org.apache.hadoop.hbase.backup.TestHFileArchiving
Running org.apache.hadoop.hbase.regionserver.TestReversibleScanners
Tests run: 5, Failures: 0, Errors: 0, Skipped: 0, Time elapsed: 5.223 sec - in org.apache.hadoop.hbase.regionserver.TestReversibleScanners
Running org.apache.hadoop.hbase.regionserver.TestRegionFavoredNodes
Running org.apache.hadoop.hbase.regionserver.TestEndToEndSplitTransaction
Tests run: 1, Failures: 0, Errors: 0, Skipped: 0, Time elapsed: 9.714 sec - in org.apache.hadoop.hbase.regionserver.TestRegionFavoredNodes
Running org.apache.hadoop.hbase.regionserver.TestRegionServerNoMaster
Running org.apache.hadoop.hbase.regionserver.TestClusterId
Tests run: 2, Failures: 0, Errors: 0, Skipped: 0, Time elapsed: 16.39 sec - in org.apache.hadoop.hbase.regionserver.TestEndToEndSplitTransaction
Running org.apache.hadoop.hbase.regionserver.TestMajorCompaction
Tests run: 9, Failures: 0, Errors: 0, Skipped: 0, Time elapsed: 17.602 sec - in org.apache.hadoop.hbase.regionserver.TestRegionServerNoMaster
Tests run: 2, Failures: 0, Errors: 0, Skipped: 0, Time elapsed: 27.158 sec - in org.apache.hadoop.hbase.regionserver.TestClusterId
Running org.apache.hadoop.hbase.regionserver.TestServerCustomProtocol
Running org.apache.hadoop.hbase.regionserver.TestEncryptionKeyRotation
Tests run: 9, Failures: 0, Errors: 0, Skipped: 0, Time elapsed: 304.087 sec - in org.apache.hadoop.hbase.snapshot.TestSecureExportSnapshot
Running org.apache.hadoop.hbase.regionserver.TestPriorityRpc
Tests run: 3, Failures: 0, Errors: 0, Skipped: 0, Time elapsed: 2.468 sec - in org.apache.hadoop.hbase.regionserver.TestPriorityRpc
Tests run: 7, Failures: 0, Errors: 0, Skipped: 0, Time elapsed: 15.353 sec - in org.apache.hadoop.hbase.regionserver.TestServerCustomProtocol
Running org.apache.hadoop.hbase.regionserver.TestBlocksRead
Running org.apache.hadoop.hbase.regionserver.TestSplitLogWorker
Tests run: 4, Failures: 0, Errors: 0, Skipped: 0, Time elapsed: 1.972 sec - in org.apache.hadoop.hbase.regionserver.TestBlocksRead
Tests run: 2, Failures: 0, Errors: 0, Skipped: 0, Time elapsed: 11.978 sec - in org.apache.hadoop.hbase.regionserver.TestEncryptionKeyRotation
Running org.apache.hadoop.hbase.regionserver.TestZKLessMergeOnCluster
Tests run: 7, Failures: 0, Errors: 0, Skipped: 0, Time elapsed: 45.825 sec - in org.apache.hadoop.hbase.regionserver.TestMajorCompaction
Running org.apache.hadoop.hbase.regionserver.TestJoinedScanners
Running org.apache.hadoop.hbase.regionserver.TestZKLessSplitOnCluster
Tests run: 7, Failures: 0, Errors: 0, Skipped: 0, Time elapsed: 22.306 sec - in org.apache.hadoop.hbase.regionserver.TestSplitLogWorker
Tests run: 3, Failures: 0, Errors: 0, Skipped: 0, Time elapsed: 12.156 sec - in org.apache.hadoop.hbase.regionserver.TestZKLessMergeOnCluster
Running org.apache.hadoop.hbase.regionserver.TestMinorCompaction
Tests run: 9, Failures: 0, Errors: 0, Skipped: 0, Time elapsed: 291.347 sec - in org.apache.hadoop.hbase.snapshot.TestExportSnapshot
Tests run: 6, Failures: 0, Errors: 0, Skipped: 0, Time elapsed: 4.427 sec - in org.apache.hadoop.hbase.regionserver.TestMinorCompaction
Running org.apache.hadoop.hbase.regionserver.TestHRegionOnCluster
Running org.apache.hadoop.hbase.regionserver.TestRegionServerMetrics
Tests run: 1, Failures: 0, Errors: 0, Skipped: 0, Time elapsed: 22.258 sec - in org.apache.hadoop.hbase.regionserver.TestJoinedScanners
Running org.apache.hadoop.hbase.regionserver.TestTags
Tests run: 9, Failures: 0, Errors: 0, Skipped: 0, Time elapsed: 7.715 sec - in org.apache.hadoop.hbase.regionserver.TestRegionServerMetrics
Running org.apache.hadoop.hbase.regionserver.TestRowTooBig
Tests run: 1, Failures: 0, Errors: 0, Skipped: 0, Time elapsed: 15.436 sec - in org.apache.hadoop.hbase.regionserver.TestHRegionOnCluster
Running org.apache.hadoop.hbase.regionserver.TestSCVFWithMiniCluster
Tests run: 16, Failures: 0, Errors: 0, Skipped: 0, Time elapsed: 38.221 sec - in org.apache.hadoop.hbase.regionserver.TestZKLessSplitOnCluster
Tests run: 5, Failures: 0, Errors: 0, Skipped: 0, Time elapsed: 0.407 sec - in org.apache.hadoop.hbase.regionserver.TestSCVFWithMiniCluster
Running org.apache.hadoop.hbase.regionserver.TestSeekOptimizations
Running org.apache.hadoop.hbase.regionserver.TestCompactionState
Tests run: 6, Failures: 0, Errors: 0, Skipped: 0, Time elapsed: 4.918 sec - in org.apache.hadoop.hbase.regionserver.TestSeekOptimizations
Running org.apache.hadoop.hbase.regionserver.TestCompactionWithCoprocessor
Tests run: 2, Failures: 0, Errors: 0, Skipped: 0, Time elapsed: 19.588 sec - in org.apache.hadoop.hbase.regionserver.TestRowTooBig
Running org.apache.hadoop.hbase.regionserver.TestStoreScanner
Running org.apache.hadoop.hbase.regionserver.TestRegionReplicas
Tests run: 16, Failures: 0, Errors: 0, Skipped: 0, Time elapsed: 0.929 sec - in org.apache.hadoop.hbase.regionserver.TestStoreScanner
Running org.apache.hadoop.hbase.regionserver.TestCacheOnWriteInSchema
Tests run: 3, Failures: 0, Errors: 0, Skipped: 0, Time elapsed: 2.766 sec - in org.apache.hadoop.hbase.regionserver.TestCacheOnWriteInSchema
Tests run: 4, Failures: 0, Errors: 0, Skipped: 0, Time elapsed: 32.612 sec - in org.apache.hadoop.hbase.regionserver.TestTags
Running org.apache.hadoop.hbase.regionserver.wal.TestReadOldRootAndMetaEdits
Tests run: 1, Failures: 0, Errors: 0, Skipped: 0, Time elapsed: 0.279 sec - in org.apache.hadoop.hbase.regionserver.wal.TestReadOldRootAndMetaEdits
Running org.apache.hadoop.hbase.regionserver.wal.TestFSHLog
Running org.apache.hadoop.hbase.regionserver.wal.TestWALReplayCompressed
Tests run: 5, Failures: 0, Errors: 0, Skipped: 0, Time elapsed: 24.04 sec - in org.apache.hadoop.hbase.regionserver.TestCompactionWithCoprocessor
Tests run: 6, Failures: 0, Errors: 0, Skipped: 0, Time elapsed: 4.334 sec - in org.apache.hadoop.hbase.regionserver.wal.TestFSHLog
Tests run: 5, Failures: 0, Errors: 0, Skipped: 0, Time elapsed: 29.942 sec - in org.apache.hadoop.hbase.regionserver.TestCompactionState
Running org.apache.hadoop.hbase.regionserver.wal.TestLogRollAbort
Running org.apache.hadoop.hbase.regionserver.wal.TestSecureWALReplay
Running org.apache.hadoop.hbase.regionserver.wal.TestWALReplay
Tests run: 2, Failures: 0, Errors: 0, Skipped: 0, Time elapsed: 24.305 sec - in org.apache.hadoop.hbase.regionserver.wal.TestLogRollAbort
Running org.apache.hadoop.hbase.regionserver.wal.TestLogRolling
Tests run: 9, Failures: 0, Errors: 0, Skipped: 0, Time elapsed: 39.618 sec - in org.apache.hadoop.hbase.regionserver.wal.TestWALReplayCompressed
Running org.apache.hadoop.hbase.regionserver.wal.TestProtobufLog
Tests run: 1, Failures: 0, Errors: 0, Skipped: 0, Time elapsed: 1.657 sec - in org.apache.hadoop.hbase.regionserver.wal.TestProtobufLog
Running org.apache.hadoop.hbase.regionserver.wal.TestDurability
Tests run: 9, Failures: 0, Errors: 0, Skipped: 0, Time elapsed: 38.222 sec - in org.apache.hadoop.hbase.regionserver.wal.TestWALReplay
Tests run: 2, Failures: 0, Errors: 0, Skipped: 0, Time elapsed: 2.373 sec - in org.apache.hadoop.hbase.regionserver.wal.TestDurability
Tests run: 9, Failures: 0, Errors: 0, Skipped: 0, Time elapsed: 42.204 sec - in org.apache.hadoop.hbase.regionserver.wal.TestSecureWALReplay
Running org.apache.hadoop.hbase.regionserver.wal.TestLogRollPeriod
Running org.apache.hadoop.hbase.regionserver.TestScannerWithBulkload
Running org.apache.hadoop.hbase.regionserver.TestEncryptionRandomKeying
Tests run: 1, Failures: 0, Errors: 0, Skipped: 0, Time elapsed: 1.739 sec - in org.apache.hadoop.hbase.regionserver.TestEncryptionRandomKeying
Tests run: 3, Failures: 0, Errors: 0, Skipped: 0, Time elapsed: 5.543 sec - in org.apache.hadoop.hbase.regionserver.TestScannerWithBulkload
Running org.apache.hadoop.hbase.regionserver.TestDefaultMemStore
Running org.apache.hadoop.hbase.regionserver.handler.TestOpenRegionHandler
Tests run: 6, Failures: 0, Errors: 0, Skipped: 0, Time elapsed: 2.263 sec - in org.apache.hadoop.hbase.regionserver.handler.TestOpenRegionHandler
Running org.apache.hadoop.hbase.regionserver.handler.TestCloseRegionHandler
Tests run: 3, Failures: 0, Errors: 0, Skipped: 0, Time elapsed: 1.716 sec - in org.apache.hadoop.hbase.regionserver.handler.TestCloseRegionHandler
Running org.apache.hadoop.hbase.regionserver.TestMasterAddressTracker
Tests run: 5, Failures: 0, Errors: 0, Skipped: 0, Time elapsed: 0.996 sec - in org.apache.hadoop.hbase.regionserver.TestMasterAddressTracker
Running org.apache.hadoop.hbase.regionserver.TestSplitTransactionOnCluster
Tests run: 23, Failures: 0, Errors: 0, Skipped: 0, Time elapsed: 41.957 sec - in org.apache.hadoop.hbase.regionserver.TestDefaultMemStore
Tests run: 2, Failures: 0, Errors: 0, Skipped: 0, Time elapsed: 51.457 sec - in org.apache.hadoop.hbase.regionserver.wal.TestLogRollPeriod
Running org.apache.hadoop.hbase.regionserver.TestParallelPut
Running org.apache.hadoop.hbase.regionserver.TestRegionServerOnlineConfigChange
Tests run: 2, Failures: 0, Errors: 0, Skipped: 0, Time elapsed: 1.189 sec - in org.apache.hadoop.hbase.regionserver.TestRegionServerOnlineConfigChange
Running org.apache.hadoop.hbase.regionserver.TestCompaction
Tests run: 16, Failures: 0, Errors: 0, Skipped: 0, Time elapsed: 40.225 sec - in org.apache.hadoop.hbase.regionserver.TestSplitTransactionOnCluster
Running org.apache.hadoop.hbase.regionserver.TestRegionMergeTransactionOnCluster
Tests run: 7, Failures: 0, Errors: 0, Skipped: 0, Time elapsed: 161.151 sec - in org.apache.hadoop.hbase.regionserver.TestRegionReplicas
Running org.apache.hadoop.hbase.regionserver.TestRecoveredEdits
Tests run: 3, Failures: 0, Errors: 0, Skipped: 0, Time elapsed: 12.453 sec - in org.apache.hadoop.hbase.regionserver.TestRegionMergeTransactionOnCluster
Tests run: 5, Failures: 0, Errors: 0, Skipped: 0, Time elapsed: 23.365 sec - in org.apache.hadoop.hbase.regionserver.TestCompaction
Running org.apache.hadoop.hbase.regionserver.TestCompoundBloomFilter
Running org.apache.hadoop.hbase.regionserver.TestGetClosestAtOrBefore
Tests run: 1, Failures: 0, Errors: 0, Skipped: 0, Time elapsed: 11.524 sec - in org.apache.hadoop.hbase.regionserver.TestRecoveredEdits
Running org.apache.hadoop.hbase.regionserver.TestRegionServerReportForDuty
Tests run: 3, Failures: 0, Errors: 0, Skipped: 0, Time elapsed: 1.806 sec - in org.apache.hadoop.hbase.regionserver.TestGetClosestAtOrBefore
Running org.apache.hadoop.hbase.regionserver.TestHRegion
Tests run: 1, Failures: 0, Errors: 0, Skipped: 0, Time elapsed: 12.019 sec - in org.apache.hadoop.hbase.regionserver.TestRegionServerReportForDuty
Running org.apache.hadoop.hbase.regionserver.TestAtomicOperation
Tests run: 2, Failures: 0, Errors: 0, Skipped: 0, Time elapsed: 64.224 sec - in org.apache.hadoop.hbase.regionserver.TestParallelPut
Running org.apache.hadoop.hbase.regionserver.TestFSErrorsExposed
Tests run: 3, Failures: 0, Errors: 0, Skipped: 0, Time elapsed: 29.434 sec - in org.apache.hadoop.hbase.regionserver.TestCompoundBloomFilter
Running org.apache.hadoop.hbase.regionserver.TestRSKilledWhenInitializing
Tests run: 1, Failures: 0, Errors: 0, Skipped: 0, Time elapsed: 18.742 sec - in org.apache.hadoop.hbase.regionserver.TestRSKilledWhenInitializing
Running org.apache.hadoop.hbase.regionserver.TestMultiColumnScanner
Tests run: 6, Failures: 0, Errors: 0, Skipped: 0, Time elapsed: 42.593 sec - in org.apache.hadoop.hbase.regionserver.TestAtomicOperation
Running org.apache.hadoop.hbase.regionserver.TestFlushRegionEntry
Tests run: 1, Failures: 0, Errors: 0, Skipped: 0, Time elapsed: 0.674 sec - in org.apache.hadoop.hbase.regionserver.TestFlushRegionEntry
Running org.apache.hadoop.hbase.regionserver.TestStore
Tests run: 3, Failures: 0, Errors: 0, Skipped: 0, Time elapsed: 38.224 sec - in org.apache.hadoop.hbase.regionserver.TestFSErrorsExposed
Running org.apache.hadoop.hbase.TestMetaTableLocator
Tests run: 7, Failures: 0, Errors: 0, Skipped: 0, Time elapsed: 3.304 sec - in org.apache.hadoop.hbase.TestMetaTableLocator
Tests run: 18, Failures: 0, Errors: 0, Skipped: 0, Time elapsed: 13.123 sec - in org.apache.hadoop.hbase.regionserver.TestStore
Tests run: 5, Failures: 0, Errors: 0, Skipped: 0, Time elapsed: 223.982 sec - in org.apache.hadoop.hbase.regionserver.wal.TestLogRolling
Tests run: 12, Failures: 0, Errors: 0, Skipped: 0, Time elapsed: 57.755 sec - in org.apache.hadoop.hbase.regionserver.TestMultiColumnScanner
Tests run: 91, Failures: 0, Errors: 0, Skipped: 0, Time elapsed: 127.624 sec - in org.apache.hadoop.hbase.regionserver.TestHRegion

Results :

Failed tests: 
  TestEnableTableHandler.testEnableTableWithNoRegionServers:101 Waiting timed out after [60,000]
msec



Tests run: 2385, Failures: 1, Errors: 0, Skipped: 18

[INFO] ------------------------------------------------------------------------
[INFO] Reactor Summary:
[INFO] 
[INFO] HBase ............................................. SUCCESS [3.667s]
[INFO] HBase - Checkstyle ................................ SUCCESS [0.657s]
[INFO] HBase - Annotations ............................... SUCCESS [1.106s]
[INFO] HBase - Common .................................... SUCCESS [57.468s]
[INFO] HBase - Protocol .................................. SUCCESS [9.220s]
[INFO] HBase - Client .................................... SUCCESS [1:19.163s]
[INFO] HBase - Hadoop Compatibility ...................... SUCCESS [7.002s]
[INFO] HBase - Hadoop Two Compatibility .................. SUCCESS [6.280s]
[INFO] HBase - Prefix Tree ............................... SUCCESS [8.422s]
[INFO] HBase - Server .................................... FAILURE [1:07:56.506s]
[INFO] HBase - Testing Util .............................. SKIPPED
[INFO] HBase - Thrift .................................... SKIPPED
[INFO] HBase - Rest ...................................... SKIPPED
[INFO] HBase - Shell ..................................... SKIPPED
[INFO] HBase - Integration Tests ......................... SKIPPED
[INFO] HBase - Examples .................................. SKIPPED
[INFO] HBase - Assembly .................................. SKIPPED
[INFO] ------------------------------------------------------------------------
[INFO] BUILD FAILURE
[INFO] ------------------------------------------------------------------------
[INFO] Total time: 1:10:50.348s
[INFO] Finished at: Mon Jun 08 22:50:39 UTC 2015
[INFO] Final Memory: 47M/522M
[INFO] ------------------------------------------------------------------------
[ERROR] Failed to execute goal org.apache.maven.plugins:maven-surefire-plugin:2.18:test (secondPartTestsExecution)
on project hbase-server: There are test failures.
[ERROR] 
[ERROR] Please refer to <https://builds.apache.org/job/HBase-1.0/ws/hbase-server/target/surefire-reports>
for the individual test results.
[ERROR] -> [Help 1]
[ERROR] 
[ERROR] To see the full stack trace of the errors, re-run Maven with the -e switch.
[ERROR] Re-run Maven using the -X switch to enable full debug logging.
[ERROR] 
[ERROR] For more information about the errors and possible solutions, please read the following
articles:
[ERROR] [Help 1] http://cwiki.apache.org/confluence/display/MAVEN/MojoFailureException
[ERROR] 
[ERROR] After correcting the problems, you can resume the build with the command
[ERROR]   mvn <goals> -rf :hbase-server
Build step 'Invoke top-level Maven targets' marked build as failure
Performing Post build task...
Match found for :.* : True
Logical operation result is TRUE
Running script  :   ZOMBIE_TESTS_COUNT=`jps | grep surefirebooter | wc -l`
  if [[ $ZOMBIE_TESTS_COUNT != 0 ]] ; then
    #It seems sometimes the tests are not dying immediately. Let's give them 10s
    echo "Suspicious java process found - waiting 10s to see if there are just slow to stop"
    sleep 10   
    ZOMBIE_TESTS_COUNT=`jps | grep surefirebooter | wc -l`
    if [[ $ZOMBIE_TESTS_COUNT != 0 ]] ; then
      echo "There are $ZOMBIE_TESTS_COUNT zombie tests, they should have been killed by surefire
but survived"
      echo "************ BEGIN zombies jstack extract"
      ZB_STACK=`jps | grep surefirebooter | cut -d ' ' -f 1 | xargs -n 1 jstack | grep ".test"
| grep "\.java"`
      jps | grep surefirebooter | cut -d ' ' -f 1 | xargs -n 1 jstack
      echo "************ END  zombies jstack extract"
      JIRA_COMMENT="$JIRA_COMMENT

     {color:red}-1 core zombie tests{color}.  There are ${ZOMBIE_TESTS_COUNT} zombie test(s):
${ZB_STACK}"
      BAD=1
      jps | grep surefirebooter | cut -d ' ' -f 1 | xargs kill -9
    else
      echo "We're ok: there is no zombie test, but some tests took some time to stop"
    fi
  else
    echo "We're ok: there is no zombie test"
  fi
[HBase-1.0] $ /bin/bash -xe /tmp/hudson4244169646243253454.sh
++ jps
++ grep surefirebooter
++ wc -l
+ ZOMBIE_TESTS_COUNT=0
+ [[ 0 != 0 ]]
+ echo 'We'\''re ok: there is no zombie test'
We're ok: there is no zombie test
POST BUILD TASK : SUCCESS
END OF POST BUILD TASK : 0
Archiving artifacts
Sending artifact delta relative to HBase-1.0 #930
Archived 1912 artifacts
Archive block size is 32768
Received 28 blocks and 408481237 bytes
Compression is 0.2%
Took 2 min 33 sec
Recording test results
Updating HBASE-13811
Updating HBASE-13853

Mime
View raw message