hbase-builds mailing list archives

Site index · List index
Message view « Date » · « Thread »
Top « Date » · « Thread »
From Apache Jenkins Server <jenk...@builds.apache.org>
Subject Build failed in Jenkins: HBase-1.2-IT » IntegrationTestBigLinkedList,latest1.8,Hadoop #35
Date Sat, 04 Jul 2015 07:32:03 GMT
See <https://builds.apache.org/job/HBase-1.2-IT/it.test=IntegrationTestBigLinkedList,jdk=latest1.8,label=Hadoop/35/>

------------------------------------------
[...truncated 44407 lines...]
5/5 KB   139/246 KB   20/20 KB   
5/5 KB   143/246 KB   20/20 KB   
5/5 KB   147/246 KB   20/20 KB   
5/5 KB   151/246 KB   20/20 KB   
5/5 KB   155/246 KB   20/20 KB   
5/5 KB   159/246 KB   20/20 KB   
5/5 KB   163/246 KB   20/20 KB   
5/5 KB   167/246 KB   20/20 KB   
5/5 KB   171/246 KB   20/20 KB   
5/5 KB   175/246 KB   20/20 KB   
5/5 KB   179/246 KB   20/20 KB   
5/5 KB   183/246 KB   20/20 KB   
5/5 KB   187/246 KB   20/20 KB   
5/5 KB   190/246 KB   20/20 KB   
5/5 KB   190/246 KB   20/20 KB   4/264 KB   
5/5 KB   190/246 KB   20/20 KB   7/264 KB   
5/5 KB   190/246 KB   20/20 KB   11/264 KB   
5/5 KB   190/246 KB   20/20 KB   15/264 KB   
5/5 KB   190/246 KB   20/20 KB   19/264 KB   
5/5 KB   190/246 KB   20/20 KB   23/264 KB   
5/5 KB   190/246 KB   20/20 KB   27/264 KB   
5/5 KB   190/246 KB   20/20 KB   31/264 KB   
5/5 KB   190/246 KB   20/20 KB   35/264 KB   
5/5 KB   190/246 KB   20/20 KB   39/264 KB   
5/5 KB   190/246 KB   20/20 KB   43/264 KB   
5/5 KB   190/246 KB   20/20 KB   47/264 KB   
5/5 KB   190/246 KB   20/20 KB   51/264 KB   
5/5 KB   190/246 KB   20/20 KB   55/264 KB   
5/5 KB   190/246 KB   20/20 KB   59/264 KB   
5/5 KB   190/246 KB   20/20 KB   63/264 KB   
5/5 KB   190/246 KB   20/20 KB   67/264 KB   
5/5 KB   190/246 KB   20/20 KB   71/264 KB   
5/5 KB   190/246 KB   20/20 KB   75/264 KB   
5/5 KB   190/246 KB   20/20 KB   79/264 KB   
5/5 KB   190/246 KB   20/20 KB   83/264 KB   
5/5 KB   190/246 KB   20/20 KB   87/264 KB   
5/5 KB   190/246 KB   20/20 KB   91/264 KB   
5/5 KB   190/246 KB   20/20 KB   95/264 KB   
5/5 KB   190/246 KB   20/20 KB   99/264 KB   
5/5 KB   190/246 KB   20/20 KB   103/264 KB   
5/5 KB   190/246 KB   20/20 KB   107/264 KB   
5/5 KB   190/246 KB   20/20 KB   111/264 KB   
5/5 KB   190/246 KB   20/20 KB   115/264 KB   
5/5 KB   190/246 KB   20/20 KB   119/264 KB   
5/5 KB   190/246 KB   20/20 KB   123/264 KB   
5/5 KB   190/246 KB   20/20 KB   127/264 KB   
5/5 KB   190/246 KB   20/20 KB   131/264 KB   
5/5 KB   190/246 KB   20/20 KB   135/264 KB   
5/5 KB   190/246 KB   20/20 KB   139/264 KB   
5/5 KB   190/246 KB   20/20 KB   143/264 KB   
5/5 KB   190/246 KB   20/20 KB   147/264 KB   
5/5 KB   190/246 KB   20/20 KB   151/264 KB   
5/5 KB   190/246 KB   20/20 KB   155/264 KB   
5/5 KB   190/246 KB   20/20 KB   159/264 KB   
5/5 KB   190/246 KB   20/20 KB   163/264 KB   
5/5 KB   190/246 KB   20/20 KB   167/264 KB   
5/5 KB   190/246 KB   20/20 KB   171/264 KB   
5/5 KB   190/246 KB   20/20 KB   175/264 KB   
5/5 KB   190/246 KB   20/20 KB   179/264 KB   
5/5 KB   190/246 KB   20/20 KB   183/264 KB   
5/5 KB   190/246 KB   20/20 KB   187/264 KB   
5/5 KB   190/246 KB   20/20 KB   191/264 KB   
5/5 KB   190/246 KB   20/20 KB   194/264 KB   
                                              
Downloaded: http://repo.maven.apache.org/maven2/org/jamon/jamon-api/2.3.0/jamon-api-2.3.0.jar
(5 KB at 89.9 KB/sec)
192/246 KB   20/20 KB   194/264 KB            
196/246 KB   20/20 KB   194/264 KB   
200/246 KB   20/20 KB   194/264 KB   
204/246 KB   20/20 KB   194/264 KB   
208/246 KB   20/20 KB   194/264 KB   
212/246 KB   20/20 KB   194/264 KB   
216/246 KB   20/20 KB   194/264 KB   
220/246 KB   20/20 KB   194/264 KB   
224/246 KB   20/20 KB   194/264 KB   
228/246 KB   20/20 KB   194/264 KB   
232/246 KB   20/20 KB   194/264 KB   
236/246 KB   20/20 KB   194/264 KB   
240/246 KB   20/20 KB   194/264 KB   
244/246 KB   20/20 KB   194/264 KB   
246/246 KB   20/20 KB   194/264 KB   
                                     
Downloaded: http://repo.maven.apache.org/maven2/org/codehaus/plexus/plexus-compiler-api/1.8.1/plexus-compiler-api-1.8.1.jar
(20 KB at 374.9 KB/sec)
246/246 KB   197/264 KB              
246/246 KB   201/264 KB   
246/246 KB   205/264 KB   
246/246 KB   209/264 KB   
246/246 KB   209/264 KB   
246/246 KB   213/264 KB   
246/246 KB   217/264 KB   
246/246 KB   221/264 KB   
246/246 KB   225/264 KB   
246/246 KB   229/264 KB   
246/246 KB   233/264 KB   
246/246 KB   237/264 KB   
246/246 KB   241/264 KB   
246/246 KB   245/264 KB   
246/246 KB   249/264 KB   
246/246 KB   253/264 KB   
246/246 KB   257/264 KB   
246/246 KB   261/264 KB   
246/246 KB   264/264 KB   
                          
Downloaded: http://repo.maven.apache.org/maven2/org/codehaus/plexus/plexus-utils/1.5.5/plexus-utils-1.5.5.jar
(246 KB at 3146.0 KB/sec)
                          
Downloaded: http://repo.maven.apache.org/maven2/org/jamon/jamon-processor/2.3.4/jamon-processor-2.3.4.jar
(264 KB at 3101.0 KB/sec)
                          
Downloaded: http://repo.maven.apache.org/maven2/org/jamon/jamon-runtime/2.3.1/jamon-runtime-2.3.1.jar
(0 B at 0.0 KB/sec)
[INFO] Translating 10 templates from <https://builds.apache.org/job/HBase-1.2-IT/it.test=IntegrationTestBigLinkedList,jdk=latest1.8,label=Hadoop/ws/hbase-server/src/main/jamon>
to <https://builds.apache.org/job/HBase-1.2-IT/it.test=IntegrationTestBigLinkedList,jdk=latest1.8,label=Hadoop/ws/hbase-server/target/generated-jamon>
[INFO] 
[INFO] --- maven-antrun-plugin:1.6:run (generate) @ hbase-server ---
[INFO] Executing tasks

main:
    [mkdir] Created dir: <https://builds.apache.org/job/HBase-1.2-IT/it.test=IntegrationTestBigLinkedList,jdk=latest1.8,label=Hadoop/ws/hbase-server/target/hbase-webapps>
     [copy] Copying 20 files to <https://builds.apache.org/job/HBase-1.2-IT/it.test=IntegrationTestBigLinkedList,jdk=latest1.8,label=Hadoop/ws/hbase-server/target/hbase-webapps>
log4j:WARN No appenders could be found for logger (org.mortbay.log).
log4j:WARN Please initialize the log4j system properly.
log4j:WARN See http://logging.apache.org/log4j/1.2/faq.html#noconfig for more info.
    [mkdir] Created dir: <https://builds.apache.org/job/HBase-1.2-IT/it.test=IntegrationTestBigLinkedList,jdk=latest1.8,label=Hadoop/ws/hbase-server/target/hbase-webapps/master/WEB-INF>
    [mkdir] Created dir: <https://builds.apache.org/job/HBase-1.2-IT/it.test=IntegrationTestBigLinkedList,jdk=latest1.8,label=Hadoop/ws/hbase-server/target/hbase-webapps/regionserver/WEB-INF>
[INFO] Executed tasks
[INFO] 
[INFO] --- maven-remote-resources-plugin:1.4:process (default) @ hbase-server ---
[INFO] 
[INFO] --- maven-resources-plugin:2.6:resources (default-resources) @ hbase-server ---
[INFO] Using 'UTF-8' encoding to copy filtered resources.
[INFO] Copying 22 resources
[INFO] Copying 3 resources
[INFO] 
[INFO] --- maven-compiler-plugin:2.5.1:compile (default-compile) @ hbase-server ---
[INFO] Compiling 782 source files to <https://builds.apache.org/job/HBase-1.2-IT/it.test=IntegrationTestBigLinkedList,jdk=latest1.8,label=Hadoop/ws/hbase-server/target/classes>
[INFO] -------------------------------------------------------------
[ERROR] COMPILATION ERROR : 
[INFO] -------------------------------------------------------------
[ERROR] <https://builds.apache.org/job/HBase-1.2-IT/it.test=IntegrationTestBigLinkedList,jdk=latest1.8,label=Hadoop/ws/hbase-server/src/main/java/org/apache/hadoop/hbase/master/AssignmentManager.java>:[94,43]
error: cannot find symbol
[ERROR]   symbol:   class RegionServerAbortedException
  location: package org.apache.hadoop.hbase.regionserver
<https://builds.apache.org/job/HBase-1.2-IT/it.test=IntegrationTestBigLinkedList,jdk=latest1.8,label=Hadoop/ws/hbase-server/src/main/java/org/apache/hadoop/hbase/master/AssignmentManager.java>:[1872,25]
error: cannot find symbol
[ERROR]   symbol:   class RegionServerAbortedException
  location: class AssignmentManager
<https://builds.apache.org/job/HBase-1.2-IT/it.test=IntegrationTestBigLinkedList,jdk=latest1.8,label=Hadoop/ws/hbase-server/src/main/java/org/apache/hadoop/hbase/regionserver/RSRpcServices.java>:[984,16]
error: cannot find symbol
[INFO] 3 errors 
[INFO] -------------------------------------------------------------
[INFO] ------------------------------------------------------------------------
[INFO] Reactor Summary:
[INFO] 
[INFO] HBase ............................................. SUCCESS [1:23.065s]
[INFO] HBase - Checkstyle ................................ SUCCESS [5.583s]
[INFO] HBase - Annotations ............................... SUCCESS [1.089s]
[INFO] HBase - Protocol .................................. SUCCESS [23.347s]
[INFO] HBase - Common .................................... SUCCESS [1:34.300s]
[INFO] HBase - Procedure ................................. SUCCESS [1.313s]
[INFO] HBase - Client .................................... SUCCESS [14.690s]
[INFO] HBase - Hadoop Compatibility ...................... SUCCESS [3.331s]
[INFO] HBase - Hadoop Two Compatibility .................. SUCCESS [5.176s]
[INFO] HBase - Prefix Tree ............................... SUCCESS [1.191s]
[INFO] HBase - Server .................................... FAILURE [3:31.689s]
[INFO] HBase - Testing Util .............................. SKIPPED
[INFO] HBase - Thrift .................................... SKIPPED
[INFO] HBase - Rest ...................................... SKIPPED
[INFO] HBase - Shell ..................................... SKIPPED
[INFO] HBase - Integration Tests ......................... SKIPPED
[INFO] HBase - Examples .................................. SKIPPED
[INFO] HBase - Assembly .................................. SKIPPED
[INFO] HBase - Shaded .................................... SKIPPED
[INFO] HBase - Shaded - Client ........................... SKIPPED
[INFO] HBase - Shaded - Server ........................... SKIPPED
[INFO] ------------------------------------------------------------------------
[INFO] BUILD FAILURE
[INFO] ------------------------------------------------------------------------
[INFO] Total time: 7:45.808s
[INFO] Finished at: Sat Jul 04 07:31:47 UTC 2015
[INFO] Final Memory: 105M/1403M
[INFO] ------------------------------------------------------------------------
[ERROR] Failed to execute goal org.apache.maven.plugins:maven-compiler-plugin:2.5.1:compile
(default-compile) on project hbase-server: Compilation failure: Compilation failure:
[ERROR] <https://builds.apache.org/job/HBase-1.2-IT/it.test=IntegrationTestBigLinkedList,jdk=latest1.8,label=Hadoop/ws/hbase-server/src/main/java/org/apache/hadoop/hbase/master/AssignmentManager.java>:[94,43]
error: cannot find symbol
[ERROR] symbol:   class RegionServerAbortedException
[ERROR] location: package org.apache.hadoop.hbase.regionserver
[ERROR] <https://builds.apache.org/job/HBase-1.2-IT/it.test=IntegrationTestBigLinkedList,jdk=latest1.8,label=Hadoop/ws/hbase-server/src/main/java/org/apache/hadoop/hbase/master/AssignmentManager.java>:[1872,25]
error: cannot find symbol
[ERROR] symbol:   class RegionServerAbortedException
[ERROR] location: class AssignmentManager
[ERROR] <https://builds.apache.org/job/HBase-1.2-IT/it.test=IntegrationTestBigLinkedList,jdk=latest1.8,label=Hadoop/ws/hbase-server/src/main/java/org/apache/hadoop/hbase/regionserver/RSRpcServices.java>:[984,16]
error: cannot find symbol
[ERROR] -> [Help 1]
[ERROR] 
[ERROR] To see the full stack trace of the errors, re-run Maven with the -e switch.
[ERROR] Re-run Maven using the -X switch to enable full debug logging.
[ERROR] 
[ERROR] For more information about the errors and possible solutions, please read the following
articles:
[ERROR] [Help 1] http://cwiki.apache.org/confluence/display/MAVEN/MojoFailureException
[ERROR] 
[ERROR] After correcting the problems, you can resume the build with the command
[ERROR]   mvn <goals> -rf :hbase-server
Build step 'Invoke top-level Maven targets' marked build as failure
Performing Post build task...
Match found for :.* : True
Logical operation result is TRUE
Running script  :   ZOMBIE_TESTS_COUNT=`jps | grep surefirebooter | wc -l`
  if [[ $ZOMBIE_TESTS_COUNT != 0 ]] ; then
    #It seems sometimes the tests are not dying immediately. Let's give them 10s
    echo "Suspicious java process found - waiting 10s to see if there are just slow to stop"
    sleep 10   
    ZOMBIE_TESTS_COUNT=`jps | grep surefirebooter | wc -l`
    if [[ $ZOMBIE_TESTS_COUNT != 0 ]] ; then
      echo "There are $ZOMBIE_TESTS_COUNT zombie tests, they should have been killed by surefire
but survived"
      echo "************ BEGIN zombies jstack extract"
      ZB_STACK=`jps | grep surefirebooter | cut -d ' ' -f 1 | xargs -n 1 jstack | grep ".test"
| grep "\.java"`
      jps | grep surefirebooter | cut -d ' ' -f 1 | xargs -n 1 jstack
      echo "************ END  zombies jstack extract"
      JIRA_COMMENT="$JIRA_COMMENT

     {color:red}-1 core zombie tests{color}.  There are ${ZOMBIE_TESTS_COUNT} zombie test(s):
${ZB_STACK}"
      BAD=1
      jps | grep surefirebooter | cut -d ' ' -f 1 | xargs kill -9
    else
      echo "We're ok: there is no zombie test, but some tests took some time to stop"
    fi
  else
    echo "We're ok: there is no zombie test"
  fi
[Hadoop] $ /bin/bash -xe /tmp/hudson5079032603012447979.sh
++ jps
++ wc -l
++ grep surefirebooter
+ ZOMBIE_TESTS_COUNT=1
+ [[ 1 != 0 ]]
+ echo 'Suspicious java process found - waiting 10s to see if there are just slow to stop'
Suspicious java process found - waiting 10s to see if there are just slow to stop
+ sleep 10
++ jps
++ grep surefirebooter
++ wc -l
+ ZOMBIE_TESTS_COUNT=1
+ [[ 1 != 0 ]]
+ echo 'There are 1 zombie tests, they should have been killed by surefire but survived'
There are 1 zombie tests, they should have been killed by surefire but survived
+ echo '************ BEGIN zombies jstack extract'
************ BEGIN zombies jstack extract
++ jps
++ grep surefirebooter
++ xargs -n 1 jstack
++ grep .test
++ grep '\.java'
++ cut -d ' ' -f 1
10283: Unable to open socket file: target process not responding or HotSpot VM not loaded
The -F option can be used when the target process is not responding
+ ZB_STACK=
POST BUILD TASK : FAILURE
END OF POST BUILD TASK : 0
Archiving artifacts

Mime
View raw message