hbase-builds mailing list archives

Site index · List index
Message view « Date » · « Thread »
Top « Date » · « Thread »
From Apache Jenkins Server <jenk...@builds.apache.org>
Subject Build failed in Jenkins: HBase-1.3 » latest1.8,Hadoop #32
Date Thu, 02 Jul 2015 02:38:20 GMT
See <https://builds.apache.org/job/HBase-1.3/jdk=latest1.8,label=Hadoop/32/changes>

Changes:

[stack] HBASE-13895 DATALOSS: Region assigned before WAL replay when abort (Enis Soztutar)

------------------------------------------
[...truncated 42964 lines...]
89/264 KB   5/5 KB   20/20 KB   
93/264 KB   5/5 KB   20/20 KB   
97/264 KB   5/5 KB   20/20 KB   
101/264 KB   5/5 KB   20/20 KB   
105/264 KB   5/5 KB   20/20 KB   
109/264 KB   5/5 KB   20/20 KB   
113/264 KB   5/5 KB   20/20 KB   
4/246 KB   113/264 KB   5/5 KB   20/20 KB   
4/246 KB   117/264 KB   5/5 KB   20/20 KB   
6/246 KB   117/264 KB   5/5 KB   20/20 KB   
10/246 KB   117/264 KB   5/5 KB   20/20 KB   
10/246 KB   121/264 KB   5/5 KB   20/20 KB   
14/246 KB   125/264 KB   5/5 KB   20/20 KB   
10/246 KB   125/264 KB   5/5 KB   20/20 KB   
18/246 KB   125/264 KB   5/5 KB   20/20 KB   
18/246 KB   129/264 KB   5/5 KB   20/20 KB   
22/246 KB   129/264 KB   5/5 KB   20/20 KB   
22/246 KB   133/264 KB   5/5 KB   20/20 KB   
26/246 KB   133/264 KB   5/5 KB   20/20 KB   
30/246 KB   133/264 KB   5/5 KB   20/20 KB   
30/246 KB   137/264 KB   5/5 KB   20/20 KB   
34/246 KB   137/264 KB   5/5 KB   20/20 KB   
34/246 KB   141/264 KB   5/5 KB   20/20 KB   
38/246 KB   141/264 KB   5/5 KB   20/20 KB   
38/246 KB   145/264 KB   5/5 KB   20/20 KB   
42/246 KB   145/264 KB   5/5 KB   20/20 KB   
46/246 KB   145/264 KB   5/5 KB   20/20 KB   
46/246 KB   149/264 KB   5/5 KB   20/20 KB   
50/246 KB   149/264 KB   5/5 KB   20/20 KB   
50/246 KB   153/264 KB   5/5 KB   20/20 KB   
54/246 KB   153/264 KB   5/5 KB   20/20 KB   
58/246 KB   157/264 KB   5/5 KB   20/20 KB   
58/246 KB   157/264 KB   5/5 KB   20/20 KB   
62/246 KB   157/264 KB   5/5 KB   20/20 KB   
62/246 KB   161/264 KB   5/5 KB   20/20 KB   
66/246 KB   161/264 KB   5/5 KB   20/20 KB   
70/246 KB   161/264 KB   5/5 KB   20/20 KB   
70/246 KB   165/264 KB   5/5 KB   20/20 KB   
74/246 KB   165/264 KB   5/5 KB   20/20 KB   
74/246 KB   169/264 KB   5/5 KB   20/20 KB   
78/246 KB   169/264 KB   5/5 KB   20/20 KB   
78/246 KB   173/264 KB   5/5 KB   20/20 KB   
82/246 KB   173/264 KB   5/5 KB   20/20 KB   
86/246 KB   173/264 KB   5/5 KB   20/20 KB   
86/246 KB   177/264 KB   5/5 KB   20/20 KB   
90/246 KB   177/264 KB   5/5 KB   20/20 KB   
90/246 KB   181/264 KB   5/5 KB   20/20 KB   
94/246 KB   181/264 KB   5/5 KB   20/20 KB   
98/246 KB   181/264 KB   5/5 KB   20/20 KB   
98/246 KB   185/264 KB   5/5 KB   20/20 KB   
102/246 KB   185/264 KB   5/5 KB   20/20 KB   
102/246 KB   189/264 KB   5/5 KB   20/20 KB   
106/246 KB   189/264 KB   5/5 KB   20/20 KB   
110/246 KB   189/264 KB   5/5 KB   20/20 KB   
110/246 KB   193/264 KB   5/5 KB   20/20 KB   
114/246 KB   193/264 KB   5/5 KB   20/20 KB   
114/246 KB   197/264 KB   5/5 KB   20/20 KB   
118/246 KB   197/264 KB   5/5 KB   20/20 KB   
122/246 KB   197/264 KB   5/5 KB   20/20 KB   
122/246 KB   201/264 KB   5/5 KB   20/20 KB   
126/246 KB   201/264 KB   5/5 KB   20/20 KB   
126/246 KB   205/264 KB   5/5 KB   20/20 KB   
130/246 KB   205/264 KB   5/5 KB   20/20 KB   
130/246 KB   209/264 KB   5/5 KB   20/20 KB   
134/246 KB   209/264 KB   5/5 KB   20/20 KB   
138/246 KB   209/264 KB   5/5 KB   20/20 KB   
138/246 KB   213/264 KB   5/5 KB   20/20 KB   
142/246 KB   213/264 KB   5/5 KB   20/20 KB   
142/246 KB   217/264 KB   5/5 KB   20/20 KB   
146/246 KB   217/264 KB   5/5 KB   20/20 KB   
150/246 KB   217/264 KB   5/5 KB   20/20 KB   
150/246 KB   221/264 KB   5/5 KB   20/20 KB   
154/246 KB   221/264 KB   5/5 KB   20/20 KB   
154/246 KB   225/264 KB   5/5 KB   20/20 KB   
158/246 KB   225/264 KB   5/5 KB   20/20 KB   
158/246 KB   229/264 KB   5/5 KB   20/20 KB   
162/246 KB   229/264 KB   5/5 KB   20/20 KB   
166/246 KB   229/264 KB   5/5 KB   20/20 KB   
166/246 KB   233/264 KB   5/5 KB   20/20 KB   
170/246 KB   233/264 KB   5/5 KB   20/20 KB   
170/246 KB   237/264 KB   5/5 KB   20/20 KB   
174/246 KB   237/264 KB   5/5 KB   20/20 KB   
178/246 KB   237/264 KB   5/5 KB   20/20 KB   
178/246 KB   240/264 KB   5/5 KB   20/20 KB   
182/246 KB   240/264 KB   5/5 KB   20/20 KB   
186/246 KB   240/264 KB   5/5 KB   20/20 KB   
190/246 KB   240/264 KB   5/5 KB   20/20 KB   
194/246 KB   240/264 KB   5/5 KB   20/20 KB   
198/246 KB   240/264 KB   5/5 KB   20/20 KB   
202/246 KB   240/264 KB   5/5 KB   20/20 KB   
206/246 KB   240/264 KB   5/5 KB   20/20 KB   
210/246 KB   240/264 KB   5/5 KB   20/20 KB   
214/246 KB   240/264 KB   5/5 KB   20/20 KB   
218/246 KB   240/264 KB   5/5 KB   20/20 KB   
222/246 KB   240/264 KB   5/5 KB   20/20 KB   
226/246 KB   240/264 KB   5/5 KB   20/20 KB   
230/246 KB   240/264 KB   5/5 KB   20/20 KB   
234/246 KB   240/264 KB   5/5 KB   20/20 KB   
238/246 KB   240/264 KB   5/5 KB   20/20 KB   
242/246 KB   240/264 KB   5/5 KB   20/20 KB   
246/246 KB   240/264 KB   5/5 KB   20/20 KB   
246/246 KB   240/264 KB   5/5 KB   20/20 KB   
246/246 KB   242/264 KB   5/5 KB   20/20 KB   
246/246 KB   245/264 KB   5/5 KB   20/20 KB   
246/246 KB   249/264 KB   5/5 KB   20/20 KB   
246/246 KB   252/264 KB   5/5 KB   20/20 KB   
246/246 KB   256/264 KB   5/5 KB   20/20 KB   
246/246 KB   257/264 KB   5/5 KB   20/20 KB   
246/246 KB   261/264 KB   5/5 KB   20/20 KB   
246/246 KB   264/264 KB   5/5 KB   20/20 KB   
                                              
Downloaded: http://repo.maven.apache.org/maven2/org/codehaus/plexus/plexus-compiler-api/1.8.1/plexus-compiler-api-1.8.1.jar
(20 KB at 367.8 KB/sec)
                                              
Downloaded: http://repo.maven.apache.org/maven2/org/jamon/jamon-api/2.3.0/jamon-api-2.3.0.jar
(5 KB at 83.2 KB/sec)
                                              
Downloaded: http://repo.maven.apache.org/maven2/org/codehaus/plexus/plexus-utils/1.5.5/plexus-utils-1.5.5.jar
(246 KB at 4159.1 KB/sec)
                                              
Downloaded: http://repo.maven.apache.org/maven2/org/jamon/jamon-processor/2.3.4/jamon-processor-2.3.4.jar
(264 KB at 3514.4 KB/sec)
                                              
Downloaded: http://repo.maven.apache.org/maven2/org/jamon/jamon-runtime/2.3.1/jamon-runtime-2.3.1.jar
(0 B at 0.0 KB/sec)
[INFO] Translating 10 templates from <https://builds.apache.org/job/HBase-1.3/jdk=latest1.8,label=Hadoop/ws/hbase-server/src/main/jamon>
to <https://builds.apache.org/job/HBase-1.3/jdk=latest1.8,label=Hadoop/ws/hbase-server/target/generated-jamon>
[INFO] 
[INFO] --- maven-antrun-plugin:1.6:run (generate) @ hbase-server ---
[INFO] Executing tasks

main:
    [mkdir] Created dir: <https://builds.apache.org/job/HBase-1.3/jdk=latest1.8,label=Hadoop/ws/hbase-server/target/hbase-webapps>
     [copy] Copying 20 files to <https://builds.apache.org/job/HBase-1.3/jdk=latest1.8,label=Hadoop/ws/hbase-server/target/hbase-webapps>
log4j:WARN No appenders could be found for logger (org.mortbay.log).
log4j:WARN Please initialize the log4j system properly.
log4j:WARN See http://logging.apache.org/log4j/1.2/faq.html#noconfig for more info.
    [mkdir] Created dir: <https://builds.apache.org/job/HBase-1.3/jdk=latest1.8,label=Hadoop/ws/hbase-server/target/hbase-webapps/master/WEB-INF>
    [mkdir] Created dir: <https://builds.apache.org/job/HBase-1.3/jdk=latest1.8,label=Hadoop/ws/hbase-server/target/hbase-webapps/regionserver/WEB-INF>
[INFO] Executed tasks
[INFO] 
[INFO] --- maven-remote-resources-plugin:1.4:process (default) @ hbase-server ---
[INFO] 
[INFO] --- maven-resources-plugin:2.6:resources (default-resources) @ hbase-server ---
[INFO] Using 'UTF-8' encoding to copy filtered resources.
[INFO] Copying 22 resources
[INFO] Copying 3 resources
[INFO] 
[INFO] --- maven-compiler-plugin:2.5.1:compile (default-compile) @ hbase-server ---
[INFO] Compiling 783 source files to <https://builds.apache.org/job/HBase-1.3/jdk=latest1.8,label=Hadoop/ws/hbase-server/target/classes>
[INFO] -------------------------------------------------------------
[ERROR] COMPILATION ERROR : 
[INFO] -------------------------------------------------------------
[ERROR] <https://builds.apache.org/job/HBase-1.3/jdk=latest1.8,label=Hadoop/ws/hbase-server/src/main/java/org/apache/hadoop/hbase/master/AssignmentManager.java>:[94,43]
error: cannot find symbol
[ERROR]   symbol:   class RegionServerAbortedException
  location: package org.apache.hadoop.hbase.regionserver
<https://builds.apache.org/job/HBase-1.3/jdk=latest1.8,label=Hadoop/ws/hbase-server/src/main/java/org/apache/hadoop/hbase/master/AssignmentManager.java>:[1872,25]
error: cannot find symbol
[ERROR]   symbol:   class RegionServerAbortedException
  location: class AssignmentManager
<https://builds.apache.org/job/HBase-1.3/jdk=latest1.8,label=Hadoop/ws/hbase-server/src/main/java/org/apache/hadoop/hbase/regionserver/RSRpcServices.java>:[984,16]
error: cannot find symbol
[INFO] 3 errors 
[INFO] -------------------------------------------------------------
[INFO] ------------------------------------------------------------------------
[INFO] Reactor Summary:
[INFO] 
[INFO] HBase ............................................. SUCCESS [58.384s]
[INFO] HBase - Checkstyle ................................ SUCCESS [5.599s]
[INFO] HBase - Annotations ............................... SUCCESS [1.010s]
[INFO] HBase - Protocol .................................. SUCCESS [18.177s]
[INFO] HBase - Common .................................... SUCCESS [2:30.632s]
[INFO] HBase - Procedure ................................. SUCCESS [1:52.528s]
[INFO] HBase - Client .................................... SUCCESS [1:30.010s]
[INFO] HBase - Hadoop Compatibility ...................... SUCCESS [8.439s]
[INFO] HBase - Hadoop Two Compatibility .................. SUCCESS [9.944s]
[INFO] HBase - Prefix Tree ............................... SUCCESS [7.455s]
[INFO] HBase - Server .................................... FAILURE [1:09.604s]
[INFO] HBase - Testing Util .............................. SKIPPED
[INFO] HBase - Thrift .................................... SKIPPED
[INFO] HBase - Rest ...................................... SKIPPED
[INFO] HBase - Shell ..................................... SKIPPED
[INFO] HBase - Integration Tests ......................... SKIPPED
[INFO] HBase - Examples .................................. SKIPPED
[INFO] HBase - Assembly .................................. SKIPPED
[INFO] HBase - Shaded .................................... SKIPPED
[INFO] HBase - Shaded - Client ........................... SKIPPED
[INFO] HBase - Shaded - Server ........................... SKIPPED
[INFO] ------------------------------------------------------------------------
[INFO] BUILD FAILURE
[INFO] ------------------------------------------------------------------------
[INFO] Total time: 9:07.919s
[INFO] Finished at: Thu Jul 02 02:36:36 UTC 2015
[INFO] Final Memory: 96M/1133M
[INFO] ------------------------------------------------------------------------
[ERROR] Failed to execute goal org.apache.maven.plugins:maven-compiler-plugin:2.5.1:compile
(default-compile) on project hbase-server: Compilation failure: Compilation failure:
[ERROR] <https://builds.apache.org/job/HBase-1.3/jdk=latest1.8,label=Hadoop/ws/hbase-server/src/main/java/org/apache/hadoop/hbase/master/AssignmentManager.java>:[94,43]
error: cannot find symbol
[ERROR] symbol:   class RegionServerAbortedException
[ERROR] location: package org.apache.hadoop.hbase.regionserver
[ERROR] <https://builds.apache.org/job/HBase-1.3/jdk=latest1.8,label=Hadoop/ws/hbase-server/src/main/java/org/apache/hadoop/hbase/master/AssignmentManager.java>:[1872,25]
error: cannot find symbol
[ERROR] symbol:   class RegionServerAbortedException
[ERROR] location: class AssignmentManager
[ERROR] <https://builds.apache.org/job/HBase-1.3/jdk=latest1.8,label=Hadoop/ws/hbase-server/src/main/java/org/apache/hadoop/hbase/regionserver/RSRpcServices.java>:[984,16]
error: cannot find symbol
[ERROR] -> [Help 1]
[ERROR] 
[ERROR] To see the full stack trace of the errors, re-run Maven with the -e switch.
[ERROR] Re-run Maven using the -X switch to enable full debug logging.
[ERROR] 
[ERROR] For more information about the errors and possible solutions, please read the following
articles:
[ERROR] [Help 1] http://cwiki.apache.org/confluence/display/MAVEN/MojoFailureException
[ERROR] 
[ERROR] After correcting the problems, you can resume the build with the command
[ERROR]   mvn <goals> -rf :hbase-server
Build step 'Invoke top-level Maven targets' marked build as failure
Performing Post build task...
Match found for :.* : True
Logical operation result is TRUE
Running script  :   ZOMBIE_TESTS_COUNT=`jps | grep surefirebooter | wc -l`
  if [[ $ZOMBIE_TESTS_COUNT != 0 ]] ; then
    #It seems sometimes the tests are not dying immediately. Let's give them 10s
    echo "Suspicious java process found - waiting 10s to see if there are just slow to stop"
    sleep 10   
    ZOMBIE_TESTS_COUNT=`jps | grep surefirebooter | wc -l`
    if [[ $ZOMBIE_TESTS_COUNT != 0 ]] ; then
      echo "There are $ZOMBIE_TESTS_COUNT zombie tests, they should have been killed by surefire
but survived"
      echo "************ BEGIN zombies jstack extract"
      ZB_STACK=`jps | grep surefirebooter | cut -d ' ' -f 1 | xargs -n 1 jstack | grep ".test"
| grep "\.java"`
      jps | grep surefirebooter | cut -d ' ' -f 1 | xargs -n 1 jstack
      echo "************ END  zombies jstack extract"
      JIRA_COMMENT="$JIRA_COMMENT

     {color:red}-1 core zombie tests{color}.  There are ${ZOMBIE_TESTS_COUNT} zombie test(s):
${ZB_STACK}"
      BAD=1
      jps | grep surefirebooter | cut -d ' ' -f 1 | xargs kill -9
    else
      echo "We're ok: there is no zombie test, but some tests took some time to stop"
    fi
  else
    echo "We're ok: there is no zombie test"
  fi
[Hadoop] $ /bin/bash -xe /tmp/hudson7115327523681603806.sh
++ jps
++ grep surefirebooter
++ wc -l
+ ZOMBIE_TESTS_COUNT=0
+ [[ 0 != 0 ]]
+ echo 'We'\''re ok: there is no zombie test'
We're ok: there is no zombie test
POST BUILD TASK : SUCCESS
END OF POST BUILD TASK : 0
Archiving artifacts
Sending artifact delta relative to HBase-1.3 » latest1.8,Hadoop #28
Archived 313 artifacts
Archive block size is 32768
Received 2 blocks and 1333554 bytes
Compression is 4.7%
Took 1 min 42 sec

Mime
View raw message