hbase-builds mailing list archives

Site index · List index
Message view « Date » · « Thread »
Top « Date » · « Thread »
From Apache Jenkins Server <jenk...@builds.apache.org>
Subject Build failed in Jenkins: HBase-TRUNK #6652
Date Thu, 16 Jul 2015 01:36:46 GMT
See <https://builds.apache.org/job/HBase-TRUNK/6652/changes>

Changes:

[eclark] HBASE-14094 Procedure.proto can't be compiled to C++

------------------------------------------
[...truncated 4892 lines...]
Tests run: 3, Failures: 0, Errors: 0, Skipped: 0, Time elapsed: 1.335 sec - in org.apache.hadoop.hbase.master.cleaner.TestHFileCleaner
Tests run: 8, Failures: 0, Errors: 0, Skipped: 0, Time elapsed: 354.174 sec - in org.apache.hadoop.hbase.master.procedure.TestMasterFailoverWithProcedures
Running org.apache.hadoop.hbase.master.TestClusterStatusPublisher
Tests run: 3, Failures: 0, Errors: 0, Skipped: 0, Time elapsed: 0.495 sec - in org.apache.hadoop.hbase.master.TestClusterStatusPublisher
Running org.apache.hadoop.hbase.master.TestMasterMetricsWrapper
Tests run: 1, Failures: 0, Errors: 0, Skipped: 0, Time elapsed: 2.735 sec - in org.apache.hadoop.hbase.master.TestMasterMetricsWrapper
Running org.apache.hadoop.hbase.master.TestMasterTransitions
Running org.apache.hadoop.hbase.master.TestHMasterRPCException
Tests run: 3, Failures: 0, Errors: 0, Skipped: 3, Time elapsed: 3.832 sec - in org.apache.hadoop.hbase.master.TestMasterTransitions
Tests run: 2, Failures: 0, Errors: 0, Skipped: 0, Time elapsed: 59.896 sec - in org.apache.hadoop.hbase.master.TestRestartCluster
Running org.apache.hadoop.hbase.master.TestTableLockManager
Tests run: 1, Failures: 0, Errors: 0, Skipped: 0, Time elapsed: 6.692 sec - in org.apache.hadoop.hbase.master.TestHMasterRPCException
Running org.apache.hadoop.hbase.master.TestAssignmentListener
Running org.apache.hadoop.hbase.master.balancer.TestDefaultLoadBalancer
Tests run: 1, Failures: 0, Errors: 0, Skipped: 0, Time elapsed: 2.326 sec - in org.apache.hadoop.hbase.master.balancer.TestDefaultLoadBalancer
Running org.apache.hadoop.hbase.master.balancer.TestStochasticLoadBalancer
Running org.apache.hadoop.hbase.master.TestWarmupRegion
Tests run: 2, Failures: 0, Errors: 0, Skipped: 0, Time elapsed: 13.217 sec - in org.apache.hadoop.hbase.master.TestAssignmentListener
Tests run: 4, Failures: 0, Errors: 0, Skipped: 0, Time elapsed: 51.871 sec - in org.apache.hadoop.hbase.master.cleaner.TestSnapshotFromMaster
Running org.apache.hadoop.hbase.master.balancer.TestBaseLoadBalancer
Tests run: 7, Failures: 0, Errors: 0, Skipped: 0, Time elapsed: 0.809 sec - in org.apache.hadoop.hbase.master.balancer.TestBaseLoadBalancer
Running org.apache.hadoop.hbase.master.TestTableStateManager
Running org.apache.hadoop.hbase.master.TestMasterRestartAfterDisablingTable
Tests run: 1, Failures: 0, Errors: 0, Skipped: 0, Time elapsed: 22.679 sec - in org.apache.hadoop.hbase.master.TestTableStateManager
Tests run: 1, Failures: 0, Errors: 0, Skipped: 0, Time elapsed: 35.603 sec - in org.apache.hadoop.hbase.master.TestWarmupRegion
Tests run: 1, Failures: 0, Errors: 0, Skipped: 0, Time elapsed: 29.909 sec - in org.apache.hadoop.hbase.master.TestMasterRestartAfterDisablingTable
Running org.apache.hadoop.hbase.TestMetaTableAccessorNoCluster
Running org.apache.hadoop.hbase.master.TestDistributedLogSplitting
Tests run: 2, Failures: 0, Errors: 0, Skipped: 0, Time elapsed: 5.356 sec - in org.apache.hadoop.hbase.TestMetaTableAccessorNoCluster
Running org.apache.hadoop.hbase.master.TestAssignmentManagerOnCluster
Running org.apache.hadoop.hbase.mapred.TestTableSnapshotInputFormat
Tests run: 4, Failures: 0, Errors: 0, Skipped: 0, Time elapsed: 109.597 sec - in org.apache.hadoop.hbase.master.TestTableLockManager
Running org.apache.hadoop.hbase.mapred.TestMultiTableSnapshotInputFormat
Tests run: 20, Failures: 0, Errors: 0, Skipped: 0, Time elapsed: 144.485 sec - in org.apache.hadoop.hbase.master.TestAssignmentManagerOnCluster
Running org.apache.hadoop.hbase.mapred.TestTableMapReduceUtil
Tests run: 4, Failures: 0, Errors: 0, Skipped: 0, Time elapsed: 172.422 sec - in org.apache.hadoop.hbase.mapred.TestMultiTableSnapshotInputFormat
Tests run: 4, Failures: 0, Errors: 0, Skipped: 0, Time elapsed: 103.394 sec - in org.apache.hadoop.hbase.mapred.TestTableMapReduceUtil
Running org.apache.hadoop.hbase.mapred.TestTableInputFormat
Running org.apache.hadoop.hbase.mapred.TestTableMapReduce
Tests run: 18, Failures: 0, Errors: 0, Skipped: 0, Time elapsed: 367.771 sec - in org.apache.hadoop.hbase.master.TestDistributedLogSplitting
Tests run: 6, Failures: 0, Errors: 0, Skipped: 0, Time elapsed: 365.591 sec - in org.apache.hadoop.hbase.mapred.TestTableSnapshotInputFormat
Running org.apache.hadoop.hbase.TestIOFencing
Running org.apache.hadoop.hbase.TestMetaTableLocator
Tests run: 7, Failures: 0, Errors: 0, Skipped: 0, Time elapsed: 4.742 sec - in org.apache.hadoop.hbase.TestMetaTableLocator
Tests run: 8, Failures: 0, Errors: 0, Skipped: 0, Time elapsed: 102.875 sec - in org.apache.hadoop.hbase.mapred.TestTableInputFormat
Running org.apache.hadoop.hbase.util.TestRegionSplitter
Running org.apache.hadoop.hbase.util.TestFSHDFSUtils
Tests run: 6, Failures: 0, Errors: 0, Skipped: 0, Time elapsed: 11.494 sec - in org.apache.hadoop.hbase.util.TestRegionSplitter
Tests run: 3, Failures: 0, Errors: 0, Skipped: 0, Time elapsed: 9.097 sec - in org.apache.hadoop.hbase.util.TestFSHDFSUtils
Running org.apache.hadoop.hbase.util.TestFSVisitor
Tests run: 3, Failures: 0, Errors: 0, Skipped: 0, Time elapsed: 3.643 sec - in org.apache.hadoop.hbase.util.TestFSVisitor
Running org.apache.hadoop.hbase.util.TestMiniClusterLoadParallel
Running org.apache.hadoop.hbase.util.hbck.TestOfflineMetaRebuildOverlap
Tests run: 2, Failures: 0, Errors: 0, Skipped: 0, Time elapsed: 114.51 sec - in org.apache.hadoop.hbase.mapred.TestTableMapReduce
Running org.apache.hadoop.hbase.util.hbck.TestOfflineMetaRebuildHole
Tests run: 1, Failures: 0, Errors: 0, Skipped: 0, Time elapsed: 34.042 sec - in org.apache.hadoop.hbase.util.hbck.TestOfflineMetaRebuildOverlap
Running org.apache.hadoop.hbase.util.hbck.TestOfflineMetaRebuildBase
Tests run: 1, Failures: 0, Errors: 0, Skipped: 0, Time elapsed: 31.851 sec - in org.apache.hadoop.hbase.util.hbck.TestOfflineMetaRebuildHole
Running org.apache.hadoop.hbase.util.TestConnectionCache
Tests run: 4, Failures: 0, Errors: 0, Skipped: 0, Time elapsed: 66.319 sec - in org.apache.hadoop.hbase.util.TestMiniClusterLoadParallel
Running org.apache.hadoop.hbase.util.TestFSTableDescriptors
Tests run: 1, Failures: 0, Errors: 0, Skipped: 0, Time elapsed: 34.125 sec - in org.apache.hadoop.hbase.util.hbck.TestOfflineMetaRebuildBase
Tests run: 16, Failures: 0, Errors: 0, Skipped: 0, Time elapsed: 2.829 sec - in org.apache.hadoop.hbase.util.TestFSTableDescriptors
Running org.apache.hadoop.hbase.util.TestMiniClusterLoadEncoded
Running org.apache.hadoop.hbase.util.TestDefaultEnvironmentEdge
Tests run: 1, Failures: 0, Errors: 0, Skipped: 0, Time elapsed: 0.315 sec - in org.apache.hadoop.hbase.util.TestDefaultEnvironmentEdge
Running org.apache.hadoop.hbase.util.TestTableName
Tests run: 6, Failures: 0, Errors: 0, Skipped: 0, Time elapsed: 0.625 sec - in org.apache.hadoop.hbase.util.TestTableName
Running org.apache.hadoop.hbase.util.TestMiniClusterLoadSequential
Tests run: 1, Failures: 0, Errors: 0, Skipped: 0, Time elapsed: 23.287 sec - in org.apache.hadoop.hbase.util.TestConnectionCache
Running org.apache.hadoop.hbase.util.TestIdLock
Tests run: 1, Failures: 0, Errors: 0, Skipped: 0, Time elapsed: 15.199 sec - in org.apache.hadoop.hbase.util.TestIdLock
Tests run: 23, Failures: 0, Errors: 0, Skipped: 0, Time elapsed: 597.927 sec - in org.apache.hadoop.hbase.master.balancer.TestStochasticLoadBalancer
Running org.apache.hadoop.hbase.util.TestFSUtils
Running org.apache.hadoop.hbase.util.TestCoprocessorScanPolicy
Tests run: 4, Failures: 0, Errors: 0, Skipped: 0, Time elapsed: 23.856 sec - in org.apache.hadoop.hbase.util.TestCoprocessorScanPolicy
Tests run: 5, Failures: 0, Errors: 0, Skipped: 0, Time elapsed: 74.625 sec - in org.apache.hadoop.hbase.util.TestMiniClusterLoadEncoded
Tests run: 11, Failures: 0, Errors: 0, Skipped: 0, Time elapsed: 33.514 sec - in org.apache.hadoop.hbase.util.TestFSUtils
Tests run: 4, Failures: 0, Errors: 0, Skipped: 0, Time elapsed: 71.321 sec - in org.apache.hadoop.hbase.util.TestMiniClusterLoadSequential
Running org.apache.hadoop.hbase.util.TestMergeTool
Running org.apache.hadoop.hbase.util.TestMergeTable
Running org.apache.hadoop.hbase.util.TestHBaseFsckEncryption
Tests run: 2, Failures: 0, Errors: 0, Skipped: 0, Time elapsed: 215.172 sec - in org.apache.hadoop.hbase.TestIOFencing
Running org.apache.hadoop.hbase.util.TestProcessBasedCluster
Tests run: 1, Failures: 0, Errors: 0, Skipped: 0, Time elapsed: 0.118 sec - in org.apache.hadoop.hbase.util.TestProcessBasedCluster
Running org.apache.hadoop.hbase.util.TestHBaseFsck
Tests run: 1, Failures: 0, Errors: 0, Skipped: 0, Time elapsed: 19.745 sec - in org.apache.hadoop.hbase.util.TestHBaseFsckEncryption
Tests run: 1, Failures: 0, Errors: 0, Skipped: 0, Time elapsed: 24.438 sec - in org.apache.hadoop.hbase.util.TestMergeTool
Running org.apache.hadoop.hbase.TestMetaTableAccessor
Tests run: 1, Failures: 0, Errors: 0, Skipped: 0, Time elapsed: 36.967 sec - in org.apache.hadoop.hbase.util.TestMergeTable
Tests run: 14, Failures: 0, Errors: 0, Skipped: 0, Time elapsed: 27.003 sec - in org.apache.hadoop.hbase.TestMetaTableAccessor
Tests run: 51, Failures: 0, Errors: 0, Skipped: 1, Time elapsed: 433.181 sec - in org.apache.hadoop.hbase.util.TestHBaseFsck

Results :

Failed tests: 
  TestVisibilityLabelsWithDistributedLogReplay>TestVisibilityLabelsWithDefaultVisLabelService.testAddLabels:110
null
  TestVisibilityLabelsWithDistributedLogReplay>TestVisibilityLabelsWithDefaultVisLabelService.testListLabels:198
expected:<12> but was:<0>
  TestVisibilityLabelsWithDistributedLogReplay>TestVisibilityLabelsWithDefaultVisLabelService.testListLabelsWithRegEx:220
expected:<2> but was:<0>

Tests in error: 
  TestVisibilityLabelsWithDistributedLogReplay>TestVisibilityLabelsWithDefaultVisLabelService.testAddVisibilityLabelsOnRSRestart:122->TestVisibilityLabels.waitForLabelsRegionAvailability:390
ยป 


Tests run: 2524, Failures: 3, Errors: 1, Skipped: 19

[INFO] ------------------------------------------------------------------------
[INFO] Reactor Summary:
[INFO] 
[INFO] HBase ............................................. SUCCESS [  2.905 s]
[INFO] HBase - Checkstyle ................................ SUCCESS [  0.671 s]
[INFO] HBase - Annotations ............................... SUCCESS [  0.233 s]
[INFO] HBase - Protocol .................................. SUCCESS [  2.800 s]
[INFO] HBase - Common .................................... SUCCESS [02:38 min]
[INFO] HBase - Procedure ................................. SUCCESS [02:07 min]
[INFO] HBase - Client .................................... SUCCESS [02:05 min]
[INFO] HBase - Hadoop Compatibility ...................... SUCCESS [ 14.215 s]
[INFO] HBase - Hadoop Two Compatibility .................. SUCCESS [ 17.501 s]
[INFO] HBase - Prefix Tree ............................... SUCCESS [ 21.785 s]
[INFO] HBase - Server .................................... FAILURE [  02:12 h]
[INFO] HBase - Testing Util .............................. SKIPPED
[INFO] HBase - Thrift .................................... SKIPPED
[INFO] HBase - Shell ..................................... SKIPPED
[INFO] HBase - Integration Tests ......................... SKIPPED
[INFO] HBase - Examples .................................. SKIPPED
[INFO] HBase - Rest ...................................... SKIPPED
[INFO] HBase - Assembly .................................. SKIPPED
[INFO] HBase - Shaded .................................... SKIPPED
[INFO] HBase - Shaded - Client ........................... SKIPPED
[INFO] HBase - Shaded - Server ........................... SKIPPED
[INFO] ------------------------------------------------------------------------
[INFO] BUILD FAILURE
[INFO] ------------------------------------------------------------------------
[INFO] Total time: 02:20 h
[INFO] Finished at: 2015-07-16T01:34:42+00:00
[INFO] Final Memory: 62M/569M
[INFO] ------------------------------------------------------------------------
[ERROR] Failed to execute goal org.apache.maven.plugins:maven-surefire-plugin:2.18:test (secondPartTestsExecution)
on project hbase-server: There are test failures.
[ERROR] 
[ERROR] Please refer to <https://builds.apache.org/job/HBase-TRUNK/ws/hbase-server/target/surefire-reports>
for the individual test results.
[ERROR] -> [Help 1]
[ERROR] 
[ERROR] To see the full stack trace of the errors, re-run Maven with the -e switch.
[ERROR] Re-run Maven using the -X switch to enable full debug logging.
[ERROR] 
[ERROR] For more information about the errors and possible solutions, please read the following
articles:
[ERROR] [Help 1] http://cwiki.apache.org/confluence/display/MAVEN/MojoFailureException
[ERROR] 
[ERROR] After correcting the problems, you can resume the build with the command
[ERROR]   mvn <goals> -rf :hbase-server
Build step 'Invoke top-level Maven targets' marked build as failure
Performing Post build task...
Match found for :.* : True
Logical operation result is TRUE
Running script  :   ZOMBIE_TESTS_COUNT=`jps | grep surefirebooter | wc -l`
  if [[ $ZOMBIE_TESTS_COUNT != 0 ]] ; then
    #It seems sometimes the tests are not dying immediately. Let's give them 10s
    echo "Suspicious java process found - waiting 10s to see if there are just slow to stop"
    sleep 10   
    ZOMBIE_TESTS_COUNT=`jps | grep surefirebooter | wc -l`
    if [[ $ZOMBIE_TESTS_COUNT != 0 ]] ; then
      echo "There are $ZOMBIE_TESTS_COUNT zombie tests, they should have been killed by surefire
but survived"
      echo "************ BEGIN zombies jstack extract"
      ZB_STACK=`jps | grep surefirebooter | cut -d ' ' -f 1 | xargs -n 1 jstack | grep ".test"
| grep "\.java"`
      jps | grep surefirebooter | cut -d ' ' -f 1 | xargs -n 1 jstack
      echo "************ END  zombies jstack extract"
      JIRA_COMMENT="$JIRA_COMMENT

     {color:red}-1 core zombie tests{color}.  There are ${ZOMBIE_TESTS_COUNT} zombie test(s):
${ZB_STACK}"
      BAD=1
      jps | grep surefirebooter | cut -d ' ' -f 1 | xargs kill -9
    else
      echo "We're ok: there is no zombie test, but some tests took some time to stop"
    fi
  else
    echo "We're ok: there is no zombie test"
  fi
[HBase-TRUNK] $ /bin/bash -xe /tmp/hudson8332109595004616340.sh
++ jps
++ grep surefirebooter
++ wc -l
+ ZOMBIE_TESTS_COUNT=0
+ [[ 0 != 0 ]]
+ echo 'We'\''re ok: there is no zombie test'
We're ok: there is no zombie test
POST BUILD TASK : SUCCESS
END OF POST BUILD TASK : 0
Archiving artifacts
Sending artifact delta relative to HBase-TRUNK #6648
Archived 2238 artifacts
Archive block size is 32768
Received 93 blocks and 438654683 bytes
Compression is 0.7%
Took 1 min 46 sec
Recording test results
[FINDBUGS] Collecting findbugs analysis files...
[FINDBUGS] Finding all files that match the pattern **/findbugs.xml,**/findbugsXml.xml
[FINDBUGS] Parsing 24 files in <https://builds.apache.org/job/HBase-TRUNK/ws/>
[FINDBUGS] Successfully parsed file <https://builds.apache.org/job/HBase-TRUNK/6652/artifact/hbase-annotations/target/findbugs.xml>
of module  with 0 warnings.
[FINDBUGS] Successfully parsed file <https://builds.apache.org/job/HBase-TRUNK/6652/artifact/hbase-annotations/target/findbugsXml.xml>
of module  with 0 warnings.
[FINDBUGS] Successfully parsed file <https://builds.apache.org/job/HBase-TRUNK/6652/artifact/hbase-client/target/findbugs.xml>
of module  with 0 warnings.
[FINDBUGS] Successfully parsed file <https://builds.apache.org/job/HBase-TRUNK/6652/artifact/hbase-client/target/findbugsXml.xml>
of module  with 10 warnings.
[FINDBUGS] Successfully parsed file <https://builds.apache.org/job/HBase-TRUNK/6652/artifact/hbase-common/target/findbugs.xml>
of module  with 0 warnings.
[FINDBUGS] Successfully parsed file <https://builds.apache.org/job/HBase-TRUNK/6652/artifact/hbase-common/target/findbugsXml.xml>
of module  with 4 warnings.
[FINDBUGS] Successfully parsed file <https://builds.apache.org/job/HBase-TRUNK/6652/artifact/hbase-examples/target/findbugs.xml>
of module  with 0 warnings.
[FINDBUGS] Successfully parsed file <https://builds.apache.org/job/HBase-TRUNK/6652/artifact/hbase-examples/target/findbugsXml.xml>
of module  with 0 warnings.
[FINDBUGS] Successfully parsed file <https://builds.apache.org/job/HBase-TRUNK/6652/artifact/hbase-hadoop-compat/target/findbugs.xml>
of module  with 0 warnings.
[FINDBUGS] Successfully parsed file <https://builds.apache.org/job/HBase-TRUNK/6652/artifact/hbase-hadoop-compat/target/findbugsXml.xml>
of module  with 0 warnings.
[FINDBUGS] Successfully parsed file <https://builds.apache.org/job/HBase-TRUNK/6652/artifact/hbase-hadoop2-compat/target/findbugs.xml>
of module  with 0 warnings.
[FINDBUGS] Successfully parsed file <https://builds.apache.org/job/HBase-TRUNK/6652/artifact/hbase-hadoop2-compat/target/findbugsXml.xml>
of module  with 0 warnings.
[FINDBUGS] Successfully parsed file <https://builds.apache.org/job/HBase-TRUNK/6652/artifact/hbase-prefix-tree/target/findbugs.xml>
of module  with 0 warnings.
[FINDBUGS] Successfully parsed file <https://builds.apache.org/job/HBase-TRUNK/6652/artifact/hbase-prefix-tree/target/findbugsXml.xml>
of module  with 0 warnings.
[FINDBUGS] Successfully parsed file <https://builds.apache.org/job/HBase-TRUNK/6652/artifact/hbase-procedure/target/findbugs.xml>
of module  with 0 warnings.
[FINDBUGS] Successfully parsed file <https://builds.apache.org/job/HBase-TRUNK/6652/artifact/hbase-procedure/target/findbugsXml.xml>
of module  with 1 warnings.
[FINDBUGS] Successfully parsed file <https://builds.apache.org/job/HBase-TRUNK/6652/artifact/hbase-protocol/target/findbugs.xml>
of module  with 0 warnings.
[FINDBUGS] Successfully parsed file <https://builds.apache.org/job/HBase-TRUNK/6652/artifact/hbase-protocol/target/findbugsXml.xml>
of module  with 0 warnings.
[FINDBUGS] Successfully parsed file <https://builds.apache.org/job/HBase-TRUNK/6652/artifact/hbase-rest/target/findbugs.xml>
of module  with 0 warnings.
[FINDBUGS] Successfully parsed file <https://builds.apache.org/job/HBase-TRUNK/6652/artifact/hbase-rest/target/findbugsXml.xml>
of module  with 2 warnings.
[FINDBUGS] Successfully parsed file <https://builds.apache.org/job/HBase-TRUNK/6652/artifact/hbase-server/target/findbugs.xml>
of module  with 0 warnings.
[FINDBUGS] Successfully parsed file <https://builds.apache.org/job/HBase-TRUNK/6652/artifact/hbase-server/target/findbugsXml.xml>
of module  with 76 warnings.
[FINDBUGS] Successfully parsed file <https://builds.apache.org/job/HBase-TRUNK/6652/artifact/hbase-thrift/target/findbugs.xml>
of module  with 0 warnings.
[FINDBUGS] Successfully parsed file <https://builds.apache.org/job/HBase-TRUNK/6652/artifact/hbase-thrift/target/findbugsXml.xml>
of module  with 0 warnings.
[FINDBUGS] Computing warning deltas based on reference build #6648
[CHECKSTYLE] Collecting checkstyle analysis files...
[CHECKSTYLE] Finding all files that match the pattern **/checkstyle-result.xml
[CHECKSTYLE] Parsing 21 files in <https://builds.apache.org/job/HBase-TRUNK/ws/>
[CHECKSTYLE] Successfully parsed file <https://builds.apache.org/job/HBase-TRUNK/6652/artifact/hbase-annotations/target/checkstyle-result.xml>
of module  with 0 warnings.
[CHECKSTYLE] Successfully parsed file <https://builds.apache.org/job/HBase-TRUNK/6652/artifact/hbase-assembly/target/checkstyle-result.xml>
of module  with 0 warnings.
[CHECKSTYLE] Successfully parsed file <https://builds.apache.org/job/HBase-TRUNK/6652/artifact/hbase-checkstyle/target/checkstyle-result.xml>
of module  with 0 warnings.
[CHECKSTYLE] Successfully parsed file <https://builds.apache.org/job/HBase-TRUNK/6652/artifact/hbase-client/target/checkstyle-result.xml>
of module  with 208 warnings.
[CHECKSTYLE] Successfully parsed file <https://builds.apache.org/job/HBase-TRUNK/6652/artifact/hbase-common/target/checkstyle-result.xml>
of module  with 107 warnings.
[CHECKSTYLE] Successfully parsed file <https://builds.apache.org/job/HBase-TRUNK/6652/artifact/hbase-examples/target/checkstyle-result.xml>
of module  with 28 warnings.
[CHECKSTYLE] Successfully parsed file <https://builds.apache.org/job/HBase-TRUNK/6652/artifact/hbase-hadoop-compat/target/checkstyle-result.xml>
of module  with 2 warnings.
[CHECKSTYLE] Successfully parsed file <https://builds.apache.org/job/HBase-TRUNK/6652/artifact/hbase-hadoop2-compat/target/checkstyle-result.xml>
of module  with 47 warnings.
[CHECKSTYLE] Successfully parsed file <https://builds.apache.org/job/HBase-TRUNK/6652/artifact/hbase-it/target/checkstyle-result.xml>
of module  with 0 warnings.
[CHECKSTYLE] Successfully parsed file <https://builds.apache.org/job/HBase-TRUNK/6652/artifact/hbase-prefix-tree/target/checkstyle-result.xml>
of module  with 18 warnings.
[CHECKSTYLE] Successfully parsed file <https://builds.apache.org/job/HBase-TRUNK/6652/artifact/hbase-procedure/target/checkstyle-result.xml>
of module  with 0 warnings.
[CHECKSTYLE] Successfully parsed file <https://builds.apache.org/job/HBase-TRUNK/6652/artifact/hbase-protocol/target/checkstyle-result.xml>
of module  with 2 warnings.
[CHECKSTYLE] Successfully parsed file <https://builds.apache.org/job/HBase-TRUNK/6652/artifact/hbase-rest/target/checkstyle-result.xml>
of module  with 42 warnings.
[CHECKSTYLE] Successfully parsed file <https://builds.apache.org/job/HBase-TRUNK/6652/artifact/hbase-server/target/checkstyle-result.xml>
of module  with 1391 warnings.
[CHECKSTYLE] Successfully parsed file <https://builds.apache.org/job/HBase-TRUNK/6652/artifact/hbase-shaded/hbase-shaded-client/target/checkstyle-result.xml>
of module  with 0 warnings.
[CHECKSTYLE] Successfully parsed file <https://builds.apache.org/job/HBase-TRUNK/6652/artifact/hbase-shaded/hbase-shaded-server/target/checkstyle-result.xml>
of module  with 0 warnings.
[CHECKSTYLE] Successfully parsed file <https://builds.apache.org/job/HBase-TRUNK/6652/artifact/hbase-shaded/target/checkstyle-result.xml>
of module  with 0 warnings.
[CHECKSTYLE] Successfully parsed file <https://builds.apache.org/job/HBase-TRUNK/6652/artifact/hbase-shell/target/checkstyle-result.xml>
of module  with 0 warnings.
[CHECKSTYLE] Successfully parsed file <https://builds.apache.org/job/HBase-TRUNK/6652/artifact/hbase-testing-util/target/checkstyle-result.xml>
of module  with 0 warnings.
[CHECKSTYLE] Successfully parsed file <https://builds.apache.org/job/HBase-TRUNK/6652/artifact/hbase-thrift/target/checkstyle-result.xml>
of module  with 27 warnings.
[CHECKSTYLE] Successfully parsed file <https://builds.apache.org/job/HBase-TRUNK/6652/artifact/target/checkstyle-result.xml>
of module  with 0 warnings.
[CHECKSTYLE] Computing warning deltas based on reference build #6648
Updating HBASE-14094

Mime
View raw message