hbase-builds mailing list archives

Site index · List index
Message view « Date » · « Thread »
Top « Date » · « Thread »
From Apache Jenkins Server <jenk...@builds.apache.org>
Subject Build failed in Jenkins: HBase-1.2 » latest1.7,Hadoop #55
Date Tue, 07 Jul 2015 02:59:39 GMT
See <https://builds.apache.org/job/HBase-1.2/jdk=latest1.7,label=Hadoop/55/changes>

Changes:

[enis] HBASE-13352 Add hbase.import.version to Import usage (Lars Hofhansl)

------------------------------------------
[...truncated 44178 lines...]
Tests run: 1, Failures: 0, Errors: 0, Skipped: 0, Time elapsed: 9.96 sec - in org.apache.hadoop.hbase.client.TestClientScannerRPCTimeout
Tests run: 3, Failures: 0, Errors: 0, Skipped: 0, Time elapsed: 48.842 sec - in org.apache.hadoop.hbase.client.TestTableSnapshotScanner
Running org.apache.hadoop.hbase.client.TestAdmin2
Tests run: 21, Failures: 0, Errors: 0, Skipped: 3, Time elapsed: 159.199 sec - in org.apache.hadoop.hbase.client.TestHCM
Running org.apache.hadoop.hbase.client.TestHTableUtil
Tests run: 2, Failures: 0, Errors: 0, Skipped: 0, Time elapsed: 4.402 sec - in org.apache.hadoop.hbase.client.TestHTableUtil
Running org.apache.hadoop.hbase.client.TestUpdateConfiguration
Tests run: 2, Failures: 0, Errors: 0, Skipped: 0, Time elapsed: 0.183 sec - in org.apache.hadoop.hbase.client.TestUpdateConfiguration
Running org.apache.hadoop.hbase.client.TestScannersFromClientSide
Running org.apache.hadoop.hbase.client.TestFromClientSide
Tests run: 7, Failures: 0, Errors: 0, Skipped: 0, Time elapsed: 14.84 sec - in org.apache.hadoop.hbase.client.TestScannersFromClientSide
Running org.apache.hadoop.hbase.client.TestSnapshotFromClientWithRegionReplicas
Tests run: 5, Failures: 0, Errors: 0, Skipped: 0, Time elapsed: 28.278 sec - in org.apache.hadoop.hbase.client.TestSnapshotFromClientWithRegionReplicas
Running org.apache.hadoop.hbase.client.TestCheckAndMutate
Tests run: 1, Failures: 0, Errors: 0, Skipped: 0, Time elapsed: 3.382 sec - in org.apache.hadoop.hbase.client.TestCheckAndMutate
Tests run: 5, Failures: 0, Errors: 0, Skipped: 0, Time elapsed: 147.416 sec - in org.apache.hadoop.hbase.client.TestRestoreSnapshotFromClientWithRegionReplicas
Running org.apache.hadoop.hbase.client.TestResultSizeEstimation
Tests run: 14, Failures: 0, Errors: 0, Skipped: 0, Time elapsed: 258.59 sec - in org.apache.hadoop.hbase.client.TestReplicasClient
Running org.apache.hadoop.hbase.client.TestSnapshotMetadata
Tests run: 2, Failures: 0, Errors: 0, Skipped: 0, Time elapsed: 5.824 sec - in org.apache.hadoop.hbase.client.TestResultSizeEstimation
Tests run: 24, Failures: 0, Errors: 0, Skipped: 0, Time elapsed: 102.681 sec - in org.apache.hadoop.hbase.client.TestAdmin2
Running org.apache.hadoop.hbase.TestDrainingServer
Running org.apache.hadoop.hbase.client.TestClientOperationInterrupt
Running org.apache.hadoop.hbase.client.TestFromClientSideWithCoprocessor
Tests run: 4, Failures: 0, Errors: 0, Skipped: 0, Time elapsed: 32.525 sec - in org.apache.hadoop.hbase.client.TestSnapshotMetadata
Running org.apache.hadoop.hbase.TestMetaTableAccessor
Tests run: 13, Failures: 0, Errors: 0, Skipped: 0, Time elapsed: 15.284 sec - in org.apache.hadoop.hbase.TestMetaTableAccessor
Running org.apache.hadoop.hbase.TestHBaseOnOtherDfsCluster
Tests run: 1, Failures: 0, Errors: 0, Skipped: 0, Time elapsed: 54.375 sec - in org.apache.hadoop.hbase.client.TestClientOperationInterrupt
Running org.apache.hadoop.hbase.util.hbck.TestOfflineMetaRebuildBase
Tests run: 1, Failures: 0, Errors: 0, Skipped: 0, Time elapsed: 12.116 sec - in org.apache.hadoop.hbase.TestHBaseOnOtherDfsCluster
Tests run: 2, Failures: 0, Errors: 0, Skipped: 0, Time elapsed: 61.8 sec - in org.apache.hadoop.hbase.TestDrainingServer
Running org.apache.hadoop.hbase.util.hbck.TestOfflineMetaRebuildOverlap
Running org.apache.hadoop.hbase.util.hbck.TestOfflineMetaRebuildHole
Tests run: 1, Failures: 0, Errors: 0, Skipped: 0, Time elapsed: 23.923 sec - in org.apache.hadoop.hbase.util.hbck.TestOfflineMetaRebuildBase
Running org.apache.hadoop.hbase.util.TestTableName
Tests run: 6, Failures: 0, Errors: 0, Skipped: 0, Time elapsed: 0.572 sec - in org.apache.hadoop.hbase.util.TestTableName
Tests run: 1, Failures: 0, Errors: 0, Skipped: 0, Time elapsed: 23.413 sec - in org.apache.hadoop.hbase.util.hbck.TestOfflineMetaRebuildOverlap
Tests run: 1, Failures: 0, Errors: 0, Skipped: 0, Time elapsed: 23.696 sec - in org.apache.hadoop.hbase.util.hbck.TestOfflineMetaRebuildHole
Running org.apache.hadoop.hbase.util.TestMiniClusterLoadEncoded
Running org.apache.hadoop.hbase.util.TestMiniClusterLoadSequential
Running org.apache.hadoop.hbase.util.TestCoprocessorScanPolicy
Tests run: 4, Failures: 0, Errors: 0, Skipped: 0, Time elapsed: 14.907 sec - in org.apache.hadoop.hbase.util.TestCoprocessorScanPolicy
Running org.apache.hadoop.hbase.util.TestIdLock
Tests run: 1, Failures: 0, Errors: 0, Skipped: 0, Time elapsed: 15.451 sec - in org.apache.hadoop.hbase.util.TestIdLock
Running org.apache.hadoop.hbase.util.TestMergeTable
Tests run: 82, Failures: 0, Errors: 0, Skipped: 4, Time elapsed: 209.241 sec - in org.apache.hadoop.hbase.client.TestFromClientSide
Running org.apache.hadoop.hbase.util.TestHBaseFsckEncryption
Tests run: 4, Failures: 0, Errors: 0, Skipped: 0, Time elapsed: 47.203 sec - in org.apache.hadoop.hbase.util.TestMiniClusterLoadSequential
Running org.apache.hadoop.hbase.util.TestMiniClusterLoadParallel
Tests run: 5, Failures: 0, Errors: 0, Skipped: 0, Time elapsed: 51.14 sec - in org.apache.hadoop.hbase.util.TestMiniClusterLoadEncoded
Tests run: 1, Failures: 0, Errors: 0, Skipped: 0, Time elapsed: 13.548 sec - in org.apache.hadoop.hbase.util.TestHBaseFsckEncryption
Running org.apache.hadoop.hbase.util.TestHBaseFsck
Running org.apache.hadoop.hbase.util.TestProcessBasedCluster
Tests run: 1, Failures: 0, Errors: 0, Skipped: 0, Time elapsed: 25.425 sec - in org.apache.hadoop.hbase.util.TestMergeTable
Tests run: 1, Failures: 0, Errors: 0, Skipped: 0, Time elapsed: 0.18 sec - in org.apache.hadoop.hbase.util.TestProcessBasedCluster
Running org.apache.hadoop.hbase.util.TestMergeTool
Running org.apache.hadoop.hbase.util.TestFSTableDescriptors
Tests run: 15, Failures: 0, Errors: 0, Skipped: 0, Time elapsed: 2.648 sec - in org.apache.hadoop.hbase.util.TestFSTableDescriptors
Running org.apache.hadoop.hbase.util.TestFSHDFSUtils
Tests run: 3, Failures: 0, Errors: 0, Skipped: 0, Time elapsed: 8.278 sec - in org.apache.hadoop.hbase.util.TestFSHDFSUtils
Running org.apache.hadoop.hbase.util.TestConnectionCache
Tests run: 1, Failures: 0, Errors: 0, Skipped: 0, Time elapsed: 20.088 sec - in org.apache.hadoop.hbase.util.TestMergeTool
Running org.apache.hadoop.hbase.util.TestFSVisitor
Tests run: 3, Failures: 0, Errors: 0, Skipped: 0, Time elapsed: 4.09 sec - in org.apache.hadoop.hbase.util.TestFSVisitor
Running org.apache.hadoop.hbase.util.TestFSUtils
Tests run: 1, Failures: 0, Errors: 0, Skipped: 0, Time elapsed: 17.568 sec - in org.apache.hadoop.hbase.util.TestConnectionCache
Running org.apache.hadoop.hbase.util.TestDefaultEnvironmentEdge
Tests run: 4, Failures: 0, Errors: 0, Skipped: 0, Time elapsed: 49.332 sec - in org.apache.hadoop.hbase.util.TestMiniClusterLoadParallel
Tests run: 1, Failures: 0, Errors: 0, Skipped: 0, Time elapsed: 0.368 sec - in org.apache.hadoop.hbase.util.TestDefaultEnvironmentEdge
Running org.apache.hadoop.hbase.wal.TestWALFiltering
Tests run: 10, Failures: 0, Errors: 0, Skipped: 0, Time elapsed: 14.088 sec - in org.apache.hadoop.hbase.util.TestFSUtils
Running org.apache.hadoop.hbase.util.TestRegionSplitter
Running org.apache.hadoop.hbase.wal.TestDefaultWALProviderWithHLogKey
Tests run: 6, Failures: 0, Errors: 0, Skipped: 0, Time elapsed: 6.952 sec - in org.apache.hadoop.hbase.util.TestRegionSplitter
Running org.apache.hadoop.hbase.wal.TestWALReaderOnSecureWAL
Tests run: 2, Failures: 0, Errors: 0, Skipped: 0, Time elapsed: 1.858 sec - in org.apache.hadoop.hbase.wal.TestWALReaderOnSecureWAL
Tests run: 5, Failures: 0, Errors: 0, Skipped: 0, Time elapsed: 6.943 sec - in org.apache.hadoop.hbase.wal.TestDefaultWALProviderWithHLogKey
Running org.apache.hadoop.hbase.wal.TestSecureWAL
Tests run: 1, Failures: 0, Errors: 0, Skipped: 0, Time elapsed: 1.357 sec - in org.apache.hadoop.hbase.wal.TestSecureWAL
Tests run: 82, Failures: 0, Errors: 0, Skipped: 4, Time elapsed: 207.356 sec - in org.apache.hadoop.hbase.client.TestFromClientSideWithCoprocessor
Running org.apache.hadoop.hbase.wal.TestWALSplit
Tests run: 1, Failures: 0, Errors: 0, Skipped: 0, Time elapsed: 25.743 sec - in org.apache.hadoop.hbase.wal.TestWALFiltering
Running org.apache.hadoop.hbase.wal.TestWALSplitCompressed
Running org.apache.hadoop.hbase.wal.TestDefaultWALProvider
Running org.apache.hadoop.hbase.wal.TestWALFactory
Tests run: 5, Failures: 0, Errors: 0, Skipped: 0, Time elapsed: 7.046 sec - in org.apache.hadoop.hbase.wal.TestDefaultWALProvider
Running org.apache.hadoop.hbase.wal.TestBoundedRegionGroupingProvider
Tests run: 9, Failures: 0, Errors: 0, Skipped: 0, Time elapsed: 16.239 sec - in org.apache.hadoop.hbase.wal.TestWALFactory
Running org.apache.hadoop.hbase.namespace.TestZKLessNamespaceAuditor
Tests run: 5, Failures: 0, Errors: 0, Skipped: 0, Time elapsed: 20.352 sec - in org.apache.hadoop.hbase.wal.TestBoundedRegionGroupingProvider
Running org.apache.hadoop.hbase.namespace.TestNamespaceAuditor
Tests run: 12, Failures: 0, Errors: 0, Skipped: 0, Time elapsed: 96.857 sec - in org.apache.hadoop.hbase.namespace.TestZKLessNamespaceAuditor
Running org.apache.hadoop.hbase.constraint.TestConstraint
Tests run: 12, Failures: 0, Errors: 0, Skipped: 0, Time elapsed: 100.728 sec - in org.apache.hadoop.hbase.namespace.TestNamespaceAuditor
Running org.apache.hadoop.hbase.TestNamespace
Tests run: 5, Failures: 0, Errors: 0, Skipped: 0, Time elapsed: 24.482 sec - in org.apache.hadoop.hbase.constraint.TestConstraint
Running org.apache.hadoop.hbase.TestMetaMigrationConvertingToPB
Tests run: 9, Failures: 0, Errors: 0, Skipped: 1, Time elapsed: 25.509 sec - in org.apache.hadoop.hbase.TestNamespace
Tests run: 3, Failures: 0, Errors: 0, Skipped: 0, Time elapsed: 2.747 sec - in org.apache.hadoop.hbase.TestMetaMigrationConvertingToPB
Running org.apache.hadoop.hbase.TestRegionRebalancing
Tests run: 31, Failures: 0, Errors: 0, Skipped: 0, Time elapsed: 186.388 sec - in org.apache.hadoop.hbase.wal.TestWALSplitCompressed
Tests run: 31, Failures: 0, Errors: 0, Skipped: 0, Time elapsed: 193.74 sec - in org.apache.hadoop.hbase.wal.TestWALSplit
Running org.apache.hadoop.hbase.TestInfoServers
Tests run: 3, Failures: 0, Errors: 0, Skipped: 0, Time elapsed: 3.93 sec - in org.apache.hadoop.hbase.TestInfoServers
Running org.apache.hadoop.hbase.filter.TestMultiRowRangeFilter
Running org.apache.hadoop.hbase.filter.TestScanRowPrefix
Tests run: 1, Failures: 0, Errors: 0, Skipped: 0, Time elapsed: 6.603 sec - in org.apache.hadoop.hbase.filter.TestScanRowPrefix
Running org.apache.hadoop.hbase.filter.TestFilterWrapper
Tests run: 1, Failures: 0, Errors: 0, Skipped: 0, Time elapsed: 3.999 sec - in org.apache.hadoop.hbase.filter.TestFilterWrapper
Running org.apache.hadoop.hbase.filter.TestFuzzyRowFilterEndToEnd
Tests run: 19, Failures: 0, Errors: 0, Skipped: 0, Time elapsed: 22.256 sec - in org.apache.hadoop.hbase.filter.TestMultiRowRangeFilter
Tests run: 2, Failures: 0, Errors: 0, Skipped: 0, Time elapsed: 40.563 sec - in org.apache.hadoop.hbase.TestRegionRebalancing
Running org.apache.hadoop.hbase.filter.TestFuzzyRowAndColumnRangeFilter
Tests run: 1, Failures: 0, Errors: 0, Skipped: 0, Time elapsed: 3.565 sec - in org.apache.hadoop.hbase.filter.TestFuzzyRowAndColumnRangeFilter
Running org.apache.hadoop.hbase.filter.TestColumnRangeFilter
Running org.apache.hadoop.hbase.io.TestFileLink
Running org.apache.hadoop.hbase.filter.TestFilterWithScanLimits
Tests run: 1, Failures: 0, Errors: 0, Skipped: 0, Time elapsed: 4.071 sec - in org.apache.hadoop.hbase.filter.TestFilterWithScanLimits
Tests run: 1, Failures: 0, Errors: 0, Skipped: 0, Time elapsed: 8.636 sec - in org.apache.hadoop.hbase.filter.TestColumnRangeFilter
Running org.apache.hadoop.hbase.io.hfile.TestScannerSelectionUsingTTL
Running org.apache.hadoop.hbase.io.hfile.TestCacheConfig
Tests run: 6, Failures: 0, Errors: 0, Skipped: 0, Time elapsed: 2.033 sec - in org.apache.hadoop.hbase.io.hfile.TestCacheConfig
Running org.apache.hadoop.hbase.io.hfile.TestHFileSeek
Tests run: 1, Failures: 0, Errors: 0, Skipped: 0, Time elapsed: 2.295 sec - in org.apache.hadoop.hbase.io.hfile.TestHFileSeek
Tests run: 5, Failures: 0, Errors: 0, Skipped: 0, Time elapsed: 13.819 sec - in org.apache.hadoop.hbase.io.TestFileLink
Running org.apache.hadoop.hbase.io.hfile.TestForceCacheImportantBlocks
Running org.apache.hadoop.hbase.io.hfile.TestCacheOnWrite
Tests run: 2, Failures: 0, Errors: 0, Skipped: 0, Time elapsed: 43.882 sec - in org.apache.hadoop.hbase.filter.TestFuzzyRowFilterEndToEnd
Running org.apache.hadoop.hbase.io.hfile.TestHFileBlock
Tests run: 4, Failures: 0, Errors: 0, Skipped: 0, Time elapsed: 38.605 sec - in org.apache.hadoop.hbase.io.hfile.TestForceCacheImportantBlocks
Running org.apache.hadoop.hbase.io.hfile.TestHFileBlockIndex
Tests run: 6, Failures: 0, Errors: 0, Skipped: 0, Time elapsed: 63.611 sec - in org.apache.hadoop.hbase.io.hfile.TestScannerSelectionUsingTTL
Tests run: 51, Failures: 0, Errors: 0, Skipped: 1, Time elapsed: 376.317 sec - in org.apache.hadoop.hbase.util.TestHBaseFsck
Running org.apache.hadoop.hbase.io.encoding.TestLoadAndSwitchEncodeOnDisk
Running org.apache.hadoop.hbase.io.encoding.TestBufferedDataBlockEncoder
Tests run: 10, Failures: 0, Errors: 0, Skipped: 0, Time elapsed: 13.391 sec - in org.apache.hadoop.hbase.io.hfile.TestHFileBlockIndex
Running org.apache.hadoop.hbase.io.encoding.TestEncodedSeekers
Tests run: 1, Failures: 0, Errors: 0, Skipped: 0, Time elapsed: 26.618 sec - in org.apache.hadoop.hbase.io.encoding.TestBufferedDataBlockEncoder
Running org.apache.hadoop.hbase.io.encoding.TestDataBlockEncoders
Tests run: 1, Failures: 0, Errors: 0, Skipped: 0, Time elapsed: 32.996 sec - in org.apache.hadoop.hbase.io.encoding.TestLoadAndSwitchEncodeOnDisk
Running org.apache.hadoop.hbase.io.encoding.TestChangingEncoding
Tests run: 28, Failures: 0, Errors: 0, Skipped: 0, Time elapsed: 92.073 sec - in org.apache.hadoop.hbase.io.hfile.TestHFileBlock
Running org.apache.hadoop.hbase.TestClusterBootOrder
Tests run: 2, Failures: 0, Errors: 0, Skipped: 0, Time elapsed: 27.567 sec - in org.apache.hadoop.hbase.TestClusterBootOrder
Tests run: 20, Failures: 0, Errors: 0, Skipped: 0, Time elapsed: 131.85 sec - in org.apache.hadoop.hbase.io.encoding.TestEncodedSeekers

Results :




Tests run: 2221, Failures: 0, Errors: 0, Skipped: 18

[INFO] ------------------------------------------------------------------------
[INFO] Reactor Summary:
[INFO] 
[INFO] HBase ............................................. SUCCESS [1:19.923s]
[INFO] HBase - Checkstyle ................................ SUCCESS [6.929s]
[INFO] HBase - Annotations ............................... SUCCESS [0.926s]
[INFO] HBase - Protocol .................................. SUCCESS [17.802s]
[INFO] HBase - Common .................................... SUCCESS [2:55.132s]
[INFO] HBase - Procedure ................................. SUCCESS [1:51.718s]
[INFO] HBase - Client .................................... SUCCESS [1:31.152s]
[INFO] HBase - Hadoop Compatibility ...................... SUCCESS [8.828s]
[INFO] HBase - Hadoop Two Compatibility .................. SUCCESS [10.622s]
[INFO] HBase - Prefix Tree ............................... SUCCESS [9.161s]
[INFO] HBase - Server .................................... FAILURE [1:24:52.332s]
[INFO] HBase - Testing Util .............................. SKIPPED
[INFO] HBase - Thrift .................................... SKIPPED
[INFO] HBase - Rest ...................................... SKIPPED
[INFO] HBase - Shell ..................................... SKIPPED
[INFO] HBase - Integration Tests ......................... SKIPPED
[INFO] HBase - Examples .................................. SKIPPED
[INFO] HBase - Assembly .................................. SKIPPED
[INFO] HBase - Shaded .................................... SKIPPED
[INFO] HBase - Shaded - Client ........................... SKIPPED
[INFO] HBase - Shaded - Server ........................... SKIPPED
[INFO] ------------------------------------------------------------------------
[INFO] BUILD FAILURE
[INFO] ------------------------------------------------------------------------
[INFO] Total time: 1:33:46.522s
[INFO] Finished at: Tue Jul 07 02:55:57 UTC 2015
[INFO] Final Memory: 488M/654M
[INFO] ------------------------------------------------------------------------
[ERROR] Failed to execute goal org.apache.maven.plugins:maven-surefire-plugin:2.18:test (secondPartTestsExecution)
on project hbase-server: ExecutionException: java.lang.RuntimeException: The forked VM terminated
without properly saying goodbye. VM crash or System.exit called?
[ERROR] Command was /bin/sh -c cd <https://builds.apache.org/job/HBase-1.2/jdk=latest1.7,label=Hadoop/ws/hbase-server>
&& /home/jenkins/jenkins-slave/tools/hudson.model.JDK/latest1.7/jre/bin/java -enableassertions
-XX:MaxDirectMemorySize=1G -Xmx2800m -XX:MaxPermSize=256m -Djava.security.egd=file:/dev/./urandom
-Djava.net.preferIPv4Stack=true -Djava.awt.headless=true -jar <https://builds.apache.org/job/HBase-1.2/jdk=latest1.7,label=Hadoop/ws/hbase-server/target/surefire/surefirebooter6304151822965568309.jar>
<https://builds.apache.org/job/HBase-1.2/jdk=latest1.7,label=Hadoop/ws/hbase-server/target/surefire/surefire4104834242153036878tmp>
<https://builds.apache.org/job/HBase-1.2/jdk=latest1.7,label=Hadoop/ws/hbase-server/target/surefire/surefire_8255976798626122794768tmp>
[ERROR] -> [Help 1]
[ERROR] 
[ERROR] To see the full stack trace of the errors, re-run Maven with the -e switch.
[ERROR] Re-run Maven using the -X switch to enable full debug logging.
[ERROR] 
[ERROR] For more information about the errors and possible solutions, please read the following
articles:
[ERROR] [Help 1] http://cwiki.apache.org/confluence/display/MAVEN/MojoFailureException
[ERROR] 
[ERROR] After correcting the problems, you can resume the build with the command
[ERROR]   mvn <goals> -rf :hbase-server
Build step 'Invoke top-level Maven targets' marked build as failure
Performing Post build task...
Match found for :.* : True
Logical operation result is TRUE
Running script  :   ZOMBIE_TESTS_COUNT=`jps | grep surefirebooter | wc -l`
  if [[ $ZOMBIE_TESTS_COUNT != 0 ]] ; then
    #It seems sometimes the tests are not dying immediately. Let's give them 10s
    echo "Suspicious java process found - waiting 10s to see if there are just slow to stop"
    sleep 10   
    ZOMBIE_TESTS_COUNT=`jps | grep surefirebooter | wc -l`
    if [[ $ZOMBIE_TESTS_COUNT != 0 ]] ; then
      echo "There are $ZOMBIE_TESTS_COUNT zombie tests, they should have been killed by surefire
but survived"
      echo "************ BEGIN zombies jstack extract"
      ZB_STACK=`jps | grep surefirebooter | cut -d ' ' -f 1 | xargs -n 1 jstack | grep ".test"
| grep "\.java"`
      jps | grep surefirebooter | cut -d ' ' -f 1 | xargs -n 1 jstack
      echo "************ END  zombies jstack extract"
      JIRA_COMMENT="$JIRA_COMMENT

     {color:red}-1 core zombie tests{color}.  There are ${ZOMBIE_TESTS_COUNT} zombie test(s):
${ZB_STACK}"
      BAD=1
      jps | grep surefirebooter | cut -d ' ' -f 1 | xargs kill -9
    else
      echo "We're ok: there is no zombie test, but some tests took some time to stop"
    fi
  else
    echo "We're ok: there is no zombie test"
  fi
[Hadoop] $ /bin/bash -xe /tmp/hudson5130665604531381994.sh
++ jps
++ grep surefirebooter
++ wc -l
+ ZOMBIE_TESTS_COUNT=1
+ [[ 1 != 0 ]]
+ echo 'Suspicious java process found - waiting 10s to see if there are just slow to stop'
Suspicious java process found - waiting 10s to see if there are just slow to stop
+ sleep 10
++ jps
++ grep surefirebooter
++ wc -l
+ ZOMBIE_TESTS_COUNT=0
+ [[ 0 != 0 ]]
+ echo 'We'\''re ok: there is no zombie test, but some tests took some time to stop'
We're ok: there is no zombie test, but some tests took some time to stop
POST BUILD TASK : SUCCESS
END OF POST BUILD TASK : 0
Archiving artifacts
Sending artifact delta relative to HBase-1.2 » latest1.7,Hadoop #54
Archived 2075 artifacts
Archive block size is 32768
Received 38 blocks and 483197922 bytes
Compression is 0.3%
Took 3 min 31 sec

Mime
View raw message