hbase-builds mailing list archives

Site index · List index
Message view « Date » · « Thread »
Top « Date » · « Thread »
From Apache Jenkins Server <jenk...@builds.apache.org>
Subject Build failed in Jenkins: HBase-TRUNK #6647
Date Mon, 13 Jul 2015 19:21:42 GMT
See <https://builds.apache.org/job/HBase-TRUNK/6647/changes>

Changes:

[busbey] Revert "Procedure v2 - Use nonces for double submits from client (Stephen Yuan Jiang)"

[busbey] HBASE-13415 Procedure v2 - Use nonces for double submits from client (Stephen Yuan
Jiang)

[ramkrishna] HBASE-14047 - Cleanup deprecated APIs from Cell class (Ashish Singhi)

------------------------------------------
[...truncated 4315 lines...]
Tests run: 3, Failures: 0, Errors: 0, Skipped: 0, Time elapsed: 1.02 sec - in org.apache.hadoop.hbase.zookeeper.TestHQuorumPeer
Running org.apache.hadoop.hbase.zookeeper.lock.TestZKInterProcessReadWriteLock
Running org.apache.hadoop.hbase.backup.TestHFileArchiving
Running org.apache.hadoop.hbase.zookeeper.TestRecoverableZooKeeper
Tests run: 1, Failures: 0, Errors: 0, Skipped: 0, Time elapsed: 1.297 sec - in org.apache.hadoop.hbase.zookeeper.TestRecoverableZooKeeper
Running org.apache.hadoop.hbase.zookeeper.TestZKLeaderManager
Tests run: 1, Failures: 0, Errors: 0, Skipped: 0, Time elapsed: 0.12 sec - in org.apache.hadoop.hbase.zookeeper.TestZKLeaderManager
Running org.apache.hadoop.hbase.zookeeper.TestZooKeeperACL
Tests run: 6, Failures: 0, Errors: 0, Skipped: 0, Time elapsed: 0.348 sec - in org.apache.hadoop.hbase.zookeeper.TestZooKeeperACL
Tests run: 6, Failures: 0, Errors: 0, Skipped: 0, Time elapsed: 24.528 sec - in org.apache.hadoop.hbase.zookeeper.lock.TestZKInterProcessReadWriteLock
Running org.apache.hadoop.hbase.zookeeper.TestZooKeeperNodeTracker
Running org.apache.hadoop.hbase.zookeeper.TestZKMulti
Tests run: 3, Failures: 0, Errors: 0, Skipped: 0, Time elapsed: 1.41 sec - in org.apache.hadoop.hbase.zookeeper.TestZooKeeperNodeTracker
Tests run: 12, Failures: 0, Errors: 0, Skipped: 0, Time elapsed: 1.799 sec - in org.apache.hadoop.hbase.zookeeper.TestZKMulti
Running org.apache.hadoop.hbase.TestPartialResultsFromClientSide
Running org.apache.hadoop.hbase.mapreduce.TestTableInputFormatScan2
Tests run: 5, Failures: 0, Errors: 0, Skipped: 0, Time elapsed: 76.467 sec - in org.apache.hadoop.hbase.backup.TestHFileArchiving
Tests run: 13, Failures: 0, Errors: 0, Skipped: 0, Time elapsed: 64.035 sec - in org.apache.hadoop.hbase.TestPartialResultsFromClientSide
Running org.apache.hadoop.hbase.mapreduce.TestTableMapReduce
Running org.apache.hadoop.hbase.mapreduce.TestHLogRecordReader
Tests run: 2, Failures: 0, Errors: 0, Skipped: 0, Time elapsed: 1.625 sec - in org.apache.hadoop.hbase.mapreduce.TestHLogRecordReader
Running org.apache.hadoop.hbase.mapreduce.TestHashTable
Tests run: 31, Failures: 0, Errors: 0, Skipped: 0, Time elapsed: 206.852 sec - in org.apache.hadoop.hbase.wal.TestWALSplit
Tests run: 31, Failures: 0, Errors: 0, Skipped: 0, Time elapsed: 207.182 sec - in org.apache.hadoop.hbase.wal.TestWALSplitCompressed
Running org.apache.hadoop.hbase.mapreduce.TestImportExport
Running org.apache.hadoop.hbase.mapreduce.TestMultiTableSnapshotInputFormat
Tests run: 1, Failures: 0, Errors: 0, Skipped: 0, Time elapsed: 85.751 sec - in org.apache.hadoop.hbase.mapreduce.TestHashTable
Running org.apache.hadoop.hbase.mapreduce.TestWALPlayer
Tests run: 2, Failures: 0, Errors: 0, Skipped: 0, Time elapsed: 205.449 sec - in org.apache.hadoop.hbase.mapreduce.TestTableMapReduce
Tests run: 7, Failures: 0, Errors: 0, Skipped: 0, Time elapsed: 276.997 sec - in org.apache.hadoop.hbase.mapreduce.TestTableInputFormatScan2
Tests run: 4, Failures: 0, Errors: 0, Skipped: 0, Time elapsed: 61.746 sec - in org.apache.hadoop.hbase.mapreduce.TestWALPlayer
Running org.apache.hadoop.hbase.mapreduce.TestSyncTable
Running org.apache.hadoop.hbase.mapreduce.TestCopyTable
Running org.apache.hadoop.hbase.mapreduce.TestImportTSVWithOperationAttributes
Tests run: 4, Failures: 0, Errors: 0, Skipped: 0, Time elapsed: 165.863 sec - in org.apache.hadoop.hbase.mapreduce.TestMultiTableSnapshotInputFormat
Running org.apache.hadoop.hbase.mapreduce.TestRowCounter
Tests run: 1, Failures: 0, Errors: 0, Skipped: 0, Time elapsed: 109.083 sec - in org.apache.hadoop.hbase.mapreduce.TestSyncTable
Tests run: 2, Failures: 0, Errors: 0, Skipped: 0, Time elapsed: 95.568 sec - in org.apache.hadoop.hbase.mapreduce.TestImportTSVWithOperationAttributes
Running org.apache.hadoop.hbase.mapreduce.TestLoadIncrementalHFilesUseSecurityEndPoint
Running org.apache.hadoop.hbase.mapreduce.TestImportTsv
Tests run: 5, Failures: 0, Errors: 0, Skipped: 0, Time elapsed: 148.976 sec - in org.apache.hadoop.hbase.mapreduce.TestCopyTable
Running org.apache.hadoop.hbase.mapreduce.TestSecureLoadIncrementalHFiles
Tests run: 16, Failures: 0, Errors: 0, Skipped: 0, Time elapsed: 119.308 sec - in org.apache.hadoop.hbase.mapreduce.TestLoadIncrementalHFilesUseSecurityEndPoint
Tests run: 12, Failures: 0, Errors: 0, Skipped: 0, Time elapsed: 434.235 sec - in org.apache.hadoop.hbase.mapreduce.TestImportExport
Running org.apache.hadoop.hbase.mapreduce.TestTableInputFormat
Tests run: 6, Failures: 0, Errors: 0, Skipped: 0, Time elapsed: 202.257 sec - in org.apache.hadoop.hbase.mapreduce.TestRowCounter
Running org.apache.hadoop.hbase.mapreduce.TestTimeRangeMapRed
Running org.apache.hadoop.hbase.mapreduce.TestTableSnapshotInputFormat
Tests run: 16, Failures: 0, Errors: 0, Skipped: 0, Time elapsed: 117.723 sec - in org.apache.hadoop.hbase.mapreduce.TestSecureLoadIncrementalHFiles
Running org.apache.hadoop.hbase.mapreduce.TestImportTSVWithTTLs
Tests run: 1, Failures: 0, Errors: 0, Skipped: 0, Time elapsed: 60.239 sec - in org.apache.hadoop.hbase.mapreduce.TestTimeRangeMapRed
Running org.apache.hadoop.hbase.mapreduce.TestLoadIncrementalHFiles
Tests run: 8, Failures: 0, Errors: 0, Skipped: 0, Time elapsed: 93.485 sec - in org.apache.hadoop.hbase.mapreduce.TestTableInputFormat
Tests run: 1, Failures: 0, Errors: 0, Skipped: 0, Time elapsed: 48.518 sec - in org.apache.hadoop.hbase.mapreduce.TestImportTSVWithTTLs
Running org.apache.hadoop.hbase.mapreduce.TestLoadIncrementalHFilesSplitRecovery
Running org.apache.hadoop.hbase.mapreduce.TestHRegionPartitioner
Tests run: 1, Failures: 0, Errors: 0, Skipped: 0, Time elapsed: 5.539 sec - in org.apache.hadoop.hbase.mapreduce.TestHRegionPartitioner
Tests run: 5, Failures: 0, Errors: 0, Skipped: 0, Time elapsed: 43.064 sec - in org.apache.hadoop.hbase.mapreduce.TestLoadIncrementalHFilesSplitRecovery
Running org.apache.hadoop.hbase.mapreduce.TestHFileOutputFormat
Running org.apache.hadoop.hbase.mapreduce.TestImportTSVWithVisibilityLabels
Tests run: 16, Failures: 0, Errors: 0, Skipped: 0, Time elapsed: 113.398 sec - in org.apache.hadoop.hbase.mapreduce.TestLoadIncrementalHFiles
Running org.apache.hadoop.hbase.mapreduce.TestMultithreadedTableMapper
Tests run: 16, Failures: 0, Errors: 0, Skipped: 0, Time elapsed: 383.016 sec - in org.apache.hadoop.hbase.mapreduce.TestImportTsv
Running org.apache.hadoop.hbase.mapreduce.TestHFileOutputFormat2
Tests run: 7, Failures: 0, Errors: 0, Skipped: 0, Time elapsed: 314.512 sec - in org.apache.hadoop.hbase.mapreduce.TestTableSnapshotInputFormat
Tests run: 1, Failures: 0, Errors: 0, Skipped: 0, Time elapsed: 112.777 sec - in org.apache.hadoop.hbase.mapreduce.TestMultithreadedTableMapper
Running org.apache.hadoop.hbase.mapreduce.TestTableInputFormatScan1
Running org.apache.hadoop.hbase.mapreduce.TestCellCounter
Tests run: 5, Failures: 0, Errors: 0, Skipped: 0, Time elapsed: 217.522 sec - in org.apache.hadoop.hbase.mapreduce.TestImportTSVWithVisibilityLabels
Running org.apache.hadoop.hbase.mapreduce.TestWALRecordReader
Tests run: 2, Failures: 0, Errors: 0, Skipped: 0, Time elapsed: 2.252 sec - in org.apache.hadoop.hbase.mapreduce.TestWALRecordReader
Running org.apache.hadoop.hbase.mapreduce.TestMultiTableInputFormat
Tests run: 7, Failures: 0, Errors: 0, Skipped: 0, Time elapsed: 213.718 sec - in org.apache.hadoop.hbase.mapreduce.TestCellCounter
Running org.apache.hadoop.hbase.mapreduce.TestSecureLoadIncrementalHFilesSplitRecovery
Tests run: 7, Failures: 0, Errors: 0, Skipped: 0, Time elapsed: 259.946 sec - in org.apache.hadoop.hbase.mapreduce.TestTableInputFormatScan1
Tests run: 4, Failures: 0, Errors: 0, Skipped: 0, Time elapsed: 192.61 sec - in org.apache.hadoop.hbase.mapreduce.TestMultiTableInputFormat
Tests run: 5, Failures: 0, Errors: 0, Skipped: 0, Time elapsed: 32.209 sec - in org.apache.hadoop.hbase.mapreduce.TestSecureLoadIncrementalHFilesSplitRecovery
Running org.apache.hadoop.hbase.filter.TestMultiRowRangeFilter
Running org.apache.hadoop.hbase.filter.TestScanRowPrefix
Tests run: 13, Failures: 0, Errors: 0, Skipped: 1, Time elapsed: 487.1 sec - in org.apache.hadoop.hbase.mapreduce.TestHFileOutputFormat
Tests run: 1, Failures: 0, Errors: 0, Skipped: 0, Time elapsed: 7.432 sec - in org.apache.hadoop.hbase.filter.TestScanRowPrefix
Running org.apache.hadoop.hbase.filter.TestFilterWithScanLimits
Tests run: 19, Failures: 0, Errors: 0, Skipped: 0, Time elapsed: 23.055 sec - in org.apache.hadoop.hbase.filter.TestMultiRowRangeFilter
Running org.apache.hadoop.hbase.filter.TestFuzzyRowAndColumnRangeFilter
Tests run: 1, Failures: 0, Errors: 0, Skipped: 0, Time elapsed: 4.47 sec - in org.apache.hadoop.hbase.filter.TestFuzzyRowAndColumnRangeFilter
Running org.apache.hadoop.hbase.filter.TestColumnRangeFilter
Running org.apache.hadoop.hbase.filter.TestFilterWrapper
Tests run: 1, Failures: 0, Errors: 0, Skipped: 0, Time elapsed: 6.219 sec - in org.apache.hadoop.hbase.filter.TestFilterWrapper
Tests run: 1, Failures: 0, Errors: 0, Skipped: 0, Time elapsed: 13.866 sec - in org.apache.hadoop.hbase.filter.TestColumnRangeFilter
Running org.apache.hadoop.hbase.filter.TestFuzzyRowFilterEndToEnd
Running org.apache.hadoop.hbase.TestMetaTableAccessor
Tests run: 1, Failures: 0, Errors: 0, Skipped: 0, Time elapsed: 52.097 sec - in org.apache.hadoop.hbase.filter.TestFilterWithScanLimits
Tests run: 14, Failures: 0, Errors: 0, Skipped: 0, Time elapsed: 19.291 sec - in org.apache.hadoop.hbase.TestMetaTableAccessor
Tests run: 2, Failures: 0, Errors: 0, Skipped: 0, Time elapsed: 83.584 sec - in org.apache.hadoop.hbase.filter.TestFuzzyRowFilterEndToEnd
Tests run: 14, Failures: 0, Errors: 0, Skipped: 1, Time elapsed: 722.904 sec - in org.apache.hadoop.hbase.mapreduce.TestHFileOutputFormat2

Results :

Failed tests: 
  TestFastFail.testFastFail:271 There should be atleast one thread that retried instead of
failing



Tests run: 2524, Failures: 1, Errors: 0, Skipped: 19

[INFO] ------------------------------------------------------------------------
[INFO] Reactor Summary:
[INFO] 
[INFO] HBase ............................................. SUCCESS [  2.855 s]
[INFO] HBase - Checkstyle ................................ SUCCESS [  0.636 s]
[INFO] HBase - Annotations ............................... SUCCESS [  0.181 s]
[INFO] HBase - Protocol .................................. SUCCESS [  2.669 s]
[INFO] HBase - Common .................................... SUCCESS [03:27 min]
[INFO] HBase - Procedure ................................. SUCCESS [02:07 min]
[INFO] HBase - Client .................................... SUCCESS [02:06 min]
[INFO] HBase - Hadoop Compatibility ...................... SUCCESS [ 14.510 s]
[INFO] HBase - Hadoop Two Compatibility .................. SUCCESS [ 17.292 s]
[INFO] HBase - Prefix Tree ............................... SUCCESS [ 21.343 s]
[INFO] HBase - Server .................................... FAILURE [  01:56 h]
[INFO] HBase - Testing Util .............................. SKIPPED
[INFO] HBase - Thrift .................................... SKIPPED
[INFO] HBase - Shell ..................................... SKIPPED
[INFO] HBase - Integration Tests ......................... SKIPPED
[INFO] HBase - Examples .................................. SKIPPED
[INFO] HBase - Rest ...................................... SKIPPED
[INFO] HBase - Assembly .................................. SKIPPED
[INFO] HBase - Shaded .................................... SKIPPED
[INFO] HBase - Shaded - Client ........................... SKIPPED
[INFO] HBase - Shaded - Server ........................... SKIPPED
[INFO] ------------------------------------------------------------------------
[INFO] BUILD FAILURE
[INFO] ------------------------------------------------------------------------
[INFO] Total time: 02:04 h
[INFO] Finished at: 2015-07-13T19:19:03+00:00
[INFO] Final Memory: 62M/645M
[INFO] ------------------------------------------------------------------------
[ERROR] Failed to execute goal org.apache.maven.plugins:maven-surefire-plugin:2.18:test (secondPartTestsExecution)
on project hbase-server: There are test failures.
[ERROR] 
[ERROR] Please refer to <https://builds.apache.org/job/HBase-TRUNK/ws/hbase-server/target/surefire-reports>
for the individual test results.
[ERROR] -> [Help 1]
[ERROR] 
[ERROR] To see the full stack trace of the errors, re-run Maven with the -e switch.
[ERROR] Re-run Maven using the -X switch to enable full debug logging.
[ERROR] 
[ERROR] For more information about the errors and possible solutions, please read the following
articles:
[ERROR] [Help 1] http://cwiki.apache.org/confluence/display/MAVEN/MojoFailureException
[ERROR] 
[ERROR] After correcting the problems, you can resume the build with the command
[ERROR]   mvn <goals> -rf :hbase-server
Build step 'Invoke top-level Maven targets' marked build as failure
Performing Post build task...
Match found for :.* : True
Logical operation result is TRUE
Running script  :   ZOMBIE_TESTS_COUNT=`jps | grep surefirebooter | wc -l`
  if [[ $ZOMBIE_TESTS_COUNT != 0 ]] ; then
    #It seems sometimes the tests are not dying immediately. Let's give them 10s
    echo "Suspicious java process found - waiting 10s to see if there are just slow to stop"
    sleep 10   
    ZOMBIE_TESTS_COUNT=`jps | grep surefirebooter | wc -l`
    if [[ $ZOMBIE_TESTS_COUNT != 0 ]] ; then
      echo "There are $ZOMBIE_TESTS_COUNT zombie tests, they should have been killed by surefire
but survived"
      echo "************ BEGIN zombies jstack extract"
      ZB_STACK=`jps | grep surefirebooter | cut -d ' ' -f 1 | xargs -n 1 jstack | grep ".test"
| grep "\.java"`
      jps | grep surefirebooter | cut -d ' ' -f 1 | xargs -n 1 jstack
      echo "************ END  zombies jstack extract"
      JIRA_COMMENT="$JIRA_COMMENT

     {color:red}-1 core zombie tests{color}.  There are ${ZOMBIE_TESTS_COUNT} zombie test(s):
${ZB_STACK}"
      BAD=1
      jps | grep surefirebooter | cut -d ' ' -f 1 | xargs kill -9
    else
      echo "We're ok: there is no zombie test, but some tests took some time to stop"
    fi
  else
    echo "We're ok: there is no zombie test"
  fi
[HBase-TRUNK] $ /bin/bash -xe /tmp/hudson8957106498519740689.sh
++ jps
++ grep surefirebooter
++ wc -l
+ ZOMBIE_TESTS_COUNT=0
+ [[ 0 != 0 ]]
+ echo 'We'\''re ok: there is no zombie test'
We're ok: there is no zombie test
POST BUILD TASK : SUCCESS
END OF POST BUILD TASK : 0
Archiving artifacts
Sending artifact delta relative to HBase-TRUNK #6642
Archived 2238 artifacts
Archive block size is 32768
Received 97 blocks and 443563519 bytes
Compression is 0.7%
Took 2 min 19 sec
Recording test results
[FINDBUGS] Collecting findbugs analysis files...
[FINDBUGS] Finding all files that match the pattern **/findbugs.xml,**/findbugsXml.xml
[FINDBUGS] Parsing 24 files in <https://builds.apache.org/job/HBase-TRUNK/ws/>
[FINDBUGS] Successfully parsed file <https://builds.apache.org/job/HBase-TRUNK/6647/artifact/hbase-annotations/target/findbugs.xml>
of module  with 0 warnings.
[FINDBUGS] Successfully parsed file <https://builds.apache.org/job/HBase-TRUNK/6647/artifact/hbase-annotations/target/findbugsXml.xml>
of module  with 0 warnings.
[FINDBUGS] Successfully parsed file <https://builds.apache.org/job/HBase-TRUNK/6647/artifact/hbase-client/target/findbugs.xml>
of module  with 0 warnings.
[FINDBUGS] Successfully parsed file <https://builds.apache.org/job/HBase-TRUNK/6647/artifact/hbase-client/target/findbugsXml.xml>
of module  with 10 warnings.
[FINDBUGS] Successfully parsed file <https://builds.apache.org/job/HBase-TRUNK/6647/artifact/hbase-common/target/findbugs.xml>
of module  with 0 warnings.
[FINDBUGS] Successfully parsed file <https://builds.apache.org/job/HBase-TRUNK/6647/artifact/hbase-common/target/findbugsXml.xml>
of module  with 4 warnings.
[FINDBUGS] Successfully parsed file <https://builds.apache.org/job/HBase-TRUNK/6647/artifact/hbase-examples/target/findbugs.xml>
of module  with 0 warnings.
[FINDBUGS] Successfully parsed file <https://builds.apache.org/job/HBase-TRUNK/6647/artifact/hbase-examples/target/findbugsXml.xml>
of module  with 0 warnings.
[FINDBUGS] Successfully parsed file <https://builds.apache.org/job/HBase-TRUNK/6647/artifact/hbase-hadoop-compat/target/findbugs.xml>
of module  with 0 warnings.
[FINDBUGS] Successfully parsed file <https://builds.apache.org/job/HBase-TRUNK/6647/artifact/hbase-hadoop-compat/target/findbugsXml.xml>
of module  with 0 warnings.
[FINDBUGS] Successfully parsed file <https://builds.apache.org/job/HBase-TRUNK/6647/artifact/hbase-hadoop2-compat/target/findbugs.xml>
of module  with 0 warnings.
[FINDBUGS] Successfully parsed file <https://builds.apache.org/job/HBase-TRUNK/6647/artifact/hbase-hadoop2-compat/target/findbugsXml.xml>
of module  with 0 warnings.
[FINDBUGS] Successfully parsed file <https://builds.apache.org/job/HBase-TRUNK/6647/artifact/hbase-prefix-tree/target/findbugs.xml>
of module  with 0 warnings.
[FINDBUGS] Successfully parsed file <https://builds.apache.org/job/HBase-TRUNK/6647/artifact/hbase-prefix-tree/target/findbugsXml.xml>
of module  with 0 warnings.
[FINDBUGS] Successfully parsed file <https://builds.apache.org/job/HBase-TRUNK/6647/artifact/hbase-procedure/target/findbugs.xml>
of module  with 0 warnings.
[FINDBUGS] Successfully parsed file <https://builds.apache.org/job/HBase-TRUNK/6647/artifact/hbase-procedure/target/findbugsXml.xml>
of module  with 1 warnings.
[FINDBUGS] Successfully parsed file <https://builds.apache.org/job/HBase-TRUNK/6647/artifact/hbase-protocol/target/findbugs.xml>
of module  with 0 warnings.
[FINDBUGS] Successfully parsed file <https://builds.apache.org/job/HBase-TRUNK/6647/artifact/hbase-protocol/target/findbugsXml.xml>
of module  with 0 warnings.
[FINDBUGS] Successfully parsed file <https://builds.apache.org/job/HBase-TRUNK/6647/artifact/hbase-rest/target/findbugs.xml>
of module  with 0 warnings.
[FINDBUGS] Successfully parsed file <https://builds.apache.org/job/HBase-TRUNK/6647/artifact/hbase-rest/target/findbugsXml.xml>
of module  with 2 warnings.
[FINDBUGS] Successfully parsed file <https://builds.apache.org/job/HBase-TRUNK/6647/artifact/hbase-server/target/findbugs.xml>
of module  with 0 warnings.
[FINDBUGS] Successfully parsed file <https://builds.apache.org/job/HBase-TRUNK/6647/artifact/hbase-server/target/findbugsXml.xml>
of module  with 76 warnings.
[FINDBUGS] Successfully parsed file <https://builds.apache.org/job/HBase-TRUNK/6647/artifact/hbase-thrift/target/findbugs.xml>
of module  with 0 warnings.
[FINDBUGS] Successfully parsed file <https://builds.apache.org/job/HBase-TRUNK/6647/artifact/hbase-thrift/target/findbugsXml.xml>
of module  with 0 warnings.
[FINDBUGS] Computing warning deltas based on reference build #6642
[CHECKSTYLE] Collecting checkstyle analysis files...
[CHECKSTYLE] Finding all files that match the pattern **/checkstyle-result.xml
[CHECKSTYLE] Parsing 21 files in <https://builds.apache.org/job/HBase-TRUNK/ws/>
[CHECKSTYLE] Successfully parsed file <https://builds.apache.org/job/HBase-TRUNK/6647/artifact/hbase-annotations/target/checkstyle-result.xml>
of module  with 0 warnings.
[CHECKSTYLE] Successfully parsed file <https://builds.apache.org/job/HBase-TRUNK/6647/artifact/hbase-assembly/target/checkstyle-result.xml>
of module  with 0 warnings.
[CHECKSTYLE] Successfully parsed file <https://builds.apache.org/job/HBase-TRUNK/6647/artifact/hbase-checkstyle/target/checkstyle-result.xml>
of module  with 0 warnings.
[CHECKSTYLE] Successfully parsed file <https://builds.apache.org/job/HBase-TRUNK/6647/artifact/hbase-client/target/checkstyle-result.xml>
of module  with 208 warnings.
[CHECKSTYLE] Successfully parsed file <https://builds.apache.org/job/HBase-TRUNK/6647/artifact/hbase-common/target/checkstyle-result.xml>
of module  with 107 warnings.
[CHECKSTYLE] Successfully parsed file <https://builds.apache.org/job/HBase-TRUNK/6647/artifact/hbase-examples/target/checkstyle-result.xml>
of module  with 28 warnings.
[CHECKSTYLE] Successfully parsed file <https://builds.apache.org/job/HBase-TRUNK/6647/artifact/hbase-hadoop-compat/target/checkstyle-result.xml>
of module  with 2 warnings.
[CHECKSTYLE] Successfully parsed file <https://builds.apache.org/job/HBase-TRUNK/6647/artifact/hbase-hadoop2-compat/target/checkstyle-result.xml>
of module  with 47 warnings.
[CHECKSTYLE] Successfully parsed file <https://builds.apache.org/job/HBase-TRUNK/6647/artifact/hbase-it/target/checkstyle-result.xml>
of module  with 0 warnings.
[CHECKSTYLE] Successfully parsed file <https://builds.apache.org/job/HBase-TRUNK/6647/artifact/hbase-prefix-tree/target/checkstyle-result.xml>
of module  with 18 warnings.
[CHECKSTYLE] Successfully parsed file <https://builds.apache.org/job/HBase-TRUNK/6647/artifact/hbase-procedure/target/checkstyle-result.xml>
of module  with 0 warnings.
[CHECKSTYLE] Successfully parsed file <https://builds.apache.org/job/HBase-TRUNK/6647/artifact/hbase-protocol/target/checkstyle-result.xml>
of module  with 2 warnings.
[CHECKSTYLE] Successfully parsed file <https://builds.apache.org/job/HBase-TRUNK/6647/artifact/hbase-rest/target/checkstyle-result.xml>
of module  with 42 warnings.
[CHECKSTYLE] Successfully parsed file <https://builds.apache.org/job/HBase-TRUNK/6647/artifact/hbase-server/target/checkstyle-result.xml>
of module  with 1391 warnings.
[CHECKSTYLE] Successfully parsed file <https://builds.apache.org/job/HBase-TRUNK/6647/artifact/hbase-shaded/hbase-shaded-client/target/checkstyle-result.xml>
of module  with 0 warnings.
[CHECKSTYLE] Successfully parsed file <https://builds.apache.org/job/HBase-TRUNK/6647/artifact/hbase-shaded/hbase-shaded-server/target/checkstyle-result.xml>
of module  with 0 warnings.
[CHECKSTYLE] Successfully parsed file <https://builds.apache.org/job/HBase-TRUNK/6647/artifact/hbase-shaded/target/checkstyle-result.xml>
of module  with 0 warnings.
[CHECKSTYLE] Successfully parsed file <https://builds.apache.org/job/HBase-TRUNK/6647/artifact/hbase-shell/target/checkstyle-result.xml>
of module  with 0 warnings.
[CHECKSTYLE] Successfully parsed file <https://builds.apache.org/job/HBase-TRUNK/6647/artifact/hbase-testing-util/target/checkstyle-result.xml>
of module  with 0 warnings.
[CHECKSTYLE] Successfully parsed file <https://builds.apache.org/job/HBase-TRUNK/6647/artifact/hbase-thrift/target/checkstyle-result.xml>
of module  with 27 warnings.
[CHECKSTYLE] Successfully parsed file <https://builds.apache.org/job/HBase-TRUNK/6647/artifact/target/checkstyle-result.xml>
of module  with 0 warnings.
[CHECKSTYLE] Computing warning deltas based on reference build #6642
Updating HBASE-14047
Updating HBASE-13415

Mime
View raw message